{"text_format":"2","workbook":"xlsx","n_sheets":12,"sheets":["ORÇAMENTO","BDI","COMPOSIÇÕES UNITARIAS","Levantamento Planialtimetrico","Poligonal","VEÍCULO","PO-I","Encargos Dnit","Enc Sociais","SICRO","DNIT","TC-DNIT"],"not_rendered":{"charts":0,"images":2,"macros":0,"external_links":0,"defined_names":748,"comments":0,"pivot_tables":0},"unopened":[],"bounds":{"document_bytes":16777216,"sheet_cells":100000,"run_cost":"one","rows_first":2000,"rows_last":500,"rows_between":2000,"halvings":0,"cell_chars":16384,"cell_head_chars":4096},"cells_cut":0,"cells_raw":0,"read":"whole","date_system":"1900"}

{"sheet":"ORÇAMENTO","index":0,"n_rows":23,"n_cols":12,"rows_kept":23,"cut":false,"hidden":false,"merged":[[17,1,17,5],[18,1,18,6],[22,1,22,6],[1,1,4,6],[5,1,6,6],[7,1,8,6],[9,1,10,6]]}
[]
[]
[]
[]
[]
[null,"ANEXO I - PLANILHA ORÇAMENTÁRIA_NÃO DESONERADA"]
[]
[null,"SERVIÇO: REALIZAÇÃO DE LEVANTAMENTOS TOPOGRÁFICOS PARA APOIO À FISCALIZAÇÃO CODEVASF."]
[]
[null,"LOCAL: DIVERSOS MUNICÍPIOS INSERIDOS DE ATUAÇÃO DA 15ª SUPERINTENDÊNCIA REGIONAL DA CODEVASF."]
[]
[]
[null,"Item","Descrição dos Serviços","Unidade","Quant.","Valor Unitário","Valor Total"]
[null,1,"Administração local","mês",12,{"$f":"'COMPOSIÇÕES UNITARIAS'!H18","v":20407.93},{"$f":"E14*F14","v":244895.16}]
[null,2,"Equipe para cadastro de obras (As Built)","mês",12,{"$f":"'COMPOSIÇÕES UNITARIAS'!H34","v":2405.6799999999998},28868.16,{"$nulls":4},{"$f":"E16/1700","v":1058.8235294117601}]
[null,3,"Levantamento de volumes de cortes e aterros, extraídos de levantamento planialtimétrico (por área), incluindo apresentação de pranchas com as seções transversais de corte e aterro, bem como planilha com a memória de cálculo dos volumes.","m²",1800000,{"$f":"'Levantamento Planialtimetrico'!H37","v":0.39},702000,null,{"$f":"E16/2","v":900000},{"$f":"3600","v":3600},null,{"$f":"E16*10%","v":180000}]
[null,4,"Levantamento topográfico planialtimétrico cadastral, incluso eixos, seções transversais, longitudinais, calculo de volumes de terraplenagem e desenhos","m²",1800000,{"$f":"Poligonal!H43","v":0.23},414000]
[null,"TOTAL GERAL R$",{"$nulls":4},{"$f":"SUM(G14:G17)","v":1389763.32},null,null,{"$f":"J16*#REF!","v":{"$error":"#REF!"}}]
[null,"Base para orçamento: Tabela de Engenharia Consultiva  DNIT JUL/2023",{"$nulls":7},{"$f":"G18/12","v":115813.61}]
[]
{"$rows_left_out":4}
{"sheet":"BDI","index":1,"n_rows":33,"n_cols":6,"rows_kept":33,"cut":false,"hidden":false,"merged":[[1,2,1,5],[3,2,3,5]]}
[]
[null,null,"REALIZAÇÃO DE LEVANTAMENTOS TOPOGRÁFICOS PARA APOIO À FISCALIZAÇÃO CODEVASF EM OBRAS DE DIVERSOS MUNICIPIOS DE PERNAMBUCO, NA ÁREA DE ATUAÇÃO DA 15ª SUPERINTENDÊNCIA REGIONAL DA CODEVASF."]
[]
[null,null,"DETALHAMENTO DO BDI NÃO DESONERADO"]
[]
[null,null,"Item","Descrição dos serviços","Preço de Venda (%)","Custo Direto (%)"]
[]
[null,null,1,"Administração Central (A)",null,5.5E-2]
[]
[null,null,2,"Impostos e Taxas (I)",{"$f":"SUM(E11:E14)","v":6.6500000000000004E-2}]
[null,null,"2.1","ISS",0.03]
[null,null,"2.2","PIS",6.4999999999999997E-3]
[null,null,"2.3","Cofins",0.03]
[null,null,"2.4","CPRB",0]
[null,null,"3","Risco, seguro e garantia (R) ",null,{"$f":"SUM(F16:F17)","v":1.4E-2}]
[null,null,"3.1","Risco",null,0.01]
[null,null,"3.2","Seguro + Garantia",null,4.0000000000000001E-3]
[]
[null,null,4,"Despesas Financeiras (DF)",null,8.5000000000000006E-3]
[]
{"$rows_left_out":14}
{"sheet":"COMPOSIÇÕES UNITARIAS","index":2,"n_rows":34,"n_cols":11,"rows_kept":34,"cut":false,"hidden":false,"merged":[[23,4,23,7],[24,1,24,5],[7,6,7,7],[8,6,8,7],[11,6,11,7],[12,6,12,7],[1,1,4,7],[19,1,22,7],[29,1,29,6],[26,6,26,7],[27,6,27,7],[28,6,28,7],[5,1,5,5],[5,6,5,7],[9,6,9,7],[10,6,10,7],[6,1,6,5],[13,1,13,6],[14,1,14,6],[15,4,15,6],[16,1,16,6],[17,1,17,6],[31,4,31,6],[32,1,32,6],[33,1,33,6],[24,6,24,7],[25,1,25,5],[30,1,30,6]]}
[]
[]
[]
[]
[]
[null,"OBRA: APOIO A FISCALIZAÇÃO DE OBRAS DA 15ª SUPERINTENDÊNCIA REGIONAL",{"$nulls":4},"2023-09-01"]
[null,"SERVIÇO : Administração Local",{"$nulls":4},"UNIDADE:","unid."]
[null,"DISCRIMINAÇÃO","FONTE","UNID","QUANT.","CUSTO UNITÁRIO","TOTAL"]
["B8951",{"$f":"VLOOKUP(A9,'TC-DNIT'!B:F,2,0)","v":"Imóvel Comercial (2,60% do CMCC - SINAPI)"},"DNIT - B8951",{"$f":"VLOOKUP(A9,'TC-DNIT'!B:F,4,0)","v":"l"},{"$f":"6*10*12","v":720},{"$f":"VLOOKUP(A9,'TC-DNIT'!B:F,5,0)","v":47.3},{"$f":"TRUNC(E9*F9,2)","v":34056}]
["B8953",{"$f":"VLOOKUP(A10,'TC-DNIT'!B:F,2,0)","v":"Mobiliário Escritório"},"DNIT - B8953",{"$f":"VLOOKUP(A10,'TC-DNIT'!B:F,4,0)","v":"ocupante x mês"},{"$f":"10*12","v":120},{"$f":"VLOOKUP(A10,'TC-DNIT'!B:F,5,0)","v":502.59},60310.8]
["B8959",{"$f":"VLOOKUP(A11,'TC-DNIT'!B:F,2,0)","v":"Custos Diversos Escritório"},"DNIT - B8959",{"$f":"VLOOKUP(A11,'TC-DNIT'!B:F,4,0)","v":"ocupante x mês"},{"$f":"10*12","v":120},{"$f":"VLOOKUP(A11,'TC-DNIT'!B:F,5,0)","v":132.91999999999999},15950.4]
["B8958",{"$f":"VLOOKUP(A12,'TC-DNIT'!B:F,2,0)","v":"Topografia"},"DNIT - B8958",{"$f":"VLOOKUP(A12,'TC-DNIT'!B:F,4,0)","v":"mês"},12,{"$f":"VLOOKUP(A12,'TC-DNIT'!B:F,5,0)","v":3163.12},37957.440000000002]
["B8957",{"$f":"VLOOKUP(A13,'TC-DNIT'!B:F,2,0)","v":"Laboratório de solos"},"DNIT - B8957",{"$f":"VLOOKUP(A13,'TC-DNIT'!B:F,4,0)","v":"mês"},12,{"$f":"VLOOKUP(A13,'TC-DNIT'!B:F,5,0)","v":4235.59},50827.08]
[null,"SUB-TOTAL",{"$nulls":5},{"$f":"SUM(G9:H13)","v":199101.72}]
[null,"TOTAL - R$",{"$nulls":5},{"$f":"H14","v":199101.72}]
[null,"BDI",null,{"$f":"BDI!F27","v":0.23},null,null,null,{"$f":"H15*D16","v":45793.4}]
[null,"TOTAL DO SERVIÇO PARA 12 MESES - R$",{"$nulls":5},{"$f":"H16+H15","v":244895.12}]
[null,"TOTAL DO SERVIÇO MENSAL - R$",{"$nulls":5},{"$f":"H17/12","v":20407.93}]
[]
[]
{"$rows_left_out":15}
{"sheet":"Levantamento Planialtimetrico","index":3,"n_rows":42,"n_cols":15,"rows_kept":42,"cut":false,"hidden":false,"merged":[[1,1,1,7],[2,1,2,7],[3,1,3,7],[5,1,5,7],[10,1,10,6],[11,1,11,6],[12,1,12,7],[15,1,15,6],[16,1,16,7],[20,1,20,6],[21,1,21,6],[22,1,22,6],[23,1,23,7],[26,1,26,6],[27,1,27,6],[33,1,33,6],[34,1,34,5],[34,6,34,7],[36,1,36,5],[28,1,28,6],[29,1,29,6],[30,3,30,5],[31,1,31,6],[32,1,32,6]]}
[]
[]
[null,"SERVIÇO: Levantamento planialtimétrico de terreno "]
[null,"COMPOSIÇÃO DE PREÇOS - UNIDADE: M²"]
[{"$nulls":6},"Data:","Setembro/2023"]
[null,"MÃO DE OBRA."]
[null,1,"CODIGO","DESCRIÇÃO DOS INSUMOS","UNID.","QUANT.","CUSTOS UNITÁRIO (R$).","CUSTO TOTAL (R$).",null,null,null,"4 aguadas/dia","1aguada = 3.000 m²",null,"(40m x 50m)"]
["P8061","1.1","P9812",{"$f":"VLOOKUP(C8,SICRO!A:G,2,0)","v":"Engenheiro"},{"$f":"VLOOKUP(D8,SICRO!B:H,2,0)","v":"mês"},{"$f":"0.15","v":0.15},{"$f":"VLOOKUP(C8,SICRO!A:G,6,0)","v":23408.33},{"$f":"ROUND(F8*G8,2)","v":3511.25},{"$nulls":4},"faixa de acesso de 4 x 20m"]
["P9949","1.2","P9949",{"$f":"VLOOKUP(C9,SICRO!A:G,2,0)","v":"Topógrafo"},{"$f":"VLOOKUP(C9,SICRO!A:G,3,0)","v":"mês"},1,{"$f":"VLOOKUP(C9,SICRO!A:G,6,0)","v":8060.98},{"$f":"ROUND(F9*G9,2)","v":8060.98},{"$nulls":4},"total/aguada",{"$f":"2000+(4*20)","v":2080}]
["P9950","1.3","P9950",{"$f":"VLOOKUP(C10,SICRO!A:G,2,0)","v":"Auxiliar de topografia"},{"$f":"VLOOKUP(C10,SICRO!A:G,3,0)","v":"mês"},2,{"$f":"VLOOKUP(C10,SICRO!A:G,6,0)","v":5402.95},{"$f":"ROUND(F10*G10,2)","v":10805.9},null,null,{"$f":"SUM(F8:F10)","v":3.15}]
[{"$nulls":10},12]
[null,"Total do Item 1:",{"$nulls":5},{"$f":"SUM(H8:H10)","v":22378.13},null,null,{"$f":"K10*K11","v":37.799999999999997}]
[null,"LOCAÇÃO DE VEICULOS."]
[null,2,"CODIGO","DESCRIÇÃO DOS INSUMOS","UNID.","QUANT.","CUSTOS UNITÁRIO (R$).","CUSTO TOTAL (R$)."]
[null,"2.1","E8891",{"$f":"VLOOKUP(C15,'TC-DNIT'!B:F,2,0)","v":"Veículo leve picape 4x4 - 147 kW (sem motorista)"},"mês",1,{"$f":"VEÍCULO!$D$6","v":8625.32},{"$f":"ROUND(F15*G15,2)","v":8625.32},null,null,null,1,176]
[null,"Total do Item 2:",{"$nulls":5},{"$f":"SUM(H15)","v":8625.32},null,null,null,"x",8.8000000000000007,{"$f":"M15/20","v":8.8000000000000007}]
[null,"EQUIPAMENTOS TOPOGRAFICOS - computados na Adm Local",{"$nulls":10},{"$f":"M16/M15","v":0.05}]
[null,3,null,"DESCRIÇÃO DOS INSUMOS","UNID.","QUANT.","CUSTOS UNITÁRIO (R$).","CUSTO TOTAL (R$)."]
[]
[]
{"$rows_left_out":23}
{"sheet":"Poligonal","index":4,"n_rows":46,"n_cols":12,"rows_kept":46,"cut":false,"hidden":false,"merged":[[2,2,2,7],[3,2,3,7],[9,1,9,7],[10,1,10,7],[11,1,11,7],[13,1,13,7],[20,1,20,6],[21,1,21,6],[22,1,22,7],[25,1,25,6],[26,1,26,7],[30,1,30,6],[31,1,31,7],[40,1,40,5],[42,1,42,5],[34,1,34,6],[35,5,35,6],[36,3,36,5],[37,1,37,6],[38,1,38,6]]}
[]
[]
[]
[]
[]
[]
[{"$nulls":10},{"$f":"J16*176","v":0}]
[]
[]
[]
[null,"LEVANTAMENTO PLANIALTIMÉTRICO CADASTRAL"]
[null,"SERVIÇO: Levantamento topográfico planialtimétrico cadastral, incluso eixos, seções transversais, longitudinais, calculo de volumes de terraplenagem e desenhos    - UNIDADE: M²"]
[{"$nulls":6},"Data:"]
[null,"MÃO DE OBRA."]
[null,1,"CODIGO","DESCRIÇÃO DOS INSUMOS","UNID.","QUANT.","CUSTOS UNITÁRIO (R$).","CUSTO TOTAL (R$)."]
[null,"1.1","P9812",{"$f":"VLOOKUP(C16,SICRO!A:G,2,0)","v":"Engenheiro"},{"$f":"VLOOKUP(C16,SICRO!A:G,3,0)","v":"mês"},0.15,{"$f":"VLOOKUP(C16,SICRO!A:G,4,0)","v":12819.95},{"$f":"F16*G16","v":1922.99}]
[null,"1.2","P9949",{"$f":"VLOOKUP(C17,SICRO!A:G,2,0)","v":"Topógrafo"},{"$f":"VLOOKUP(C17,SICRO!A:G,3,0)","v":"mês"},1,{"$f":"VLOOKUP(C17,SICRO!A:G,4,0)","v":4037},{"$f":"F17*G17","v":4037}]
[null,"1.3","P9950",{"$f":"VLOOKUP(C18,SICRO!A:G,2,0)","v":"Auxiliar de topografia"},{"$f":"VLOOKUP(C18,SICRO!A:G,3,0)","v":"mês"},2,{"$f":"VLOOKUP(C18,SICRO!A:G,4,0)","v":2378.34},{"$f":"F18*G18","v":4756.68}]
[null,"1.4","P8038",{"$f":"VLOOKUP(C19,DNIT!A:Y,2,0)","v":"Chefe de escritório"},{"$f":"VLOOKUP(D19,DNIT!B:Z,2,0)","v":"mês"},0.2,{"$f":"VLOOKUP(C19,DNIT!A:Y,25,0)","v":7072.59},{"$f":"F19*G19","v":1414.52}]
[null,"1.5","P9848",{"$f":"VLOOKUP(C20,SICRO!A:G,2,0)","v":"Desenhista"},{"$f":"VLOOKUP(C20,SICRO!A:G,3,0)","v":"mês"},0.25,{"$f":"VLOOKUP(C20,SICRO!A:G,4,0)","v":3000.84},{"$f":"F20*G20","v":750.21}]
{"$rows_left_out":27}
{"sheet":"VEÍCULO","index":5,"n_rows":9,"n_cols":4,"rows_kept":9,"cut":false,"hidden":false,"merged":[[0,0,0,3],[8,0,8,3]]}
["CUSTO MENSAL DE E8891 VEÍCULO LEVE picape 4x4 - 147 kW (sem motorista)"]
[]
[null,"h","R$/h","Total"]
["Horas Operativas",66,{"$f":"'TC-DNIT'!E7","v":80.19},{"$f":"B4*C4","v":5292.54}]
["Horas Improdutivas",116.49,{"$f":"'TC-DNIT'!F7","v":28.61},{"$f":"B5*C5","v":3332.78}]
["Horas globais/mês trabalháveis (*)",{"$f":"B4+B5","v":182.49},null,{"$f":"ROUND(D4+D5,2)","v":8625.32}]
[]
[]
["(*) Fonte: Manual de Custos de Infraestrutura de Transportes - Volume 01, pág. 53"]

{"sheet":"PO-I","index":6,"n_rows":23,"n_cols":9,"rows_kept":23,"cut":false,"hidden":false,"merged":[[17,1,17,5],[18,1,18,6],[22,1,22,6],[1,1,4,6],[5,1,6,6],[7,1,8,6],[9,1,10,6]]}
[]
[]
[]
[]
[]
[null,"ANEXO I - PLANILHA ORÇAMENTÁRIA"]
[]
[null,"SERVIÇO: REALIZAÇÃO DE LEVANTAMENTOS TOPOGRÁFICOS PARA APOIO À FISCALIZAÇÃO CODEVASF."]
[]
[null,"LOCAL: DIVERSOS MUNICÍPIOS DE ATUAÇÃO DA 3ª SUPERINTENDÊNCIA REGIONAL NO ESTADO DE PERNAMBUCO"]
[]
[]
[null,"Item","Descrição dos Serviços","Unidade","Quant.","Valor Unitário","Valor Total"]
[null,2,"Administração local","un",{"$f":"ORÇAMENTO!E14","v":12}]
[null,3,"Equipe para cadastro de obras (As Built)","mês",{"$f":"ORÇAMENTO!E15","v":12}]
[null,4,"Levantamento de volumes de cortes e aterros, extraídos de levantamento planialtimétrico (por área), incluindo apresentação de pranchas com as seções transversais de corte e aterro, bem como planilha com a memória de cálculo dos volumes.","m²",{"$f":"ORÇAMENTO!E16","v":1800000}]
[null,5,"Levantamento planialtimétrico de seções transversais (emissarios e redes coletoras), por Equipe de topografia incluindo apresentação de pranchas.","m",{"$f":"ORÇAMENTO!E17","v":1800000}]
[null,"TOTAL GERAL R$",{"$nulls":6},{"$f":"G14/G18","v":{"$error":"#DIV/0!"}}]
[null,{"$f":"ORÇAMENTO!B19","v":"Base para orçamento: Tabela de Engenharia Consultiva  DNIT JUL/2023"}]
[]
{"$rows_left_out":4}
{"sheet":"Encargos Dnit","index":7,"n_rows":0,"n_cols":0,"rows_kept":0,"cut":false,"hidden":false,"merged":[]}

{"sheet":"Enc Sociais","index":8,"n_rows":43,"n_cols":9,"rows_kept":43,"cut":false,"hidden":false,"merged":[[29,1,29,4],[30,1,30,4],[2,5,2,6],[2,7,2,8],[4,1,4,4],[14,0,14,4],[15,0,15,7],[42,0,42,4],[0,0,1,8],[2,0,3,4],[36,0,36,8],[37,1,37,4],[38,1,38,4],[39,1,39,4],[40,0,40,4],[31,1,31,4],[32,1,32,4],[33,1,33,4],[34,1,34,4],[35,0,35,4],[16,1,16,4],[27,0,27,4],[28,1,28,8]]}
["DETALHAMENTO DOS ENCARGOS SOCIAIS"]
[]
["DISCRIMINAÇÃO",{"$nulls":4},"SEM DESONERAÇÃO",null,"COM DESONERAÇÃO"]
[{"$nulls":5},"HORISTA","MESALISTA","HORISTA","MESALISTA"]
["A","GRUPO A"]
["A1","INSS",null,null,null,0.2,0.2,"0,00%","0,00%"]
["A2","Sesi",null,null,null,1.4999999999999999E-2,1.4999999999999999E-2,1.4999999999999999E-2,1.4999999999999999E-2]
["A3","Senai",null,null,null,0.01,0.01,0.01,0.01]
["A4","Incra",null,null,null,2E-3,2E-3,2E-3,2E-3]
["A5","Sebrae",null,null,null,6.0000000000000001E-3,6.0000000000000001E-3,6.0000000000000001E-3,6.0000000000000001E-3]
["A6","Salário Educação ",null,null,null,2.5000000000000001E-2,2.5000000000000001E-2,2.5000000000000001E-2,2.5000000000000001E-2]
["A7","Seguro Contra Acidente de Trabalho",null,null,null,0.03,0.03,0.03,0.03]
["A8","FGTS",null,null,null,0.08,0.08,0.08,0.08]
["A9","Seconci",null,null,null,"0,00%","0,00%","0,00%","0,00%"]
["SUBTOTAL DE \"A\"",{"$nulls":4},{"$f":"SUM(F6:F14)","v":0.36799999999999999},{"$f":"SUM(G6:G14)","v":0.36799999999999999},{"$f":"ROUND(SUM(H6:H14),4)","v":0.16800000000000001},{"$f":"SUM(I6:I14)","v":0.16800000000000001}]
[]
["B","GRUPO B"]
["B1","Repouso Semanal Remunerado",null,null,null,0.18060000000000001,"NÃO INCIDE",0.18060000000000001,"NÃO INCIDE"]
["B2","Feriados",null,null,null,4.3299999999999998E-2,"NÃO INCIDE",4.3299999999999998E-2,"NÃO INCIDE"]
["B3","Auxílio - Enfermidade",null,null,null,9.2999999999999992E-3,7.1000000000000004E-3,9.2999999999999992E-3,7.1000000000000004E-3]
{"$rows_left_out":24}
{"sheet":"SICRO","index":9,"n_rows":118,"n_cols":7,"rows_kept":118,"cut":false,"hidden":false,"merged":[[0,0,1,0],[0,1,1,5],[0,6,1,6],[2,0,2,6],[3,0,3,6]]}
["CGCIT","SISTEMA DE CUSTOS REFERENCIAIS DE OBRAS - SICRO",{"$nulls":4},"DNIT"]
[]
["Pernambuco - Julho/2023"]
["Sem desoneração"]
["Código","Descrição","Unidade","Salário (R$)","Encargos Totais","Custo (R$)","Periculosidade/\nInsalubridade"]
["P9801","Ajudante","h",7.0255999999999998,2.049525,21.424700000000001,0]
["P9802","Ajudante especializado","h",8.3916000000000004,1.9936849999999999,25.1218,0]
["P9803","Almoxarife","mês",2637.8,1.211854,5834.4283999999998,0]
["P9804","Apontador","mês",1953.6,1.3733,4636.4787999999999,0]
["P9805","Armador","h",10.810600000000001,1.7199869999999999,29.404599999999999,0]
["P9806","Auxiliar administrativo","mês",1953.6,1.369024,4628.1252000000004,0]
["P9807","Bombeiro hidráulico","h",10.810600000000001,1.799569,30.265000000000001,0]
["P9808","Carpinteiro","h",8.9033999999999995,1.8533550000000001,25.404499999999999,0]
["P9809","Encarregado administrativo","mês",3868.0365000000002,0.97168100000000002,7626.5339999999997,0]
["P9810","Eletricista","h",10.4335,1.7962119999999999,29.174199999999999,0]
["P9811","Encarregado especializado","mês",3589.4784,1.0140979999999999,7229.5612000000001,0]
["P9812","Engenheiro","mês",12819.947399999999,0.82593000000000005,23408.326499999999,0]
["P9814","Operacional","mês",1460.9463000000001,1.504089,3658.3395,0]
["P9815","Jardineiro","h",9.6300000000000008,1.7964039999999999,26.929300000000001,0]
["P9819","Engenheiro supervisor","mês",12819.947399999999,0.82593000000000005,23408.326499999999,0]
{"$rows_left_out":99}
{"sheet":"DNIT","index":10,"n_rows":101,"n_cols":25,"rows_kept":101,"cut":false,"hidden":false,"merged":[[1,20,1,21],[0,16,0,21],[0,22,1,23],[0,24,1,24],[1,6,1,7],[1,8,1,9],[1,10,1,11],[1,12,1,13],[1,14,1,15],[1,16,1,17],[1,18,1,19],[0,6,0,15],[0,0,2,0],[0,1,2,1],[0,2,2,2],[0,3,1,3],[0,4,1,5]]}
["Código","Categoria","Unid.","Salário","Encargos Sociais",null,"Encargos Complementares",{"$nulls":9},"Encargos Adicionais",{"$nulls":5},"Encargos Totais",null,"Valor Total"]
[{"$nulls":6},"Alimentação",null,"EPI",null,"Ferramenta",null,"Transporte",null,"Exame Ocupacional",null,"Cesta Básica",null,"Assistência Médica",null,"Seguro de Vida"]
[null,null,null,"R$","%","R$","%","R$","%","R$","%","R$","%","R$","%","R$","%","R$","%","R$","%","R$","%","R$","R$"]
["P8001","Advogado júnior","mês",4281.78,0.79520000000000002,3404.88,0.16420000000000001,702.89,5.7999999999999996E-3,24.8,0,0,0,0,6.9999999999999999E-4,3.02,0,0,6.7100000000000007E-2,287.2,2.3E-3,9.98,1.0353000000000001,4432.76,8714.5499999999993]
["P8002","Advogado pleno","mês",5709.05,0.79520000000000002,4539.83,0.1231,702.89,4.3E-3,24.8,0,0,0,0,5.0000000000000001E-4,3.02,0,0,5.0299999999999997E-2,287.2,1.6999999999999999E-3,9.98,0.97519999999999996,5567.72,11276.77]
["P8003","Advogado sênior","mês",10130.91,0.79520000000000002,8056.1,6.9400000000000003E-2,702.89,2.3999999999999998E-3,24.8,0,0,0,0,2.9999999999999997E-4,3.02,0,0,2.8299999999999999E-2,287.2,1E-3,9.98,0.89670000000000005,9083.99,19214.900000000001]
["P8007","Analista de desenvolvimento de sistemas júnior","mês",4013.75,0.79410000000000003,3187.32,0.17510000000000001,702.89,0,0,0,0,0,0,8.9999999999999998E-4,3.46,0,0,7.1599999999999997E-2,287.2,2.5000000000000001E-3,9.98,1.0441,4190.8500000000004,8204.59]
["P8008","Analista de desenvolvimento de sistemas pleno","mês",5130.1499999999996,0.79410000000000003,4073.85,0.13700000000000001,702.89,0,0,0,0,0,0,6.9999999999999999E-4,3.46,0,0,5.6000000000000001E-2,287.2,1.9E-3,9.98,0.98970000000000002,5077.38,10207.530000000001]
["P8009","Analista de desenvolvimento de sistemas sênior","mês",9196.66,0.79410000000000003,7303.07,7.6399999999999996E-2,702.89,0,0,0,0,0,0,4.0000000000000002E-4,3.46,0,0,3.1199999999999999E-2,287.2,1.1000000000000001E-3,9.98,0.9032,8306.6,17503.259999999998]
["P8013","Arquiteto júnior","mês",11220,0.79300000000000004,8897.4599999999991,6.2600000000000003E-2,702.89,2.2000000000000001E-3,24.8,0,0,0,0,2.9999999999999997E-4,3.43,0,0,2.5600000000000001E-2,287.2,8.9999999999999998E-4,9.98,0.88460000000000005,9925.76,21145.759999999998]
["P8014","Arquiteto pleno","mês",11626.7,0.79300000000000004,9219.9699999999993,6.0499999999999998E-2,702.89,2.0999999999999999E-3,24.8,0,0,0,0,2.9999999999999997E-4,3.43,0,0,2.47E-2,287.2,8.9999999999999998E-4,9.98,0.88139999999999996,10248.27,21874.97]
["P8015","Arquiteto sênior","mês",14229.73,0.79300000000000004,11284.18,4.9399999999999999E-2,702.89,1.6999999999999999E-3,24.8,0,0,0,0,2.0000000000000001E-4,3.43,0,0,2.0199999999999999E-2,287.2,6.9999999999999999E-4,9.98,0.86529999999999996,12312.48,26542.21]
["P8019","Assistente social júnior","mês",3020.78,0.79979999999999996,2416.02,0.23269999999999999,702.89,8.2000000000000007E-3,24.8,0,0,1.2500000000000001E-2,37.78,1.6000000000000001E-3,4.7,0,0,9.5100000000000004E-2,287.2,3.3E-3,9.98,1.1531,3483.38,6504.16]
["P8020","Assistente social pleno","mês",4027.71,0.79979999999999996,3221.36,0.17449999999999999,702.89,6.1999999999999998E-3,24.8,0,0,0,0,1.1999999999999999E-3,4.7,0,0,7.1300000000000002E-2,287.2,2.5000000000000001E-3,9.98,1.0553999999999999,4250.93,8278.64]
["P8021","Assistente social sênior","mês",6830.21,0.79979999999999996,5462.8,0.10290000000000001,702.89,3.5999999999999999E-3,24.8,0,0,0,0,6.9999999999999999E-4,4.7,0,0,4.2000000000000003E-2,287.2,1.5E-3,9.98,0.95050000000000001,6492.37,13322.58]
["P8025","Auxiliar","mês",1467.63,0.80469999999999997,1181,0.47889999999999999,702.89,2.06E-2,30.19,1.1000000000000001E-3,1.55,8.9200000000000002E-2,130.97,4.4999999999999997E-3,6.67,0,0,0.19570000000000001,287.2,6.7999999999999996E-3,9.98,1.6014999999999999,2350.46,3818.09]
["P8026","Auxiliar administrativo","mês",1772.08,0.80120000000000002,1419.79,0.39660000000000001,702.89,0,0,0,0,6.3600000000000004E-2,112.71,2.2000000000000001E-3,3.83,0,0,0.16209999999999999,287.2,5.5999999999999999E-3,9.98,1.4313,2536.41,4308.49]
["P8027","Auxiliar de laboratório","mês",1618.28,0.80079999999999996,1295.92,0.43430000000000002,702.89,1.8700000000000001E-2,30.19,2E-3,3.19,7.5300000000000006E-2,121.94,2.7000000000000001E-3,4.3099999999999996,0,0,0.17749999999999999,287.2,6.1999999999999998E-3,9.98,1.5174000000000001,2455.62,4073.9]
["P8028","Auxiliar de topografia","mês",1467.63,0.80169999999999997,1176.5999999999999,0.47889999999999999,702.89,2.06E-2,30.19,8.9999999999999998E-4,1.35,8.9200000000000002E-2,130.97,3.2000000000000002E-3,4.7,0,0,0.19570000000000001,287.2,6.7999999999999996E-3,9.98,1.5971,2343.88,3811.52]
["P8032","Biólogo júnior","mês",3175.35,0.79559999999999997,2526.31,0.22140000000000001,702.89,7.7999999999999996E-3,24.8,0,0,8.9999999999999993E-3,28.51,1.1999999999999999E-3,3.77,0,0,9.0399999999999994E-2,287.2,3.0999999999999999E-3,9.98,1.1285000000000001,3583.46,6758.81]
{"$rows_left_out":82}
{"sheet":"TC-DNIT","index":11,"n_rows":24,"n_cols":7,"rows_kept":24,"cut":false,"hidden":false,"merged":[[21,0,22,0],[21,2,21,3],[22,2,22,3],[5,0,7,0],[12,2,12,3],[13,0,14,0],[13,2,13,3],[14,2,14,3],[15,0,16,0],[15,2,15,3],[16,2,16,3],[17,0,20,0],[17,2,17,3],[18,2,18,3],[19,2,19,3],[20,2,20,3],[2,0,2,5],[3,0,4,0],[3,1,4,1],[3,2,4,2],[3,3,4,3],[3,4,3,5]]}
["2023-07-01"]
["Tabela 1 - Custos de veículos "]
[{"$f":"\"Tabela de Preços de Consultoria - mês de referência: \"&TEXT(A1,\"MMMM\")&\" de \"&TEXT(A1,\"AAAA\")","v":"Tabela de Preços de Consultoria - mês de referência: julho de 2023"}]
["Item","Código","Tipo","Unidade","Custo unitário (R$ / un)",null,"S"]
[{"$nulls":4},"Produtivo","Improdutivo"]
["Veículos","E8889","Veículo leve - 53 kW (sem motorista)","hora",32.840000000000003,6.47]
[null,"E8891","Veículo leve picape 4x4 - 147 kW (sem motorista)","hora",80.19,28.61]
[null,"E8887","Van furgão - 93 kW (com motorista)","hora",74.09,43.18]
["Fonte: FGV IBRE"]
[]
["Tabela 2 - Custos de imóveis, mobiliário, cestas de instalações e custos diversos"]
[{"$f":"\"Tabela de Preços de Consultoria - mês de referência: \"&TEXT(A1,\"MMMM\")&\" de \"&TEXT(A1,\"AAAA\")","v":"Tabela de Preços de Consultoria - mês de referência: julho de 2023"}]
["Item","Código","Tipo",null,"Unidade","Custo unitário \n(R$ / un)"]
["Imóveis","B8951","Imóvel Comercial (2,60% do CMCC - SINAPI)",null,"l",47.3]
[null,"B8952","Residencial (1,70% do CMCC - SINAPI)",null,"m² x mês",30.93]
["Mobiliário","B8953","Mobiliário Escritório",null,"ocupante x mês",502.59]
[null,"B8954","Residência",null,"ocupante x mês",43.87]
["Cesta das Instalações","B8955","Laboratório de asfalto",null,"mês",5144.99]
[null,"B8956","Laboratório de concreto",null,"mês",4285.2299999999996]
[null,"B8957","Laboratório de solos",null,"mês",4235.59]
{"$rows_left_out":4}