{"text_format":"2","workbook":"xlsx","n_sheets":5,"sheets":["ORÇAMENTO","CPU","BDI SERV","BDI FORN","CRONOGRAMA"],"not_rendered":{"charts":0,"images":2,"macros":0,"external_links":0,"defined_names":5,"comments":1,"pivot_tables":0},"unopened":[],"bounds":{"document_bytes":16777216,"sheet_cells":100000,"run_cost":"one","rows_first":2000,"rows_last":500,"rows_between":2000,"halvings":0,"cell_chars":16384,"cell_head_chars":4096},"cells_cut":0,"cells_raw":0,"read":"whole","date_system":"1900"}

{"sheet":"ORÇAMENTO","index":0,"n_rows":46,"n_cols":9,"rows_kept":46,"cut":false,"hidden":false,"merged":[[15,10,16,10],[48,8,49,8],[6,3,6,7],[0,0,7,0],[0,2,0,8],[1,2,1,8],[2,2,2,8],[4,2,4,8],[5,6,5,7],[6,1,6,2],[45,1,45,7]]}
["<---- NUMERAR SERVIÇOS PARA CPU",null,"Ministério do Desenvolvimento Regional"]
[null,null,"Companhia de Desenvolvimento dos Vales do São Francisco e do Parnaíba"]
[null,null,"1ª Superintendência Regional"]
[]
[null,"OBRA: "," PAVIMENTAÇÃO ASFÁLTICA EM CBUQ - ESTRADA PARA MUQUÉM - TRECHO 1 (EST.90  ATÉ EST.145)"]
[null,"DATA:","JULHO DE 2023",null,null,null,"BDI Serviços:",null,{"$f":"'BDI SERV'!D31/100","v":0.22370000000000001}]
[null,"PRAZO DE EXECUÇÃO:     120 DIAS",null,"BDI Fornecimento e Transporte - Insumos Asfálticos:",{"$nulls":4},{"$f":"'BDI FORN'!D31/100","v":0.15}]
[null,"ITEM","DISCRIMINAÇÃO",null,"UNID.","QUANT.","P. UNITÁRIO","P.UNIT.C/ BDI","P. TOTAL"]
["A",1,"SERVIÇOS PRELIMINARES ",{"$nulls":5},{"$f":"SUM(I10:I14)","v":95204.06}]
[1,"1.1","MOBILIZAÇÃO E DESMOBILIZAÇÃO","CPU.1","GL",1,{"$f":"VLOOKUP(A10,CPU!$A$1:$N$4777,9)","v":6180.16},{"$f":"VLOOKUP(A10,CPU!$A$1:$N$4777,10)","v":7562.6617919999999},{"$f":"ROUND(F10*H10,2)","v":7562.66}]
[2,"1.2","ADMINISTRAÇÃO LOCAL","CPU.2","GL",1,{"$f":"VLOOKUP(A11,CPU!$A$1:$N$4777,9)","v":63274.880000000005},{"$f":"VLOOKUP(A11,CPU!$A$1:$N$4777,10)","v":77429.470656000005},{"$f":"ROUND(F11*H11,2)","v":77429.47}]
[3,"1.3","CANTEIRO DE OBRAS","CPU.3","GL",1,{"$f":"VLOOKUP(A12,CPU!$A$1:$N$4777,9)","v":4769},{"$f":"VLOOKUP(A12,CPU!$A$1:$N$4777,10)","v":5835.8253000000004},{"$f":"ROUND(F12*H12,2)","v":5835.83}]
[4,"1.4","PLACA DE OBRA EM CHAPA DE AÇO GALVANIZADO",103689,"M2",2,{"$f":"VLOOKUP(A13,CPU!$A$1:$N$4777,9)","v":308.06},{"$f":"VLOOKUP(A13,CPU!$A$1:$N$4777,10)","v":376.97302200000001},{"$f":"ROUND(F13*H13,2)","v":753.95}]
[5,"1.5","SERVIÇOS TOPOGRÁFICOS PARA PAVIMENTAÇÃO, INCLUSIVE NOTA DE SERVIÇO, ACOMPANHAMENTO E GREIDE",78472,"M2",8000,{"$f":"VLOOKUP(A14,CPU!$A$1:$N$4777,9)","v":0.37},{"$f":"VLOOKUP(A14,CPU!$A$1:$N$4777,10)","v":0.45276899999999998},{"$f":"ROUND(F14*H14,2)","v":3622.15}]
["B",2,"TERRAPLANAGEM E PAVIMENTAÇÃO",{"$nulls":5},{"$f":"SUM(I16:I23)","v":259155.24}]
[6,"2.1","ESCAVAÇÃO HORIZONTAL EM SOLO DE 1A CATEGORIA",101116,"M3",2799.9999999999995,{"$f":"VLOOKUP(A16,CPU!$A$1:$N$4777,9)","v":1.87},{"$f":"VLOOKUP(A16,CPU!$A$1:$N$4777,10)","v":2.288319},{"$f":"ROUND(F16*H16,2)","v":6407.29}]
[7,"2.2","CARGA, MANOBRA E DESCARGA DE AGREGADOS OU SOLOS EM CAMINHÃO BASCULANTE - DESCARGA LIVRE",5914351,"M3",2799.9999999999995,{"$f":"VLOOKUP(A17,CPU!$A$1:$N$4777,9)","v":1.8440370986088019},{"$f":"VLOOKUP(A17,CPU!$A$1:$N$4777,10)","v":2.2565481975675907},{"$f":"ROUND(F17*H17,2)","v":6318.33}]
[8,"2.3","REGULARIZAÇÃO E COMPACTAÇÃO DE SUBLEITO",4011209,"M2",8000,{"$f":"VLOOKUP(A18,CPU!$A$1:$N$4777,9)","v":0.8648084497873062},{"$f":"VLOOKUP(A18,CPU!$A$1:$N$4777,10)","v":1.0582661000047267},8466.1299999999992]
[9,"2.4","COMPACTAÇÃO DE ATERROS A 100% DOP PROCTOR NORMAL",5502978,"M3",2000.0000000000002,{"$f":"VLOOKUP(A19,CPU!$A$1:$N$4777,9)","v":4.1581796670630204},{"$f":"VLOOKUP(A19,CPU!$A$1:$N$4777,10)","v":5.0883644585850183},{"$f":"ROUND(F19*H19,2)","v":10176.73}]
[10,"2.5","BASE OU SUB-BASE DE BICA CORRIDA COM BRITA COMERCIAL","4011276a","M3",1600,{"$f":"VLOOKUP(A20,CPU!$A$1:$N$4777,9)","v":107.31211107969607},{"$f":"VLOOKUP(A20,CPU!$A$1:$N$4777,10)","v":131.31783032822409},210108.53]
[11,"2.6","IMPRIMAÇÃO COM ASFALTO DILUIDO CM-30",4011351,"M2",8000,{"$f":"VLOOKUP(A21,CPU!$A$1:$N$4777,9)","v":0.34250000000000003},{"$f":"VLOOKUP(A21,CPU!$A$1:$N$4777,10)","v":0.41911725000000005},3352.94]
[12,"2.7","PINTURA DE LIGAÇÃO COM EMULSÃO ASFÁLTICA RR-2C",4011353,"M2",6600,{"$f":"VLOOKUP(A22,CPU!$A$1:$N$4777,9)","v":0.25690000000000002},{"$f":"VLOOKUP(A22,CPU!$A$1:$N$4777,10)","v":0.31436853000000003},2074.83]
[13,"2.8","EXECUÇÃO DE PAVIMENTO COM APLICAÇÃO DE CONCRETO ASFÁLTICO USINADO A QUENTE (CBUQ), CAMADA DE ROLAMENTO - EXCLUSIVE FORNECIMENTO E TRANSPORTE",4011463,"T",600,{"$f":"VLOOKUP(A23,CPU!$A$1:$N$4777,9)","v":16.685004417670683},{"$f":"VLOOKUP(A23,CPU!$A$1:$N$4777,10)","v":20.417439905903613},12250.46]
["C",3,"TRANSPORTE DE MATERIAIS",{"$nulls":5},{"$f":"SUM(I25:I26)","v":14382.98}]
[14,"3.1","TRANSPORTE COM CAMINHÃO BASCULANTE, EM VIA URBANA EM REVESTIMENTO PRIMÁRIO",5901638,"M3XKM",7900.0020432127722,{"$f":"VLOOKUP(A25,CPU!$A$1:$N$4777,9,0)","v":0.62485229808121379},{"$f":"VLOOKUP(A25,CPU!$A$1:$N$4777,10)","v":0.76463175716198128},{"$f":"ROUND(F25*H25,2)","v":6040.59}]
[15,"3.2","TRANSPORTE COM CAMINHÃO BASCULANTE, EM VIA URBANA PAVIMENTADA",5901640,"M3XKM",14500.004209315199,{"$f":"VLOOKUP(A26,CPU!$A$1:$N$4777,9,0)","v":0.47016213000148743},{"$f":"VLOOKUP(A26,CPU!$A$1:$N$4777,10,0)","v":0.57533739848282017},{"$f":"ROUND(F26*H26,2)","v":8342.39}]
["E",4,"OBRAS COMPLEMENTARES E SINALIZAÇÃO",{"$nulls":5},{"$f":"SUM(I28:I38)","v":80128.950000000012}]
[17,"4.1","DESCIDA D’ÁGUA DE ATERROS EM DEGRAUS - DAD 04 - AREIA E BRITA COMERCIAIS",2003411,"M2",6,{"$f":"VLOOKUP(A28,CPU!$A$1:$N$4777,9,0)","v":608.04999999999984},{"$f":"VLOOKUP(A28,CPU!$A$1:$N$4777,10,0)","v":744.07078499999977},{"$f":"ROUND(F28*H28,2)","v":4464.42}]
[18,"4.2","ENRONCAMENTO DE PEDRA ARRUMADA MANUALMENTE - PEDRA DE MÃO COMERCIAL - FORNECIMENTO E ASSENTAMENTO ",1505879,"M3",2.4015999999999997,{"$f":"VLOOKUP(A29,CPU!$A$1:$N$4777,9,0)","v":235.94},{"$f":"VLOOKUP(A29,CPU!$A$1:$N$4777,10,0)","v":288.71977800000002},{"$f":"ROUND(F29*H29,2)","v":693.39}]
[19,"4.3","CORPO DE BSTC D=0,80M PA-1, INCLUSIVE BERÇO EM CONCRETO CICLÓPICO - AREIA, BRITA E PEDRA DE MÃO COMERCIAIS",804029,"M",26,{"$f":"VLOOKUP(A30,CPU!$A$1:$N$4777,9,0)","v":624.05999999999995},{"$f":"VLOOKUP(A30,CPU!$A$1:$N$4777,10,0)","v":763.66222199999993},{"$f":"ROUND(F30*H30,2)","v":19855.22}]
[20,"4.4","BOCA DE BSTC D=0,80M, ALAS RETAS - AREIA E BRITA COMERCIAIS",804385,"UNID",3,{"$f":"VLOOKUP(A31,CPU!$A$1:$N$4777,9,0)","v":2076.52},{"$f":"VLOOKUP(A31,CPU!$A$1:$N$4777,10,0)","v":2541.0375239999998},{"$f":"ROUND(F31*H31,2)","v":7623.11}]
[21,"4.5","CAIXA DE LIGAÇÃO E PASSAGEM CLP-09, PARA BUEIRO D=0,80M - AREIA E BRITA COMERCIAIS",2003658,"UNID",1,{"$f":"VLOOKUP(A32,CPU!$A$1:$N$4777,9,0)","v":2427.64},{"$f":"VLOOKUP(A32,CPU!$A$1:$N$4777,10,0)","v":2970.7030679999998},2970.7]
[22,"4.6","SAÍDA D'ÁGUA EM TALUDES DE CORTE E ATERRO (SDA E SDC) - AREIA E BRITA COMERCIAIS","RO-46167a","UNID",2,{"$f":"VLOOKUP(A33,CPU!$A$1:$N$4777,9,0)","v":313.69},{"$f":"VLOOKUP(A33,CPU!$A$1:$N$4777,10,0)","v":383.86245300000002},{"$f":"ROUND(F33*H33,2)","v":767.72}]
[24,"4.7","SARJETA DE CONCRETO EM CORTE - SCC 30/20","2003349b","M",470,{"$f":"VLOOKUP(A34,CPU!$A$1:$N$4777,9,0)","v":26.45},{"$f":"VLOOKUP(A34,CPU!$A$1:$N$4777,10,0)","v":32.366864999999997},{"$f":"ROUND(F34*H34,2)","v":15212.43}]
[25,"4.8","PINTURA DE FAIXA COM TINTA ACRÍLICA - ESPESSURA DE 0,4MM",5213400,"M2",350,{"$f":"VLOOKUP(A35,CPU!$A$1:$N$4777,9,0)","v":27.583385101937086},{"$f":"VLOOKUP(A35,CPU!$A$1:$N$4777,10,0)","v":33.753788349240409},11813.83]
[26,"4.9","PLACA DE REGULAMENTAÇÃO EM AÇO, PELÍCULA RETRORREFLETIVA TIPO I+SI, INCLUSIVE SUPORTE METÁLICO - FORNECIMENTO E IMPLANTAÇÃO","5213440+\n5213863","UNID",20,{"$f":"VLOOKUP(A36,CPU!$A$1:$N$4777,9,0)","v":524.74},{"$f":"VLOOKUP(A36,CPU!$A$1:$N$4777,10,0)","v":642.12433799999997},12842.49]
[27,"4.10","RECOMPOSIÇÃO PARCIAL DE CERCA COM MOURÃO DE MADEIRA - ARAME E MOURÃO","4915732+\n4915731","M",110,{"$f":"VLOOKUP(A37,CPU!$A$1:$N$4777,9,0)","v":22.17},{"$f":"VLOOKUP(A37,CPU!$A$1:$N$4777,10,0)","v":27.129429000000002},{"$f":"ROUND(F37*H37,2)","v":2984.24}]
[28,"4.11","DESMATAMENTO, DESTOCAMENTO, LIMPEZA DE ÁREA E ESTOCAGEM DO MATERIAL DE LIMPEZA COM ARVORES DE DIÂMETRO ATÉ 0,15M",5501700,"M2",4400,{"$f":"VLOOKUP(A38,CPU!$A$1:$N$4777,9,0)","v":0.16741361201897045},{"$f":"VLOOKUP(A38,CPU!$A$1:$N$4777,10,0)","v":0.20486403702761413},{"$f":"ROUND(F38*H38,2)","v":901.4}]
["F",5,"TRANSPORTE - MATERIAL ASFÁLTICO (BDI DIFERENCIADO)",{"$nulls":5},{"$f":"SUM(I40:I41)","v":26168.030000000002}]
[30,"5.1","TRANSPORTE COM CAMINHÃO TANQUE DE TRANSPORTE DE MATERIAL ASFÁLTICO DE 30000 L, EM VIA URBANA PAVIMENTADA",102331,"TXKM",6399.9999999999991,{"$f":"VLOOKUP(A40,CPU!$A$1:$N$4777,9,0)","v":0.47},{"$f":"VLOOKUP(A40,CPU!$A$1:$N$4777,10,0)","v":0.54049999999999998},{"$f":"ROUND(F40*H40,2)","v":3459.2}]
{"$rows_left_out":7}
{"sheet":"CPU","index":1,"n_rows":476,"n_cols":13,"rows_kept":476,"cut":false,"hidden":false,"merged":[[161,8,161,10],[468,8,468,11],[262,1,262,6],[263,1,263,6],[264,1,264,6],[460,1,460,6],[461,1,461,6],[462,1,462,6],[442,1,442,3],[442,4,442,7],[443,2,443,5],[444,2,444,3],[445,1,445,7],[448,1,448,3],[448,5,448,6],[449,1,449,6],[450,1,450,6],[451,1,451,6],[165,1,165,3],[165,5,165,6],[166,1,166,6],[167,1,167,6],[235,1,235,6],[464,0,473,0],[464,1,464,3],[464,4,464,7],[465,2,465,5],[466,2,466,3],[467,1,467,7],[470,1,470,3],[470,5,470,6],[471,1,471,6],[472,1,472,6],[473,1,473,6],[442,0,451,0],[453,0,462,0],[453,1,453,3],[453,4,453,7],[454,2,454,5],[455,2,455,3],[456,1,456,7],[459,1,459,3],[459,5,459,6],[79,2,79,3],[418,2,418,5],[419,2,419,3],[420,1,420,7],[424,1,424,3],[424,5,424,6],[417,4,417,7],[250,0,264,0],[250,1,250,3],[250,4,250,7],[251,2,251,5],[252,2,252,3],[253,1,253,7],[261,1,261,3],[261,5,261,6],[417,0,427,0],[0,0,13,0],[14,0,31,0],[32,0,44,0],[45,0,61,0],[62,0,76,0],[77,0,89,0],[104,0,125,0],[170,0,186,0],[187,0,203,0],[90,0,102,0],[126,0,146,0],[148,0,168,0],[209,8,209,9],[224,10,224,11],[225,2,225,5],[226,2,226,3],[227,1,227,7],[427,1,427,6],[425,1,425,6],[426,1,426,6],[221,1,221,6],[222,1,222,6],[232,1,232,3],[232,5,232,6],[233,1,233,6],[234,1,234,6],[237,1,237,3],[237,4,237,7],[238,2,238,5],[239,2,239,3],[240,1,240,7],[220,1,220,6],[219,1,219,3],[219,5,219,6],[248,1,248,6],[224,1,224,3],[204,10,204,11],[106,2,106,3],[107,1,107,7],[121,1,121,3],[121,5,121,6],[187,10,187,11],[122,1,122,6],[123,1,123,6],[124,1,124,6],[170,1,170,3],[170,4,170,7],[170,10,170,11],[171,2,171,5],[172,2,172,3],[173,1,173,7],[182,1,182,3],[182,5,182,6],[183,1,183,6],[184,1,184,6],[185,1,185,6],[187,1,187,3],[187,4,187,7],[188,2,188,5],[190,1,190,7],[80,1,80,7],[85,1,85,3],[85,5,85,6],[86,1,86,6],[87,1,87,6],[88,1,88,6],[104,10,104,11],[105,2,105,5],[104,1,104,3],[104,4,104,7],[95,8,98,8],[64,2,64,3],[65,1,65,7],[72,1,72,3],[72,5,72,6],[73,1,73,6],[74,1,74,6],[75,1,75,6],[77,10,77,11],[78,2,78,5],[77,1,77,3],[77,4,77,7],[47,2,47,3],[48,1,48,7],[57,1,57,3],[57,5,57,6],[58,1,58,6],[59,1,59,6],[60,1,60,6],[62,10,62,11],[63,2,63,5],[62,1,62,3],[62,4,62,7],[0,1,0,3],[0,4,0,7],[0,10,0,11],[1,2,1,5],[2,2,2,3],[3,1,3,7],[9,1,9,3],[9,5,9,6],[10,1,10,6],[1,10,1,11],[11,1,11,6],[12,1,12,6],[14,1,14,3],[14,4,14,7],[14,10,14,11],[15,2,15,5],[16,2,16,3],[17,1,17,7],[27,1,27,3],[27,5,27,6],[15,8,16,9],[32,10,32,11],[33,2,33,5],[34,2,34,3],[35,1,35,7],[33,8,34,9],[40,1,40,3],[40,5,40,6],[41,1,41,6],[42,1,42,6],[45,10,45,11],[46,2,46,5],[245,1,245,3],[245,5,245,6],[246,1,246,6],[247,1,247,6],[28,1,28,6],[29,1,29,6],[30,1,30,6],[102,1,102,6],[90,1,90,3],[90,4,90,7],[91,2,91,5],[92,2,92,3],[93,1,93,7],[99,1,99,3],[99,5,99,6],[100,1,100,6],[101,1,101,6],[32,1,32,3],[32,4,32,7],[43,1,43,6],[45,1,45,3],[45,4,45,7],[429,0,440,0],[429,1,429,3],[429,4,429,7],[430,2,430,5],[431,2,431,3],[432,1,432,7],[437,1,437,3],[437,5,437,6],[438,1,438,6],[439,1,439,6],[440,1,440,6],[417,1,417,3],[126,1,126,3],[126,4,126,7],[127,2,127,5],[128,2,128,3],[129,1,129,7],[143,1,143,3],[143,5,143,6],[144,1,144,6],[145,1,145,6],[146,1,146,6],[168,1,168,6],[224,4,224,7],[204,1,204,3],[148,1,148,3],[148,4,148,7],[149,2,149,5],[150,2,150,3],[151,1,151,7],[266,0,278,0],[266,1,266,3],[266,4,266,7],[267,2,267,5],[268,2,268,3],[269,1,269,7],[275,1,275,3],[275,5,275,6],[276,1,276,6],[277,1,277,6],[278,1,278,6],[224,0,235,0],[237,0,248,0],[199,1,199,3],[199,5,199,6],[204,4,204,7],[189,2,189,3],[205,2,205,5],[206,2,206,3],[207,1,207,7],[200,1,200,6],[201,1,201,6],[202,1,202,6],[204,0,223,0],[280,0,295,0],[280,1,280,3],[280,4,280,7],[281,2,281,5],[282,2,282,3],[283,1,283,7],[292,1,292,3],[292,5,292,6],[293,1,293,6],[294,1,294,6],[295,1,295,6],[297,0,307,0],[297,1,297,3],[297,4,297,7],[298,2,298,5],[299,2,299,3],[300,1,300,7],[304,1,304,3],[304,5,304,6],[305,1,305,6],[306,1,306,6],[307,1,307,6],[309,0,320,0],[309,1,309,3],[309,4,309,7],[310,2,310,5],[311,2,311,3],[312,1,312,7],[317,1,317,3],[317,5,317,6],[318,1,318,6],[319,1,319,6],[320,1,320,6],[322,0,334,0],[322,1,322,3],[322,4,322,7],[323,2,323,5],[324,2,324,3],[325,1,325,7],[331,1,331,3],[331,5,331,6],[332,1,332,6],[333,1,333,6],[334,1,334,6],[349,0,366,0],[349,1,349,3],[349,4,349,7],[350,2,350,5],[351,2,351,3],[352,1,352,7],[363,1,363,3],[363,5,363,6],[364,1,364,6],[365,1,365,6],[366,1,366,6],[368,0,385,0],[368,1,368,3],[368,4,368,7],[369,2,369,5],[370,2,370,3],[371,1,371,7],[382,1,382,3],[382,5,382,6],[383,1,383,6],[384,1,384,6],[385,1,385,6],[387,0,401,0],[387,1,387,3],[387,4,387,7],[388,2,388,5],[389,2,389,3],[390,1,390,7],[398,1,398,3],[398,5,398,6],[399,1,399,6],[400,1,400,6],[401,1,401,6],[403,0,415,0],[403,1,403,3],[403,4,403,7],[404,2,404,5],[405,2,405,3],[406,1,406,7],[412,1,412,3],[412,5,412,6],[413,1,413,6],[414,1,414,6],[415,1,415,6],[336,0,347,0],[336,1,336,3],[336,4,336,7],[337,2,337,5],[338,2,338,3],[339,1,339,7],[344,1,344,3],[344,5,344,6],[345,1,345,6],[346,1,346,6],[347,1,347,6]]}
[1,"CODEVASF",null,null," COMPOSIÇÃO DE PREÇO UNITÁRIO",null,null,null,{"$f":"H11","v":6180.16},{"$f":"H13","v":7562.6617919999999},"BDI CALCULADO:",null,{"$f":"ORÇAMENTO!I6","v":0.22370000000000001}]
[null,"OBRA:  ",{"$f":"ORÇAMENTO!C5","v":" PAVIMENTAÇÃO ASFÁLTICA EM CBUQ - ESTRADA PARA MUQUÉM - TRECHO 1 (EST.90  ATÉ EST.145)"},null,null,null,"DATA: ",{"$f":"ORÇAMENTO!C6","v":"JULHO DE 2023"},null,null,"BDI DIFERENCIADO:",null,{"$f":"'BDI FORN'!D31/100","v":0.15}]
[null,"SERVIÇO:  ",{"$f":"VLOOKUP(A1,ORÇAMENTO!A10:I27,3)","v":"MOBILIZAÇÃO E DESMOBILIZAÇÃO"},null,"Referência:",{"$f":"VLOOKUP(A1,ORÇAMENTO!A10:I27,4)","v":"CPU.1"},"UNIDADE: ",{"$f":"VLOOKUP(A1,ORÇAMENTO!A10:I27,5)","v":"GL"}]
[]
[null,"TIPO ITEM","CODIGO ITEM","DESCRIÇÃO ITEM","UNIDADE ITEM","COEFICIENTE","PRECO UNITARIO","CUSTO TOTAL"]
[null,"COMPOSICAO",89876,"CAMINHÃO BASCULANTE 14 M3, COM CAVALO MECÂNICO DE CAPACIDADE MÁXIMA DE TRAÇÃO COMBINADO DE 36000 KG, POTÊNCIA 286 CV, INCLUSIVE SEMIREBOQUE COM CAÇAMBA METÁLICA","CHP DIURNO.",12,287.48,{"$f":"ROUNDDOWN(F6*G6,2)","v":3449.76}]
[null,"COMPOSICAO",89877,"CAMINHÃO BASCULANTE 14 M3, COM CAVALO MECÂNICO DE CAPACIDADE MÁXIMA DE TRAÇÃO COMBINADO DE 36000 KG, POTÊNCIA 286 CV, INCLUSIVE SEMIREBOQUE COM CAÇAMBA METÁLICA","CHI DIURNO.",6,82.59,{"$f":"ROUNDDOWN(F7*G7,2)","v":495.54}]
[null,"COMPOSICAO",5914640,"TRANSPORTE COM CAVALO MECÂNICO COM SEMIRREBOQUE COM CAPACIDADE DE 30 T - RODOVIA PAVIMENTADA","T.KM",3386,0.59,1997.74]
[null,"COMPOSIÇÃO",88316,"SERVENTE COM ENCARGOS COMPLEMENTARES","H",12,19.760000000000002,237.12]
[null,"PRODUÇÃO DA EQUIPE",null,null,1,"CUSTO ",null,{"$f":"SUM(H6:H9)","v":6180.16}]
[null,"TOTAL",{"$nulls":5},{"$f":"H10/E10","v":6180.16},"OK"]
[null,"BDI                %",{"$nulls":5},{"$f":"1+$M$1","v":1.2237}]
[null,"TOTAL DO SERVIÇO - R$",{"$nulls":5},{"$f":"H11*H12","v":7562.6617919999999}]
[]
[{"$f":"A1+1","v":2},"CODEVASF",null,null," COMPOSIÇÃO DE PREÇO UNITÁRIO",null,null,null,{"$f":"H29","v":63274.880000000005},{"$f":"H31","v":77429.470656000005}]
[null,"OBRA:  ",{"$f":"$C$2","v":" PAVIMENTAÇÃO ASFÁLTICA EM CBUQ - ESTRADA PARA MUQUÉM - TRECHO 1 (EST.90  ATÉ EST.145)"},null,null,null,"DATA: ",{"$f":"$H$2","v":"JULHO DE 2023"}]
[null,"SERVIÇO:  ",{"$f":"VLOOKUP(A15,ORÇAMENTO!$A$10:$I$27,3)","v":"ADMINISTRAÇÃO LOCAL"},null,"SINAPI","CPU","UNIDADE: ",{"$f":"VLOOKUP(A15,ORÇAMENTO!$A$10:$I$27,5)","v":"GL"}]
[]
[null,"TIPO ITEM","CODIGO ITEM","DESCRIÇÃO ITEM","UNIDADE ITEM","COEFICIENTE","PRECO UNITARIO","CUSTO TOTAL"]
[null,"INSUMO",14250,"ENERGIA ELÉTRICA","kwh",80,0.86,{"$f":"ROUNDDOWN(F20*G20,2)","v":68.8}]
[null,"INSUMO",44480,"TARIFA ÁGUA/ESGOTO ","m³",6,16.27,97.62]
[null,"COTAÇÃO","MERC.","TELEFONE (PLANO CONTROLE)","UNID",2,60,120]
[null,"COMPOSICAO",90777,"Engenheiro Civil Júnior com encargos complementares","H",40,114.12,4564.8]
[null,"COMPOSICAO",90776,"Encarregado Geral com encargos complementares","H",110,57.73,6350.3]
[null,"COMPOSICAO",88321,"Tecnico de Laboratório com encargos complementares","H",40,45.67,1826.8]
[null,"COMPOSICAO",100309,"Tecnico de Segurança do Trabalho com encargos complementares","H",40,45.93,{"$f":"ROUNDDOWN(F26*G26,2)","v":1837.2}]
[null,"COMPOSICAO",90772,"Auxiliar de escritório com encargos complementares","H",40,23.83,953.2]
[null,"PRODUÇÃO DA EQUIPE",null,null,0.25,"CUSTO ",null,{"$f":"SUM(H20:H27)","v":15818.720000000001}]
[null,"TOTAL",{"$nulls":5},{"$f":"H28/E28","v":63274.880000000005},"OK"]
[null,"BDI                %",{"$nulls":5},{"$f":"1+$M$1","v":1.2237}]
[null,"TOTAL DO SERVIÇO - R$",{"$nulls":5},{"$f":"H29*H30","v":77429.470656000005}]
[]
[{"$f":"A15+1","v":3},"CODEVASF",null,null," COMPOSIÇÃO DE PREÇO UNITÁRIO",null,null,null,{"$f":"H42","v":4769},{"$f":"H44","v":5835.8253000000004}]
[null,"OBRA:  ",{"$f":"$C$2","v":" PAVIMENTAÇÃO ASFÁLTICA EM CBUQ - ESTRADA PARA MUQUÉM - TRECHO 1 (EST.90  ATÉ EST.145)"},null,null,null,"DATA: ",{"$f":"$H$2","v":"JULHO DE 2023"}]
[null,"SERVIÇO:  ",{"$f":"VLOOKUP(A33,ORÇAMENTO!$A$10:$I$27,3)","v":"CANTEIRO DE OBRAS"},null,"SINAPI",{"$f":"VLOOKUP(A33,ORÇAMENTO!$A$10:$I$27,4)","v":"CPU.3"},"UNIDADE: ",{"$f":"VLOOKUP(A33,ORÇAMENTO!$A$10:$I$27,5)","v":"GL"}]
[]
[null,"TIPO ITEM","CODIGO ITEM","DESCRIÇÃO ITEM","UNIDADE ITEM","COEFICIENTE","PRECO UNITARIO","CUSTO TOTAL"]
[null,"INSUMO",10775,"ALUGUEL DE IMÓVEL OU CONTEINER QUE ATENDA AOS REQUISITOS MÍNIMOS PARA INSTALAÇÃO DO CANTEIRO DE OBRAS","MÊS",4,1040,{"$f":"ROUNDDOWN(F38*G38,2)","v":4160}]
[null,"INSUMO","37525","TELA PLASTICA TECIDA LISTRADA BRANCA E LARANJA, TIPO GUARDA CORPO, EM POLIETILENO MONOFILADO, ROLO 1,20 X 50 M (L X C)","M",100,3.69,{"$f":"ROUNDDOWN(F39*G39,2)","v":369}]
[null,"COMPOSICAO"," - ","PLACA DE SINALIZAÇÃO - \"PERIGO - OBRAS A FRENTE\" - FORNECIMENTO E MOVIMENTAÇÃO","UNID.",12,20,240]
{"$rows_left_out":437}
{"sheet":"BDI SERV","index":2,"n_rows":37,"n_cols":5,"rows_kept":37,"cut":false,"hidden":false,"merged":[[36,0,36,5],[3,1,4,1],[3,2,4,2],[0,1,2,4],[32,0,34,5],[28,0,28,5],[30,1,30,2],[31,1,31,2]]}
[null,"DETALHAMENTO DO BDI - SERVIÇOS"]
[]
[]
[null,"Item","Descrição dos Serviços","%","%"]
[null,null,null,"PV","CD"]
[]
[null,1,"ADMINISTRAÇÃO CENTRAL"," ",4.01]
[null,"1.1","ESCRITÓRIO CENTRAL"," "," "]
[null,"1.2","VIAGENS"," "," "]
[null,"1.3","OUTROS"," "," "]
[null," "," "," "," "]
[null,2,"IMPOSTOS E TAXAS",{"$f":"SUM(D13:D16)","v":6.15},{"$f":"SUM(E13:E16)","v":7.6899999999999995}]
[null,"2.1","ISS (*)",2.5,{"$f":"ROUND(D13*1.2515,2)","v":3.13}]
[null,"2.2","PIS",0.65,0.81]
[null,"2.3","Cofins",3,3.75]
[null,"2.4","CONTRIBUIÇÃO PREVIDENCIÁRIA SOBRE A RENDA BRUTA",0,0]
[]
[null,3,"TAXA DE RISCO"," ",{"$f":"SUM(E19:E22)","v":1.1600000000000001}]
[null,"3.1","SEGURO",null,0.2]
[null,"3.2","RISCO",null,0.56000000000000005]
[null,"3.3","GARANTIA",null,0.4]
[]
[null,4,"DESPESAS FINANCEIRAS"," ",1.1100000000000001]
[]
[null,5,"LUCRO",null,8]
[]
[null," ","BDI - CALCULADO"," ",{"$f":"ROUND((((1+(E7+E18)/100)*(1+E23/100)*(1+E25/100)/(1-D12/100)-1)*100),2)","v":22.37}]
[]
["BDI = ((1+((AC+S+R+G)/100))x(1+DF/100)x(1+L/100)/(1-I/100)-1)*100"]
[]
[null,"BDI (CALCULADO):",null,{"$f":"ROUND((((1+((E7+E18)/100))*(1+E23/100)*(1+E25/100))/(1-D12/100)-1)*100,2)","v":22.37},"%"]
[null," "]
["(*) ISS CONFORME LEI MUNICIPAL Nº 1241 / 2017 - DECLARAÇÃO EM ANEXO, \nAPLICANDO-SE A DEDUÇÃO PREVISTA NO §12 DO ART. 120 REFERENTE AOS MATERIAIS \n(50% SEM NECESSIDADE DE COMPROVAÇÃO)"]
[]
[]
[]
["BDI EM CONFORMIDADE COM OS ACÓRDÃOS Nº 2369/2011 e ACÓRDÃO Nº 2.622/2013 - TCU - PLENÁRIO"]

{"sheet":"BDI FORN","index":3,"n_rows":37,"n_cols":5,"rows_kept":37,"cut":false,"hidden":false,"merged":[[32,0,34,5],[36,0,36,5],[0,1,2,4],[3,1,4,1],[3,2,4,2],[28,0,28,5],[30,1,30,2],[31,1,31,2]]}
[null,"DETALHAMENTO DO BDI - FORNECIMENTO \n(MATERIAL ASFÁLTICO)"]
[]
[]
[null,"Item","Descrição dos Serviços","%","%"]
[null,null,null,"PV","CD"]
[]
[null,1,"ADMINISTRAÇÃO CENTRAL"," ",3.72]
[null,"1.1","ESCRITÓRIO CENTRAL"," "," "]
[null,"1.2","VIAGENS"," "," "]
[null,"1.3","OUTROS"," "," "]
[null," "," "," "," "]
[null,2,"IMPOSTOS E TAXAS",{"$f":"SUM(D13:D16)","v":3.65},{"$f":"SUM(E13:E16)","v":4.5600000000000005}]
[null,"2.1","ISS (*)",null,{"$f":"ROUND(D13*1.2515,2)","v":0}]
[null,"2.2","PIS",0.65,0.81]
[null,"2.3","Cofins",3,3.75]
[null,"2.4","CONTRIBUIÇÃO PREVIDENCIÁRIA SOBRE A RENDA BRUTA",0,0]
[]
[null,3,"TAXA DE RISCO"," ",{"$f":"SUM(E19:E22)","v":0.82000000000000006}]
[null,"3.1","SEGURO",null,0.16]
[null,"3.2","RISCO",null,0.5]
[null,"3.3","GARANTIA",null,0.16]
[]
[null,4,"DESPESAS FINANCEIRAS"," ",0.94]
[]
[null,5,"LUCRO",null,5]
[]
[null," ","BDI - CALCULADO"," ",{"$f":"ROUND((((1+(E7+E18)/100)*(1+E23/100)*(1+E25/100)/(1-D12/100)-1)*100),2)","v":15}]
[]
["BDI = ((1+((AC+S+R+G)/100))x(1+DF/100)x(1+L/100)/(1-I/100)-1)*100"]
[]
[null,"BDI (CALCULADO):",null,{"$f":"ROUND((((1+((E7+E18)/100))*(1+E23/100)*(1+E25/100))/(1-D12/100)-1)*100,2)","v":15},"%"]
[null," "]
[]
[]
[]
[]
["BDI EM CONFORMIDADE COM OS ACÓRDÃOS Nº 2369/2011 e ACÓRDÃO Nº 2.622/2013 - TCU - PLENÁRIO"]

{"sheet":"CRONOGRAMA","index":4,"n_rows":21,"n_cols":10,"rows_kept":21,"cut":false,"hidden":false,"merged":[[17,1,18,2],[20,1,24,9],[9,1,10,1],[11,1,12,1],[15,0,16,0],[15,1,16,1],[15,2,16,2],[13,1,14,1],[13,2,14,2],[13,0,14,0],[7,0,8,0],[9,0,10,0],[11,0,12,0],[0,1,0,9],[1,6,1,9],[2,6,2,9],[3,1,3,6],[5,0,6,0],[5,2,6,2],[1,1,2,1],[5,1,6,1],[1,2,2,4],[7,2,8,2],[9,2,10,2],[11,2,12,2],[7,1,8,1]]}
[null,"CRONOGRAMA FÍSICO-FINANCEIRO"]
[null,"OBRA: ",{"$f":"ORÇAMENTO!C5","v":" PAVIMENTAÇÃO ASFÁLTICA EM CBUQ - ESTRADA PARA MUQUÉM - TRECHO 1 (EST.90  ATÉ EST.145)"},null,null,"VALOR:",{"$f":"ORÇAMENTO!I46","v":955413.92999999993}]
[{"$nulls":5},"PRAZO: ","120 DIAS "]
[]
[null,"ITEM","ETAPAS/DESCRIÇAO","FISICO/  FINANCEIRO","TOTAL    ETAPAS","MÊS 1","MÊS 2","MÊS 3","MÊS 4","TOTAL"]
["A",{"$f":"VLOOKUP(A6,ORÇAMENTO!$A$9:$I$46,2)","v":1},{"$f":"VLOOKUP(A6,ORÇAMENTO!$A$9:$I$46,3)","v":"SERVIÇOS PRELIMINARES "},"FISICO ",{"$f":"ROUND(E7/$G$2,4)","v":9.9599999999999994E-2},0.2,0.3,0.3,0.2,{"$f":"SUM(F6:I6)","v":1}]
[null,null,null,"FINANCEIRO",{"$f":"ORÇAMENTO!I9","v":95204.06},{"$f":"ROUND($E$7*F6,2)","v":19040.810000000001},{"$f":"ROUND($E$7*G6,2)","v":28561.22},28561.22,{"$f":"ROUND($E$7*I6,2)","v":19040.810000000001},95204.06]
["B",{"$f":"VLOOKUP(A8,ORÇAMENTO!$A$9:$I$46,2)","v":2},{"$f":"VLOOKUP(A8,ORÇAMENTO!$A$9:$I$46,3)","v":"TERRAPLANAGEM E PAVIMENTAÇÃO"},"FISICO ",{"$f":"ROUND(E9/$G$2,4)","v":0.2712},0.1,0.4,0.4,0.1,1]
[null,null,null,"FINANCEIRO",{"$f":"ORÇAMENTO!I15","v":259155.24},{"$f":"ROUND($E$9*F8,2)","v":25915.52},{"$f":"ROUND($E$9*G8,2)","v":103662.1},103662.1,{"$f":"ROUND($E$9*I8,2)","v":25915.52},259155.24000000002]
["C",{"$f":"VLOOKUP(A10,ORÇAMENTO!$A$9:$I$46,2)","v":3},{"$f":"VLOOKUP(A10,ORÇAMENTO!$A$9:$I$46,3)","v":"TRANSPORTE DE MATERIAIS"},"FISICO ",{"$f":"ROUND(E11/$G$2,4)","v":1.5100000000000001E-2},0.1,0.4,0.4,0.1,1]
[null,null,null,"FINANCEIRO",{"$f":"ORÇAMENTO!I24","v":14382.98},{"$f":"ROUND($E$11*F10,2)","v":1438.3},{"$f":"ROUND($E$11*G10,2)","v":5753.19},5753.19,{"$f":"ROUND($E$11*I10,2)","v":1438.3},14382.98]
["E",{"$f":"VLOOKUP(A12,ORÇAMENTO!$A$9:$I$46,2)","v":4},{"$f":"VLOOKUP(A12,ORÇAMENTO!$A$9:$I$46,3)","v":"OBRAS COMPLEMENTARES E SINALIZAÇÃO"},"FISICO ",{"$f":"ROUND(E13/$G$2,4)","v":8.3900000000000002E-2},0.25,0.25,0.25,0.25,1]
[null,null,null,"FINANCEIRO",{"$f":"ORÇAMENTO!I27","v":80128.950000000012},{"$f":"ROUND($E$13*F12,2)","v":20032.240000000002},{"$f":"ROUND($E$13*G12,2)","v":20032.240000000002},20032.240000000002,{"$f":"ROUND($E$13*I12,2)","v":20032.240000000002},80128.960000000006]
["F",{"$f":"VLOOKUP(A14,ORÇAMENTO!$A$9:$I$46,2)","v":5},{"$f":"VLOOKUP(A14,ORÇAMENTO!$A$9:$I$46,3)","v":"TRANSPORTE - MATERIAL ASFÁLTICO (BDI DIFERENCIADO)"},"FISICO ",{"$f":"ROUND(E15/$G$2,4)","v":2.7400000000000001E-2},0.1,0.4,0.4,0.1,1]
[null,null,null,"FINANCEIRO",{"$f":"ORÇAMENTO!I39","v":26168.030000000002},{"$f":"ROUND($E$15*F14,2)","v":2616.8000000000002},{"$f":"ROUND($E$15*G14,2)","v":10467.209999999999},{"$f":"ROUND($E$15*H14,2)","v":10467.209999999999},{"$f":"ROUND($E$15*I14,2)","v":2616.8000000000002},26168.019999999997]
["G",{"$f":"VLOOKUP(A16,ORÇAMENTO!$A$9:$I$46,2)","v":6},{"$f":"VLOOKUP(A16,ORÇAMENTO!$A$9:$I$46,3)","v":"FORNECIMENTOS - MATERIAL ASFÁLTICO (BDI DIFERENCIADO)"},"FISICO ",{"$f":"ROUND(E17/$G$2,4)","v":0.50280000000000002},0.1,0.4,0.4,0.1,1]
[null,null,null,"FINANCEIRO",{"$f":"ORÇAMENTO!I42","v":480374.67},{"$f":"ROUND($E$17*F16,2)","v":48037.47},{"$f":"ROUND($E$17*G16,2)","v":192149.87},{"$f":"ROUND($E$17*H16,2)","v":192149.87},{"$f":"ROUND($E$17*I16,2)","v":48037.47},480374.67999999993]
[null,"TOTAL",null,"FISICO ",{"$f":"SUM(F18:I18)","v":1.0000000104666678},{"$f":"F19/E19","v":0.12254493714572491},{"$f":"G19/E19","v":0.37745506808760892},{"$f":"H19/E19","v":0.37745506808760892},{"$f":"I19/E19","v":0.12254493714572491},1.0000000104666678]
[null,null,null,"FINANCEIRO",{"$f":"E11+E9+E7+E13+E17+E15","v":955413.92999999993},{"$f":"F11+F9+F7+F13+F17+F15","v":117081.14000000001},360625.83,360625.83,117081.14000000001,{"$f":"SUM(F19:I19)-0.01","v":955413.93}]
[]
[null,"OBSERVAÇÕES:"]