{"text_format":"2","workbook":"xlsx","n_sheets":5,"sheets":["ORÇAMENTO","CPU","BDI SERV","BDI FORN","CRONOGRAMA"],"not_rendered":{"charts":0,"images":2,"macros":0,"external_links":0,"defined_names":5,"comments":1,"pivot_tables":0},"unopened":[],"bounds":{"document_bytes":16777216,"sheet_cells":100000,"run_cost":"one","rows_first":2000,"rows_last":500,"rows_between":2000,"halvings":0,"cell_chars":16384,"cell_head_chars":4096},"cells_cut":0,"cells_raw":0,"read":"whole","date_system":"1900"}

{"sheet":"ORÇAMENTO","index":0,"n_rows":43,"n_cols":9,"rows_kept":43,"cut":false,"hidden":false,"merged":[[15,10,16,10],[45,8,46,8],[6,3,6,7],[0,0,7,0],[0,2,0,8],[1,2,1,8],[2,2,2,8],[4,2,4,8],[5,6,5,7],[6,1,6,2],[42,1,42,7]]}
["<---- NUMERAR SERVIÇOS PARA CPU",null,"Ministério do Desenvolvimento Regional"]
[null,null,"Companhia de Desenvolvimento dos Vales do São Francisco e do Parnaíba"]
[null,null,"1ª Superintendência Regional"]
[]
[null,"OBRA: "," PAVIMENTAÇÃO ASFÁLTICA EM CBUQ - ESTRADA PARA MUQUÉM - TRECHO 2 (EST.145  ATÉ EST.250)"]
[null,"DATA:","JULHO DE 2023",null,null,null,"BDI Serviços:",null,{"$f":"'BDI SERV'!D31/100","v":0.22370000000000001}]
[null,"PRAZO DE EXECUÇÃO:     180 DIAS",null,"BDI Fornecimento e Transporte - Insumos Asfálticos:",{"$nulls":4},{"$f":"'BDI FORN'!D31/100","v":0.15}]
[null,"ITEM","DISCRIMINAÇÃO",null,"UNID.","QUANT.","P. UNITÁRIO","P.UNIT.C/ BDI","P. TOTAL"]
["A",1,"SERVIÇOS PRELIMINARES ",{"$nulls":5},{"$f":"SUM(I10:I14)","v":139724.03000000003}]
[1,"1.1","MOBILIZAÇÃO E DESMOBILIZAÇÃO","CPU.1","GL",1,{"$f":"VLOOKUP(A10,CPU!$A$1:$N$4735,9)","v":6180.16},{"$f":"VLOOKUP(A10,CPU!$A$1:$N$4735,10)","v":7562.6617919999999},{"$f":"ROUND(F10*H10,2)","v":7562.66}]
[2,"1.2","ADMINISTRAÇÃO LOCAL","CPU.2","GL",1,{"$f":"VLOOKUP(A11,CPU!$A$1:$N$4735,9)","v":94912.320000000007},{"$f":"VLOOKUP(A11,CPU!$A$1:$N$4735,10)","v":116144.20598400001},{"$f":"ROUND(F11*H11,2)","v":116144.21}]
[3,"1.3","CANTEIRO DE OBRAS","CPU.3","GL",1,{"$f":"VLOOKUP(A12,CPU!$A$1:$N$4735,9)","v":6849},{"$f":"VLOOKUP(A12,CPU!$A$1:$N$4735,10)","v":8381.1213000000007},{"$f":"ROUND(F12*H12,2)","v":8381.1200000000008}]
[4,"1.4","PLACA DE OBRA EM CHAPA DE AÇO GALVANIZADO",103689,"M2",2,{"$f":"VLOOKUP(A13,CPU!$A$1:$N$4735,9)","v":308.06},{"$f":"VLOOKUP(A13,CPU!$A$1:$N$4735,10)","v":376.97302200000001},{"$f":"ROUND(F13*H13,2)","v":753.95}]
[5,"1.5","SERVIÇOS TOPOGRÁFICOS PARA PAVIMENTAÇÃO, INCLUSIVE NOTA DE SERVIÇO, ACOMPANHAMENTO E GREIDE",78472,"M2",15200,{"$f":"VLOOKUP(A14,CPU!$A$1:$N$4735,9)","v":0.37},{"$f":"VLOOKUP(A14,CPU!$A$1:$N$4735,10)","v":0.45276899999999998},{"$f":"ROUND(F14*H14,2)","v":6882.09}]
["B",2,"TERRAPLANAGEM E PAVIMENTAÇÃO",{"$nulls":5},{"$f":"SUM(I16:I23)","v":484879.59}]
[6,"2.1","ESCAVAÇÃO HORIZONTAL EM SOLO DE 1A CATEGORIA",101116,"M3",7199.9999999999991,{"$f":"VLOOKUP(A16,CPU!$A$1:$N$4735,9)","v":1.87},{"$f":"VLOOKUP(A16,CPU!$A$1:$N$4735,10)","v":2.288319},{"$f":"ROUND(F16*H16,2)","v":16475.900000000001}]
[7,"2.2","CARGA, MANOBRA E DESCARGA DE AGREGADOS OU SOLOS EM CAMINHÃO BASCULANTE - DESCARGA LIVRE",5914351,"M3",7199.9999999999991,{"$f":"VLOOKUP(A17,CPU!$A$1:$N$4735,9)","v":1.8440370986088019},{"$f":"VLOOKUP(A17,CPU!$A$1:$N$4735,10)","v":2.2565481975675907},{"$f":"ROUND(F17*H17,2)","v":16247.15}]
[8,"2.3","REGULARIZAÇÃO E COMPACTAÇÃO DE SUBLEITO",4011209,"M2",15200,{"$f":"VLOOKUP(A18,CPU!$A$1:$N$4735,9)","v":0.8648084497873062},{"$f":"VLOOKUP(A18,CPU!$A$1:$N$4735,10)","v":1.0582661000047267},16085.64]
[9,"2.4","COMPACTAÇÃO DE ATERROS A 100% DOP PROCTOR NORMAL",5502978,"M3",599.99999999999955,{"$f":"VLOOKUP(A19,CPU!$A$1:$N$4735,9)","v":4.1581796670630204},{"$f":"VLOOKUP(A19,CPU!$A$1:$N$4735,10)","v":5.0883644585850183},{"$f":"ROUND(F19*H19,2)","v":3053.02}]
[10,"2.5","BASE OU SUB-BASE DE BICA CORRIDA COM BRITA COMERCIAL","4011276a","M3",3040,{"$f":"VLOOKUP(A20,CPU!$A$1:$N$4735,9)","v":107.31211107969607},{"$f":"VLOOKUP(A20,CPU!$A$1:$N$4735,10)","v":131.31783032822409},399206.2]
[11,"2.6","IMPRIMAÇÃO COM ASFALTO DILUIDO CM-30",4011351,"M2",15200,{"$f":"VLOOKUP(A21,CPU!$A$1:$N$4735,9)","v":0.34250000000000003},{"$f":"VLOOKUP(A21,CPU!$A$1:$N$4735,10)","v":0.41911725000000005},6370.58]
[12,"2.7","PINTURA DE LIGAÇÃO COM EMULSÃO ASFÁLTICA RR-2C",4011353,"M2",12600,{"$f":"VLOOKUP(A22,CPU!$A$1:$N$4735,9)","v":0.25690000000000002},{"$f":"VLOOKUP(A22,CPU!$A$1:$N$4735,10)","v":0.31436853000000003},3961.04]
[13,"2.8","EXECUÇÃO DE PAVIMENTO COM APLICAÇÃO DE CONCRETO ASFÁLTICO USINADO A QUENTE (CBUQ), CAMADA DE ROLAMENTO - EXCLUSIVE FORNECIMENTO E TRANSPORTE",4011463,"T",1150,{"$f":"VLOOKUP(A23,CPU!$A$1:$N$4735,9)","v":16.685004417670683},{"$f":"VLOOKUP(A23,CPU!$A$1:$N$4735,10)","v":20.417439905903613},23480.06]
["C",3,"TRANSPORTE DE MATERIAIS",{"$nulls":5},{"$f":"SUM(I25:I26)","v":44116.15}]
[14,"3.1","TRANSPORTE COM CAMINHÃO BASCULANTE, EM VIA URBANA EM REVESTIMENTO PRIMÁRIO",5901638,"M3XKM",37003.913082824489,{"$f":"VLOOKUP(A25,CPU!$A$1:$N$4735,9,0)","v":0.62485229808121379},{"$f":"VLOOKUP(A25,CPU!$A$1:$N$4735,10)","v":0.76463175716198128},{"$f":"ROUND(F25*H25,2)","v":28294.37}]
[15,"3.2","TRANSPORTE COM CAMINHÃO BASCULANTE, EM VIA URBANA PAVIMENTADA",5901640,"M3XKM",27500.004209315201,{"$f":"VLOOKUP(A26,CPU!$A$1:$N$4735,9,0)","v":0.47016213000148743},{"$f":"VLOOKUP(A26,CPU!$A$1:$N$4735,10,0)","v":0.57533739848282017},{"$f":"ROUND(F26*H26,2)","v":15821.78}]
["E",4,"OBRAS COMPLEMENTARES E SINALIZAÇÃO",{"$nulls":5},{"$f":"SUM(I28:I35)","v":81769.89}]
[17,"4.1","DESCIDA D’ÁGUA DE ATERROS EM DEGRAUS - DAD 04 - AREIA E BRITA COMERCIAIS",2003411,"M2",9,{"$f":"VLOOKUP(A28,CPU!$A$1:$N$4735,9,0)","v":608.04999999999984},{"$f":"VLOOKUP(A28,CPU!$A$1:$N$4735,10,0)","v":744.07078499999977},{"$f":"ROUND(F28*H28,2)","v":6696.64}]
[18,"4.2","ENRONCAMENTO DE PEDRA ARRUMADA MANUALMENTE - PEDRA DE MÃO COMERCIAL - FORNECIMENTO E ASSENTAMENTO ",1505879,"M3",2.9995999999999996,{"$f":"VLOOKUP(A29,CPU!$A$1:$N$4735,9,0)","v":235.94},{"$f":"VLOOKUP(A29,CPU!$A$1:$N$4735,10,0)","v":288.71977800000002},{"$f":"ROUND(F29*H29,2)","v":866.04}]
[22,"4.3","SAÍDA D'ÁGUA EM TALUDES DE CORTE E ATERRO (SDA E SDC) - AREIA E BRITA COMERCIAIS","RO-46167a","UNID",3,{"$f":"VLOOKUP(A30,CPU!$A$1:$N$4735,9,0)","v":313.69},{"$f":"VLOOKUP(A30,CPU!$A$1:$N$4735,10,0)","v":383.86245300000002},{"$f":"ROUND(F30*H30,2)","v":1151.5899999999999}]
[23,"4.4","SARJETA DE CONCRETO EM CORTE - SCC 50/20","2003349a","M",680,{"$f":"VLOOKUP(A31,CPU!$A$1:$N$4735,9,0)","v":29.69},{"$f":"VLOOKUP(A31,CPU!$A$1:$N$4735,10,0)","v":36.331653000000003},{"$f":"ROUND(F31*H31,2)","v":24705.52}]
[25,"4.5","PINTURA DE FAIXA COM TINTA ACRÍLICA - ESPESSURA DE 0,4MM",5213400,"M2",680,{"$f":"VLOOKUP(A32,CPU!$A$1:$N$4735,9,0)","v":27.583385101937086},{"$f":"VLOOKUP(A32,CPU!$A$1:$N$4735,10,0)","v":33.753788349240409},{"$f":"ROUND(F32*H32,2)","v":22952.58}]
[26,"4.6","PLACA DE REGULAMENTAÇÃO EM AÇO, PELÍCULA RETRORREFLETIVA TIPO I+SI, INCLUSIVE SUPORTE METÁLICO - FORNECIMENTO E IMPLANTAÇÃO","5213440+\n5213863","UNID",28,{"$f":"VLOOKUP(A33,CPU!$A$1:$N$4735,9,0)","v":524.74},{"$f":"VLOOKUP(A33,CPU!$A$1:$N$4735,10,0)","v":642.12433799999997},17979.48]
[27,"4.7","RECOMPOSIÇÃO PARCIAL DE CERCA COM MOURÃO DE MADEIRA - ARAME E MOURÃO","4915732+\n4915731","M",210,{"$f":"VLOOKUP(A34,CPU!$A$1:$N$4735,9,0)","v":22.17},{"$f":"VLOOKUP(A34,CPU!$A$1:$N$4735,10,0)","v":27.129429000000002},{"$f":"ROUND(F34*H34,2)","v":5697.18}]
[28,"4.8","DESMATAMENTO, DESTOCAMENTO, LIMPEZA DE ÁREA E ESTOCAGEM DO MATERIAL DE LIMPEZA COM ARVORES DE DIÂMETRO ATÉ 0,15M",5501700,"M2",8400,{"$f":"VLOOKUP(A35,CPU!$A$1:$N$4735,9,0)","v":0.16741361201897045},{"$f":"VLOOKUP(A35,CPU!$A$1:$N$4735,10,0)","v":0.20486403702761413},{"$f":"ROUND(F35*H35,2)","v":1720.86}]
[null,5,"TRANSPORTE - MATERIAL ASFÁLTICO (BDI DIFERENCIADO)",{"$nulls":5},{"$f":"SUM(I37:I38)","v":50822.29}]
[30,"5.1","TRANSPORTE COM CAMINHÃO TANQUE DE TRANSPORTE DE MATERIAL ASFÁLTICO DE 30000 L, EM VIA URBANA PAVIMENTADA",102331,"TXKM",12000,{"$f":"VLOOKUP(A37,CPU!$A$1:$N$4735,9,0)","v":0.47},{"$f":"VLOOKUP(A37,CPU!$A$1:$N$4735,10,0)","v":0.54049999999999998},{"$f":"ROUND(F37*H37,2)","v":6486}]
[31,"5.2","TRANSPORTE MASSA ASFÁLTICA COM CAMINHÃO BASCULANTE, EM VIA URBANA PAVIMENTADA","5901640a","TXKM",82000,{"$f":"VLOOKUP(A38,CPU!$A$1:$N$4735,9,0)","v":0.47016213000148743},{"$f":"VLOOKUP(A38,CPU!$A$1:$N$4735,10,0)","v":0.54068644950171052},{"$f":"ROUND(F38*H38,2)","v":44336.29}]
["G",6,"FORNECIMENTOS - MATERIAL ASFÁLTICO (BDI DIFERENCIADO)",{"$nulls":5},{"$f":"SUM(I40:I42)","v":917761.59}]
[32,"6.1","AQUISIÇÃO DE ASFALTO DILUIDO DE PETROLEO CM-30 - EXCLUSIVE TRANSPORTE","CPU.4","T",18.500000000000004,{"$f":"VLOOKUP(A40,CPU!$A$1:$N$4735,9)","v":4920.43},{"$f":"VLOOKUP(A40,CPU!$A$1:$N$4735,10)","v":5658.4944999999998},{"$f":"ROUND(F40*H40,2)","v":104682.15}]
[33,"6.2","AQUISIÇÃO DE EMULSAO ASFALTICA CATIONICA RR-1C - EXCLUSIVE TRANSPORTE","CPU.5","T",6,{"$f":"VLOOKUP(A41,CPU!$A$1:$N$4735,9)","v":2837.6},{"$f":"VLOOKUP(A41,CPU!$A$1:$N$4735,10)","v":3263.24},{"$f":"ROUND(F41*H41,2)","v":19579.439999999999}]
[34,"6.3","AQUISIÇÃO DE CONCRETO BETUMINOSO USINADO A QUENTE (CBUQ) PARA PAVIMENTACAO ASFALTICA, PADRAO DNIT, FAIXA C, COM CAP 50/70 - EXCLUSIVE TRANSPORTE","CPU.6","T",1150,{"$f":"VLOOKUP(A42,CPU!$A$1:$N$4735,9)","v":600},{"$f":"VLOOKUP(A42,CPU!$A$1:$N$4735,10)","v":690},{"$f":"ROUND(F42*H42,2)","v":793500}]
[null,"TOTAL GERAL DA OBRA COM BDI ",{"$nulls":6},{"$f":"SUM(I9,I15,I24,I27,I36,I39)","v":1719073.54}]

{"sheet":"CPU","index":1,"n_rows":434,"n_cols":13,"rows_kept":434,"cut":false,"hidden":false,"merged":[[297,1,297,7],[302,1,302,3],[302,5,302,6],[303,1,303,6],[304,1,304,6],[305,1,305,6],[361,0,373,0],[361,1,361,3],[361,4,361,7],[362,2,362,5],[363,2,363,3],[364,1,364,7],[370,1,370,3],[370,5,370,6],[371,1,371,6],[372,1,372,6],[373,1,373,6],[345,0,359,0],[345,1,345,3],[345,4,345,7],[346,2,346,5],[347,2,347,3],[348,1,348,7],[356,1,356,3],[356,5,356,6],[357,1,357,6],[358,1,358,6],[359,1,359,6],[326,0,343,0],[326,1,326,3],[326,4,326,7],[327,2,327,5],[328,2,328,3],[329,1,329,7],[340,1,340,3],[340,5,340,6],[341,1,341,6],[342,1,342,6],[343,1,343,6],[281,2,281,5],[282,2,282,3],[283,1,283,7],[289,1,289,3],[289,5,289,6],[290,1,290,6],[291,1,291,6],[292,1,292,6],[307,0,324,0],[307,1,307,3],[307,4,307,7],[308,2,308,5],[309,2,309,3],[310,1,310,7],[321,1,321,3],[321,5,321,6],[322,1,322,6],[323,1,323,6],[324,1,324,6],[294,0,305,0],[294,1,294,3],[294,4,294,7],[295,2,295,5],[296,2,296,3],[224,0,235,0],[237,0,248,0],[199,1,199,3],[199,5,199,6],[204,4,204,7],[189,2,189,3],[205,2,205,5],[206,2,206,3],[207,1,207,7],[200,1,200,6],[201,1,201,6],[202,1,202,6],[204,0,223,0],[146,1,146,6],[248,1,248,6],[168,1,168,6],[224,1,224,3],[224,4,224,7],[204,1,204,3],[148,1,148,3],[148,4,148,7],[149,2,149,5],[150,2,150,3],[151,1,151,7],[220,1,220,6],[219,1,219,3],[219,5,219,6],[126,1,126,3],[126,4,126,7],[127,2,127,5],[128,2,128,3],[129,1,129,7],[143,1,143,3],[143,5,143,6],[144,1,144,6],[145,1,145,6],[45,10,45,11],[46,2,46,5],[245,1,245,3],[245,5,245,6],[246,1,246,6],[247,1,247,6],[28,1,28,6],[29,1,29,6],[30,1,30,6],[102,1,102,6],[90,1,90,3],[90,4,90,7],[91,2,91,5],[92,2,92,3],[93,1,93,7],[99,1,99,3],[99,5,99,6],[100,1,100,6],[101,1,101,6],[32,1,32,3],[32,4,32,7],[43,1,43,6],[45,1,45,3],[45,4,45,7],[32,10,32,11],[33,2,33,5],[34,2,34,3],[35,1,35,7],[33,8,34,9],[40,1,40,3],[40,5,40,6],[41,1,41,6],[42,1,42,6],[11,1,11,6],[12,1,12,6],[14,1,14,3],[14,4,14,7],[14,10,14,11],[15,2,15,5],[16,2,16,3],[17,1,17,7],[27,1,27,3],[27,5,27,6],[15,8,16,9],[0,1,0,3],[0,4,0,7],[0,10,0,11],[1,2,1,5],[2,2,2,3],[3,1,3,7],[9,1,9,3],[9,5,9,6],[10,1,10,6],[1,10,1,11],[47,2,47,3],[48,1,48,7],[57,1,57,3],[57,5,57,6],[58,1,58,6],[59,1,59,6],[60,1,60,6],[62,10,62,11],[63,2,63,5],[62,1,62,3],[62,4,62,7],[104,10,104,11],[105,2,105,5],[104,1,104,3],[104,4,104,7],[95,8,98,8],[64,2,64,3],[65,1,65,7],[72,1,72,3],[72,5,72,6],[73,1,73,6],[74,1,74,6],[75,1,75,6],[77,10,77,11],[78,2,78,5],[77,1,77,3],[77,4,77,7],[79,2,79,3],[80,1,80,7],[85,1,85,3],[85,5,85,6],[86,1,86,6],[87,1,87,6],[88,1,88,6],[204,10,204,11],[106,2,106,3],[107,1,107,7],[121,1,121,3],[121,5,121,6],[187,10,187,11],[122,1,122,6],[123,1,123,6],[124,1,124,6],[170,1,170,3],[170,4,170,7],[170,10,170,11],[171,2,171,5],[172,2,172,3],[173,1,173,7],[182,1,182,3],[182,5,182,6],[183,1,183,6],[184,1,184,6],[185,1,185,6],[187,1,187,3],[187,4,187,7],[188,2,188,5],[190,1,190,7],[224,10,224,11],[225,2,225,5],[226,2,226,3],[227,1,227,7],[385,1,385,6],[383,1,383,6],[384,1,384,6],[221,1,221,6],[222,1,222,6],[232,1,232,3],[232,5,232,6],[233,1,233,6],[234,1,234,6],[237,1,237,3],[237,4,237,7],[238,2,238,5],[239,2,239,3],[240,1,240,7],[375,1,375,3],[376,2,376,5],[377,2,377,3],[378,1,378,7],[382,1,382,3],[382,5,382,6],[0,0,13,0],[14,0,31,0],[32,0,44,0],[45,0,61,0],[62,0,76,0],[77,0,89,0],[104,0,125,0],[170,0,186,0],[187,0,203,0],[90,0,102,0],[126,0,146,0],[148,0,168,0],[375,4,375,7],[250,0,264,0],[250,1,250,3],[250,4,250,7],[251,2,251,5],[252,2,252,3],[253,1,253,7],[261,1,261,3],[261,5,261,6],[375,0,385,0],[266,0,278,0],[266,1,266,3],[266,4,266,7],[267,2,267,5],[268,2,268,3],[269,1,269,7],[275,1,275,3],[275,5,275,6],[276,1,276,6],[277,1,277,6],[278,1,278,6],[280,0,292,0],[280,1,280,3],[280,4,280,7],[400,0,409,0],[411,0,420,0],[411,1,411,3],[411,4,411,7],[412,2,412,5],[413,2,413,3],[414,1,414,7],[417,1,417,3],[417,5,417,6],[387,0,398,0],[387,1,387,3],[387,4,387,7],[388,2,388,5],[389,2,389,3],[390,1,390,7],[395,1,395,3],[395,5,395,6],[396,1,396,6],[397,1,397,6],[398,1,398,6],[422,0,431,0],[422,1,422,3],[422,4,422,7],[423,2,423,5],[424,2,424,3],[425,1,425,7],[428,1,428,3],[428,5,428,6],[429,1,429,6],[430,1,430,6],[431,1,431,6],[161,8,161,10],[426,8,426,11],[262,1,262,6],[263,1,263,6],[264,1,264,6],[418,1,418,6],[419,1,419,6],[420,1,420,6],[400,1,400,3],[400,4,400,7],[401,2,401,5],[402,2,402,3],[403,1,403,7],[406,1,406,3],[406,5,406,6],[407,1,407,6],[408,1,408,6],[409,1,409,6],[165,1,165,3],[165,5,165,6],[166,1,166,6],[167,1,167,6],[235,1,235,6],[209,8,209,9]]}
[1,"CODEVASF",null,null," COMPOSIÇÃO DE PREÇO UNITÁRIO",null,null,null,{"$f":"H11","v":6180.16},{"$f":"H13","v":7562.6617919999999},"BDI CALCULADO:",null,{"$f":"ORÇAMENTO!I6","v":0.22370000000000001}]
[null,"OBRA:  ",{"$f":"ORÇAMENTO!C5","v":" PAVIMENTAÇÃO ASFÁLTICA EM CBUQ - ESTRADA PARA MUQUÉM - TRECHO 2 (EST.145  ATÉ EST.250)"},null,null,null,"DATA: ",{"$f":"ORÇAMENTO!C6","v":"JULHO DE 2023"},null,null,"BDI DIFERENCIADO:",null,{"$f":"'BDI FORN'!D31/100","v":0.15}]
[null,"SERVIÇO:  ",{"$f":"VLOOKUP(A1,ORÇAMENTO!A10:I27,3)","v":"MOBILIZAÇÃO E DESMOBILIZAÇÃO"},null,"Referência:",{"$f":"VLOOKUP(A1,ORÇAMENTO!A10:I27,4)","v":"CPU.1"},"UNIDADE: ",{"$f":"VLOOKUP(A1,ORÇAMENTO!A10:I27,5)","v":"GL"}]
[]
[null,"TIPO ITEM","CODIGO ITEM","DESCRIÇÃO ITEM","UNIDADE ITEM","COEFICIENTE","PRECO UNITARIO","CUSTO TOTAL"]
[null,"COMPOSICAO",89876,"CAMINHÃO BASCULANTE 14 M3, COM CAVALO MECÂNICO DE CAPACIDADE MÁXIMA DE TRAÇÃO COMBINADO DE 36000 KG, POTÊNCIA 286 CV, INCLUSIVE SEMIREBOQUE COM CAÇAMBA METÁLICA","CHP DIURNO.",12,287.48,{"$f":"ROUNDDOWN(F6*G6,2)","v":3449.76}]
[null,"COMPOSICAO",89877,"CAMINHÃO BASCULANTE 14 M3, COM CAVALO MECÂNICO DE CAPACIDADE MÁXIMA DE TRAÇÃO COMBINADO DE 36000 KG, POTÊNCIA 286 CV, INCLUSIVE SEMIREBOQUE COM CAÇAMBA METÁLICA","CHI DIURNO.",6,82.59,{"$f":"ROUNDDOWN(F7*G7,2)","v":495.54}]
[null,"COMPOSICAO",5914640,"TRANSPORTE COM CAVALO MECÂNICO COM SEMIRREBOQUE COM CAPACIDADE DE 30 T - RODOVIA PAVIMENTADA","T.KM",3386,0.59,1997.74]
[null,"COMPOSIÇÃO",88316,"SERVENTE COM ENCARGOS COMPLEMENTARES","H",12,19.760000000000002,237.12]
[null,"PRODUÇÃO DA EQUIPE",null,null,1,"CUSTO ",null,{"$f":"SUM(H6:H9)","v":6180.16}]
[null,"TOTAL",{"$nulls":5},{"$f":"H10/E10","v":6180.16},"OK"]
[null,"BDI                %",{"$nulls":5},{"$f":"1+$M$1","v":1.2237}]
[null,"TOTAL DO SERVIÇO - R$",{"$nulls":5},{"$f":"H11*H12","v":7562.6617919999999}]
[]
[{"$f":"A1+1","v":2},"CODEVASF",null,null," COMPOSIÇÃO DE PREÇO UNITÁRIO",null,null,null,{"$f":"H29","v":94912.320000000007},{"$f":"H31","v":116144.20598400001}]
[null,"OBRA:  ",{"$f":"$C$2","v":" PAVIMENTAÇÃO ASFÁLTICA EM CBUQ - ESTRADA PARA MUQUÉM - TRECHO 2 (EST.145  ATÉ EST.250)"},null,null,null,"DATA: ",{"$f":"$H$2","v":"JULHO DE 2023"}]
[null,"SERVIÇO:  ",{"$f":"VLOOKUP(A15,ORÇAMENTO!$A$10:$I$27,3)","v":"ADMINISTRAÇÃO LOCAL"},null,"SINAPI","CPU","UNIDADE: ",{"$f":"VLOOKUP(A15,ORÇAMENTO!$A$10:$I$27,5)","v":"GL"}]
[]
[null,"TIPO ITEM","CODIGO ITEM","DESCRIÇÃO ITEM","UNIDADE ITEM","COEFICIENTE","PRECO UNITARIO","CUSTO TOTAL"]
[null,"INSUMO",14250,"ENERGIA ELÉTRICA","kwh",80,0.86,{"$f":"ROUNDDOWN(F20*G20,2)","v":68.8}]
[null,"INSUMO",44480,"TARIFA ÁGUA/ESGOTO ","m³",6,16.27,97.62]
[null,"COTAÇÃO","MERC.","TELEFONE (PLANO CONTROLE)","UNID",2,60,120]
[null,"COMPOSICAO",90777,"Engenheiro Civil Júnior com encargos complementares","H",40,114.12,4564.8]
[null,"COMPOSICAO",90776,"Encarregado Geral com encargos complementares","H",110,57.73,6350.3]
[null,"COMPOSICAO",88321,"Tecnico de Laboratório com encargos complementares","H",40,45.67,1826.8]
[null,"COMPOSICAO",100309,"Tecnico de Segurança do Trabalho com encargos complementares","H",40,45.93,{"$f":"ROUNDDOWN(F26*G26,2)","v":1837.2}]
[null,"COMPOSICAO",90772,"Auxiliar de escritório com encargos complementares","H",40,23.83,953.2]
[null,"PRODUÇÃO DA EQUIPE",null,null,{"$f":"1/6","v":0.16666666666666666},"CUSTO ",null,{"$f":"SUM(H20:H27)","v":15818.720000000001}]
[null,"TOTAL",{"$nulls":5},{"$f":"H28/E28","v":94912.320000000007},"OK"]
[null,"BDI                %",{"$nulls":5},{"$f":"1+$M$1","v":1.2237}]
[null,"TOTAL DO SERVIÇO - R$",{"$nulls":5},{"$f":"H29*H30","v":116144.20598400001}]
[]
[{"$f":"A15+1","v":3},"CODEVASF",null,null," COMPOSIÇÃO DE PREÇO UNITÁRIO",null,null,null,{"$f":"H42","v":6849},{"$f":"H44","v":8381.1213000000007}]
[null,"OBRA:  ",{"$f":"$C$2","v":" PAVIMENTAÇÃO ASFÁLTICA EM CBUQ - ESTRADA PARA MUQUÉM - TRECHO 2 (EST.145  ATÉ EST.250)"},null,null,null,"DATA: ",{"$f":"$H$2","v":"JULHO DE 2023"}]
[null,"SERVIÇO:  ",{"$f":"VLOOKUP(A33,ORÇAMENTO!$A$10:$I$27,3)","v":"CANTEIRO DE OBRAS"},null,"SINAPI",{"$f":"VLOOKUP(A33,ORÇAMENTO!$A$10:$I$27,4)","v":"CPU.3"},"UNIDADE: ",{"$f":"VLOOKUP(A33,ORÇAMENTO!$A$10:$I$27,5)","v":"GL"}]
[]
[null,"TIPO ITEM","CODIGO ITEM","DESCRIÇÃO ITEM","UNIDADE ITEM","COEFICIENTE","PRECO UNITARIO","CUSTO TOTAL"]
[null,"INSUMO",10775,"ALUGUEL DE IMÓVEL OU CONTEINER QUE ATENDA AOS REQUISITOS MÍNIMOS PARA INSTALAÇÃO DO CANTEIRO DE OBRAS","MÊS",6,1040,{"$f":"ROUNDDOWN(F38*G38,2)","v":6240}]
[null,"INSUMO","37525","TELA PLASTICA TECIDA LISTRADA BRANCA E LARANJA, TIPO GUARDA CORPO, EM POLIETILENO MONOFILADO, ROLO 1,20 X 50 M (L X C)","M",100,3.69,{"$f":"ROUNDDOWN(F39*G39,2)","v":369}]
[null,"COMPOSICAO"," - ","PLACA DE SINALIZAÇÃO - \"PERIGO - OBRAS A FRENTE\" - FORNECIMENTO E MOVIMENTAÇÃO","UNID.",12,20,240]
[null,"PRODUÇÃO DA EQUIPE",null,null,1,"CUSTO ",null,{"$f":"SUM(H38:H40)","v":6849}]
[null,"TOTAL",{"$nulls":5},{"$f":"H41/E41","v":6849},"OK"]
[null,"BDI                %",{"$nulls":5},{"$f":"1+$M$1","v":1.2237}]
[null,"TOTAL DO SERVIÇO - R$",{"$nulls":5},{"$f":"H42*H43","v":8381.1213000000007}]
[]
[{"$f":"A33+1","v":4},"CODEVASF",null,null," COMPOSIÇÃO DE PREÇO UNITÁRIO",null,null,null,{"$f":"H59","v":308.06},{"$f":"H61","v":376.97302200000001}]
[null,"OBRA:  ",{"$f":"$C$2","v":" PAVIMENTAÇÃO ASFÁLTICA EM CBUQ - ESTRADA PARA MUQUÉM - TRECHO 2 (EST.145  ATÉ EST.250)"},null,null,null,"DATA: ",{"$f":"$H$2","v":"JULHO DE 2023"}]
[null,"SERVIÇO:  ",{"$f":"VLOOKUP(A46,ORÇAMENTO!$A$10:$I$27,3)","v":"PLACA DE OBRA EM CHAPA DE AÇO GALVANIZADO"},null,"SINAPI",{"$f":"VLOOKUP(A46,ORÇAMENTO!$A$10:$I$27,4)","v":103689},"UNIDADE: ",{"$f":"VLOOKUP(A46,ORÇAMENTO!$A$10:$I$27,5)","v":"M2"}]
[]
[null,"TIPO ITEM","CODIGO ITEM","DESCRIÇÃO ITEM","UNIDADE ITEM","COEFICIENTE","PRECO UNITARIO","CUSTO TOTAL"]
[null,"INSUMO","4509","SARRAFO *2,5 X 10* CM EM PINUS, MISTA OU EQUIVALENTE DA REGIAO - BRUTA","M","3,2083000","4,39",{"$f":"ROUNDDOWN(F51*G51,2)","v":14.08}]
[null,"INSUMO","4813","PLACA DE OBRA (PARA CONSTRUCAO CIVIL) EM CHAPA GALVANIZADA *N. 22*, ADESIVADA, DE *2,4 X 1,2* M (SEM POSTES PARA FIXACAO)","M2","1,0000000","250,00",250]
[null,"INSUMO","5065","PREGO DE ACO POLIDO COM CABECA 10 X 10 (7/8 X 17)","KG","0,0113000","38,80",0.43]
[null,"INSUMO","5069","PREGO DE ACO POLIDO COM CABECA 17 X 27 (2 1/2 X 11)","KG","0,0132000","20,79",0.27]
[null,"COMPOSICAO","88262","CARPINTEIRO DE FORMAS COM ENCARGOS COMPLEMENTARES","H","0,3729000","27,05",10.08]
[null,"COMPOSICAO","88316","SERVENTE COM ENCARGOS COMPLEMENTARES","H","1,1186000","19,76",22.1]
[null,"COMPOSICAO","102234","PINTURA IMUNIZANTE PARA MADEIRA, 2 DEMÃOS","M2","0,5000000","22,20",11.1]
[null,"PRODUÇÃO DA EQUIPE",null,null,1,"CUSTO ",null,{"$f":"SUM(H51:H57)","v":308.06}]
[null,"TOTAL",{"$nulls":5},{"$f":"H58/E58","v":308.06},"OK"]
[null,"BDI                %",{"$nulls":5},{"$f":"1+$M$1","v":1.2237}]
[null,"TOTAL DO SERVIÇO - R$",{"$nulls":5},{"$f":"H59*H60","v":376.97302200000001}]
[]
[{"$f":"A46+1","v":5},"CODEVASF",null,null," COMPOSIÇÃO DE PREÇO UNITÁRIO",null,null,null,{"$f":"H74","v":0.37},{"$f":"H76","v":0.45276899999999998}]
[null,"OBRA:  ",{"$f":"$C$2","v":" PAVIMENTAÇÃO ASFÁLTICA EM CBUQ - ESTRADA PARA MUQUÉM - TRECHO 2 (EST.145  ATÉ EST.250)"},null,null,null,"DATA: ",{"$f":"$H$2","v":"JULHO DE 2023"}]
[null,"SERVIÇO:  ",{"$f":"VLOOKUP(A63,ORÇAMENTO!$A$10:$I$27,3)","v":"SERVIÇOS TOPOGRÁFICOS PARA PAVIMENTAÇÃO, INCLUSIVE NOTA DE SERVIÇO, ACOMPANHAMENTO E GREIDE"},null,"SINAPI",{"$f":"VLOOKUP(A63,ORÇAMENTO!$A$10:$I$27,4)","v":78472},"UNIDADE: ",{"$f":"VLOOKUP(A63,ORÇAMENTO!$A$10:$I$27,5)","v":"M2"}]
[]
[null,"TIPO ITEM","CODIGO ITEM","DESCRIÇÃO ITEM","UNIDADE ITEM","COEFICIENTE","PRECO UNITARIO","CUSTO TOTAL"]
[null,"COMPOSICAO",88253,"AUXILIAR DE TOPÓGRAFO COM ENCARGOS COMPLEMENTARES","H",2.5000000000000001E-3,20.32,{"$f":"ROUNDDOWN(F68*G68,2)","v":0.05}]
[null,"COMPOSICAO",88288,"NIVELADOR COM ENCARGOS COMPLEMENTARES","H",2.5000000000000001E-3,25.4,{"$f":"ROUNDDOWN(F69*G69,2)","v":0.06}]
[null,"COMPOSICAO",88316,"SERVENTE COM ENCARGOS COMPLEMENTARES","H",7.4999999999999997E-3,19.760000000000002,0.14000000000000001]
[null,"COMPOSICAO",88597,"DESENHISTA DETALHISTA COM ENCARGOS COMPLEMENTARES ","H",2E-3,27.95,0.05]
[null,"COMPOSICAO",92145,"CAMINHONETE CABINE SIMPLES COM MOTOR 1.6 FLEX, CÂMBIO MANUAL, POTÊNCIA 101/104 CV, 2 PORTAS","CHP",1E-3,72.790000000000006,7.0000000000000007E-2]
[null,"PRODUÇÃO DA EQUIPE",null,null,1,"CUSTO ",null,{"$f":"SUM(H68:H72)","v":0.37}]
[null,"TOTAL",{"$nulls":5},{"$f":"H73/E73","v":0.37},"OK"]
[null,"BDI                %",{"$nulls":5},{"$f":"1+$M$1","v":1.2237}]
[null,"TOTAL DO SERVIÇO - R$",{"$nulls":5},{"$f":"H74*H75","v":0.45276899999999998}]
[]
[{"$f":"A63+1","v":6},"CODEVASF",null,null," COMPOSIÇÃO DE PREÇO UNITÁRIO",null,null,null,{"$f":"H87","v":1.87},{"$f":"H89","v":2.288319}]
[null,"OBRA:  ",{"$f":"$C$2","v":" PAVIMENTAÇÃO ASFÁLTICA EM CBUQ - ESTRADA PARA MUQUÉM - TRECHO 2 (EST.145  ATÉ EST.250)"},null,null,null,"DATA: ",{"$f":"$H$2","v":"JULHO DE 2023"},null,{"$f":"H90","v":0}]
[null,"SERVIÇO:  ",{"$f":"VLOOKUP(A78,ORÇAMENTO!$A$10:$I$27,3)","v":"ESCAVAÇÃO HORIZONTAL EM SOLO DE 1A CATEGORIA"},null,"SINAPI",{"$f":"VLOOKUP(A78,ORÇAMENTO!$A$10:$I$27,4)","v":101116},"UNIDADE: ",{"$f":"VLOOKUP(A78,ORÇAMENTO!$A$10:$I$27,5)","v":"M3"}]
[]
[null,"TIPO ITEM","CODIGO ITEM","DESCRIÇÃO ITEM","UNIDADE ITEM","COEFICIENTE","PRECO UNITARIO","CUSTO TOTAL"]
[null,"COMPOSICAO","5847","TRATOR DE ESTEIRAS, POTÊNCIA 170 HP, PESO OPERACIONAL 19 T, CAÇAMBA 5,2 M3","CHP","0,0048000","217,11",{"$f":"ROUNDDOWN(F83*G83,2)","v":1.04}]
[null,"COMPOSICAO","5849","TRATOR DE ESTEIRAS, POTÊNCIA 170 HP, PESO OPERACIONAL 19 T, CAÇAMBA 5,2 M3","CHI","0,0082000","71,35",0.57999999999999996]
[null,"COMPOSICAO","88316","SERVENTE COM ENCARGOS COMPLEMENTARES","H","0,0131000","19,76",0.25]
[null,"PRODUÇÃO DA EQUIPE",null,null,1,"CUSTO ",null,{"$f":"SUM(H83:H85)","v":1.87}]
[null,"TOTAL",{"$nulls":5},{"$f":"H86/E86","v":1.87},"OK"]
[null,"BDI                %",{"$nulls":5},{"$f":"1+$M$1","v":1.2237}]
[null,"TOTAL DO SERVIÇO - R$",{"$nulls":5},{"$f":"H87*H88","v":2.288319}]
[]
[7,"CODEVASF",null,null," COMPOSIÇÃO DE PREÇO UNITÁRIO",null,null,null,{"$f":"H101","v":1.8440370986088019},{"$f":"H103","v":2.2565481975675907}]
[null,"OBRA:  ",{"$f":"$C$2","v":" PAVIMENTAÇÃO ASFÁLTICA EM CBUQ - ESTRADA PARA MUQUÉM - TRECHO 2 (EST.145  ATÉ EST.250)"},null,null,null,"DATA: ",{"$f":"$H$2","v":"JULHO DE 2023"}]
[null,"SERVIÇO:  ",{"$f":"VLOOKUP(A91,ORÇAMENTO!$A$10:$I$27,3)","v":"CARGA, MANOBRA E DESCARGA DE AGREGADOS OU SOLOS EM CAMINHÃO BASCULANTE - DESCARGA LIVRE"},null,"SICRO",{"$f":"VLOOKUP(A91,ORÇAMENTO!$A$10:$I$27,4)","v":5914351},"UNIDADE: ",{"$f":"VLOOKUP(A91,ORÇAMENTO!$A$10:$I$27,5)","v":"M3"}]
[]
[null,"TIPO ITEM","CODIGO ITEM","DESCRIÇÃO ITEM","UNIDADE ITEM","COEFICIENTE","PRECO UNITARIO","CUSTO TOTAL"]
[null,"COMPOSICAO","5940","PÁ CARREGADEIRA SOBRE RODAS, POTÊNCIA LÍQUIDA 128 HP, CAPACIDADE DA CAÇAMBA 1,7 A 2,8 M3, PESO OPERACIONAL 11632 KG","CHP",{"$f":"3*0.77","v":2.31},203.1,{"$f":"ROUNDDOWN(F96*G96,2)","v":469.16}]
[null,"COMPOSICAO","5942","PÁ CARREGADEIRA SOBRE RODAS, POTÊNCIA LÍQUIDA 128 HP, CAPACIDADE DA CAÇAMBA 1,7 A 2,8 M3, PESO OPERACIONAL 11632 KG","CHI",{"$f":"3*0.23","v":0.69000000000000006},83.73,57.77]
[null,"COMPOSICAO","89883","CAMINHÃO BASCULANTE 18 M3, COM CAVALO MECÂNICO DE CAPACIDADE MÁXIMA DE TRAÇÃO COMBINADO DE 45000 KG, POTÊNCIA 330 CV, INCLUSIVE SEMIREBOQUE COM CAÇAMBA METÁLICA","CHP",1,316.08999999999997,316.08999999999997]
[null,"COMPOSICAO","89884","CAMINHÃO BASCULANTE 18 M3, COM CAVALO MECÂNICO DE CAPACIDADE MÁXIMA DE TRAÇÃO COMBINADO DE 45000 KG, POTÊNCIA 330 CV, INCLUSIVE SEMIREBOQUE COM CAÇAMBA METÁLICA","CHI",0,86.09,0]
[null,"PRODUÇÃO DA EQUIPE",null,null,457.16,"CUSTO ",null,{"$f":"SUM(H96:H99)","v":843.02}]
[null,"TOTAL",{"$nulls":5},{"$f":"H100/E100","v":1.8440370986088019},"OK"]
[null,"BDI                %",{"$nulls":5},{"$f":"1+$M$1","v":1.2237}]
[null,"TOTAL DO SERVIÇO - R$",{"$nulls":5},{"$f":"H101*H102","v":2.2565481975675907}]
[]
[8,"CODEVASF",null,null," COMPOSIÇÃO DE PREÇO UNITÁRIO",null,null,null,{"$f":"H123","v":0.8648084497873062},{"$f":"H125","v":1.0582661000047267}]
[null,"OBRA:  ",{"$f":"$C$2","v":" PAVIMENTAÇÃO ASFÁLTICA EM CBUQ - ESTRADA PARA MUQUÉM - TRECHO 2 (EST.145  ATÉ EST.250)"},null,null,null,"DATA: ",{"$f":"$H$2","v":"JULHO DE 2023"}]
[null,"SERVIÇO:  ",{"$f":"VLOOKUP(A105,ORÇAMENTO!$A$10:$I$27,3)","v":"REGULARIZAÇÃO E COMPACTAÇÃO DE SUBLEITO"},null,"SICRO",{"$f":"VLOOKUP(A105,ORÇAMENTO!$A$10:$I$27,4)","v":4011209},"UNIDADE: ",{"$f":"VLOOKUP(A105,ORÇAMENTO!$A$10:$I$27,5)","v":"M2"}]
[]
[null,"TIPO ITEM","CODIGO ITEM","DESCRIÇÃO ITEM","UNIDADE ITEM","COEFICIENTE","PRECO UNITARIO","CUSTO TOTAL"]
[null,"COMPOSICAO","5901","CAMINHÃO PIPA 10.000 L TRUCADO, PESO BRUTO TOTAL 23.000 KG, CARGA ÚTIL MÁXIMA 15.935 KG, DISTÂNCIA ENTRE EIXOS 4,8 M, POTÊNCIA 230 CV, INCLUSIVE TANQUE DE AÇO PARA TRANSPORTE DE ÁGUA","CHP",{"$f":"2*0.51","v":1.02},267.67,{"$f":"ROUNDDOWN(F110*G110,2)","v":273.02}]
[null,"COMPOSICAO","5903","CAMINHÃO PIPA 10.000 L TRUCADO, PESO BRUTO TOTAL 23.000 KG, CARGA ÚTIL MÁXIMA 15.935 KG, DISTÂNCIA ENTRE EIXOS 4,8 M, POTÊNCIA 230 CV, INCLUSIVE TANQUE DE AÇO PARA TRANSPORTE DE ÁGUA ","CHI",{"$f":"2*0.49","v":0.98},67.09,65.739999999999995]
[null,"COMPOSICAO",5689,"GRADE DE DISCO CONTROLE REMOTO REBOCÁVEL, COM 24 DISCOS 24 X 6 MM COM PNEUS","CHP",0.69,6.74,4.6500000000000004]
[null,"COMPOSICAO",5690,"GRADE DE DISCO CONTROLE REMOTO REBOCÁVEL, COM 24 DISCOS 24 X 6 MM COM PNEUS","CHI",0.31,4.1900000000000004,1.29]
[null,"COMPOSICAO","5932","MOTONIVELADORA POTÊNCIA BÁSICA LÍQUIDA (PRIMEIRA MARCHA) 125 HP, PESO BRUTO 13032 KG, LARGURA DA LÂMINA DE 3,7 M","CHP",0.71,236.38,167.82]
[null,"COMPOSICAO","5934","MOTONIVELADORA POTÊNCIA BÁSICA LÍQUIDA (PRIMEIRA MARCHA) 125 HP, PESO BRUTO 13032 KG, LARGURA DA LÂMINA DE 3,7 M","CHI",0.28999999999999998,92.27,26.75]
[null,"COMPOSICAO","73436","ROLO COMPACTADOR VIBRATÓRIO PÉ DE CARNEIRO PARA SOLOS, POTÊNCIA 80 HP, PESO OPERACIONAL SEM/COM LASTRO 7,4 / 8,8 T, LARGURA DE TRABALHO 1,68 M","CHP",1,192.91,192.91]
[null,"COMPOSICAO","93244","ROLO COMPACTADOR VIBRATÓRIO PÉ DE CARNEIRO PARA SOLOS, POTÊNCIA 80 HP, PESO OPERACIONAL SEM/COM LASTRO 7,4 / 8,8 T, LARGURA DE TRABALHO 1,68 M","CHI",0,60.72,{"$f":"ROUNDDOWN(F117*G117,2)","v":0}]
[null,"COMPOSICAO","88316","SERVENTE COM ENCARGOS COMPLEMENTARES","H",1,19.760000000000002,19.760000000000002]
[null,"COMPOSICAO","96463","ROLO COMPACTADOR DE PNEUS, ESTATICO, PRESSAO VARIAVEL, POTENCIA 110 HP, PESO SEM/COM LASTRO 10,8/27 T, LARGURA ROLAGEM 2,30 M","CHP",0.96,197.38,189.48]
[null,"COMPOSICAO","96464","ROLO COMPACTADOR DE PNEUS, ESTATICO, PRESSAO VARIAVEL, POTENCIA 110 HP, PESO SEM/COM LASTRO 10,8/27 T, LARGURA ROLAGEM 2,30 M","CHI",0.04,82.85,3.31]
[null,null,null,"FATOR DE INTERFERÊNCIA CLIMÁTICO","FIT",null,null,{"$f":"0.0223*E122","v":25.005658999999998}]
[null,"PRODUÇÃO DA EQUIPE",null,null,1121.33,"CUSTO ",null,{"$f":"SUM(H110:H121)","v":969.73565899999994}]
[null,"TOTAL",{"$nulls":5},{"$f":"H122/E122","v":0.8648084497873062},"OK"]
[null,"BDI                %",{"$nulls":5},{"$f":"1+$M$1","v":1.2237}]
[null,"TOTAL DO SERVIÇO - R$",{"$nulls":5},{"$f":"H123*H124","v":1.0582661000047267}]
[]
[9,"CODEVASF",null,null," COMPOSIÇÃO DE PREÇO UNITÁRIO",null,null,null,{"$f":"H145","v":4.1581796670630204},{"$f":"H147","v":5.0883644585850183}]
[null,"OBRA:  ",{"$f":"$C$2","v":" PAVIMENTAÇÃO ASFÁLTICA EM CBUQ - ESTRADA PARA MUQUÉM - TRECHO 2 (EST.145  ATÉ EST.250)"},null,null,null,"DATA: ",{"$f":"$H$2","v":"JULHO DE 2023"}]
[null,"SERVIÇO:  ",{"$f":"VLOOKUP(A127,ORÇAMENTO!$A$10:$I$27,3)","v":"COMPACTAÇÃO DE ATERROS A 100% DOP PROCTOR NORMAL"},null,"SICRO",{"$f":"VLOOKUP(A127,ORÇAMENTO!$A$10:$I$27,4)","v":5502978},"UNIDADE: ",{"$f":"VLOOKUP(A127,ORÇAMENTO!$A$10:$I$27,5)","v":"M3"}]
[]
[null,"TIPO ITEM","CODIGO ITEM","DESCRIÇÃO ITEM","UNIDADE ITEM","COEFICIENTE","PRECO UNITARIO","CUSTO TOTAL"]
[null,"COMPOSICAO","73436","ROLO COMPACTADOR VIBRATÓRIO PÉ DE CARNEIRO PARA SOLOS, POTÊNCIA 80 HP, PESO OPERACIONAL SEM/COM LASTRO 7,4 / 8,8 T, LARGURA DE TRABALHO 1,68 M","CHP",1,{"$f":"G116","v":192.91},{"$f":"ROUNDDOWN(F132*G132,2)","v":192.91}]
[null,"COMPOSICAO","93244","ROLO COMPACTADOR VIBRATÓRIO PÉ DE CARNEIRO PARA SOLOS, POTÊNCIA 80 HP, PESO OPERACIONAL SEM/COM LASTRO 7,4 / 8,8 T, LARGURA DE TRABALHO 1,68 M","CHI",0,{"$f":"G117","v":60.72},0]
[null,"COMPOSICAO","5901","CAMINHÃO PIPA 10.000 L TRUCADO, PESO BRUTO TOTAL 23.000 KG, CARGA ÚTIL MÁXIMA 15.935 KG, DISTÂNCIA ENTRE EIXOS 4,8 M, POTÊNCIA 230 CV, INCLUSIVE TANQUE DE AÇO PARA TRANSPORTE DE ÁGUA","CHP",0.9,{"$f":"G110","v":267.67},240.9]
[null,"COMPOSICAO","5903","CAMINHÃO PIPA 10.000 L TRUCADO, PESO BRUTO TOTAL 23.000 KG, CARGA ÚTIL MÁXIMA 15.935 KG, DISTÂNCIA ENTRE EIXOS 4,8 M, POTÊNCIA 230 CV, INCLUSIVE TANQUE DE AÇO PARA TRANSPORTE DE ÁGUA","CHI",0.1,{"$f":"G111","v":67.09},6.7]
[null,"COMPOSICAO","5932","MOTONIVELADORA POTÊNCIA BÁSICA LÍQUIDA (PRIMEIRA MARCHA) 125 HP, PESO BRUTO 13032 KG, LARGURA DA LÂMINA DE 3,7 M","CHP",0.28999999999999998,{"$f":"G114","v":236.38},68.55]
[null,"COMPOSICAO","5934","MOTONIVELADORA POTÊNCIA BÁSICA LÍQUIDA (PRIMEIRA MARCHA) 125 HP, PESO BRUTO 13032 KG, LARGURA DA LÂMINA DE 3,7 M","CHI",0.71,{"$f":"G115","v":92.27},65.510000000000005]
[null,"COMPOSICAO","88316","SERVENTE COM ENCARGOS COMPLEMENTARES","H",1,{"$f":"G118","v":19.760000000000002},19.760000000000002]
[null,"COMPOSICAO",89035,"TRATOR DE PNEUS, POTÊNCIA 85 CV, TRAÇÃO 4X4","CHP",0.52,117.41,61.05]
[null,"COMPOSICAO",89036,"TRATOR DE PNEUS, POTÊNCIA 85 CV, TRAÇÃO 4X4","CHI",0.48,46.92,22.52]
[null,"COMPOSICAO",5689,"GRADE DE DISCO CONTROLE REMOTO REBOCÁVEL, COM 24 DISCOS 24 X 6 MM COM PNEUS","CHP",0.52,{"$f":"G112","v":6.74},3.5]
[null,"COMPOSICAO",5690,"GRADE DE DISCO CONTROLE REMOTO REBOCÁVEL, COM 24 DISCOS 24 X 6 MM COM PNEUS","CHI",0.48,{"$f":"G113","v":4.1900000000000004},2.0099999999999998]
[null,null,null,"FATOR DE INTERFERÊNCIA CLIMÁTICO","FIT",null,null,{"$f":"0.0951*E144","v":15.99582}]
[null,"PRODUÇÃO DA EQUIPE",null,null,168.2,"CUSTO ",null,{"$f":"SUM(H132:H143)","v":699.40581999999995}]
[null,"TOTAL",{"$nulls":5},{"$f":"H144/E144","v":4.1581796670630204},"OK"]
[null,"BDI                %",{"$nulls":5},{"$f":"1+$M$1","v":1.2237}]
[null,"TOTAL DO SERVIÇO - R$",{"$nulls":5},{"$f":"H145*H146","v":5.0883644585850183}]
[]
[10,"CODEVASF",null,null," COMPOSIÇÃO DE PREÇO UNITÁRIO",null,null,null,{"$f":"H167","v":107.31211107969607},{"$f":"H169","v":131.31783032822409}]
[null,"OBRA:  ",{"$f":"$C$2","v":" PAVIMENTAÇÃO ASFÁLTICA EM CBUQ - ESTRADA PARA MUQUÉM - TRECHO 2 (EST.145  ATÉ EST.250)"},null,null,null,"DATA: ",{"$f":"$H$2","v":"JULHO DE 2023"}]
[null,"SERVIÇO:  ",{"$f":"VLOOKUP(A149,ORÇAMENTO!$A$10:$I$27,3)","v":"BASE OU SUB-BASE DE BICA CORRIDA COM BRITA COMERCIAL"},null,"SICRO",{"$f":"VLOOKUP(A149,ORÇAMENTO!$A$10:$I$27,4)","v":"4011276a"},"UNIDADE: ",{"$f":"VLOOKUP(A149,ORÇAMENTO!$A$10:$I$27,5)","v":"M3"}]
[]
[null,"TIPO ITEM","CODIGO ITEM","DESCRIÇÃO ITEM","UNIDADE ITEM","COEFICIENTE","PRECO UNITARIO","CUSTO TOTAL"]
[null,"COMPOSICAO","5684","ROLO COMPACTADOR VIBRATÓRIO DE UM CILINDRO AÇO LISO, POTÊNCIA 80 HP, PESO OPERACIONAL MÁXIMO 8,1 T, IMPACTO DINÂMICO 16,15 / 9,5 T, LARGURA DE TRABALHO 1,68 M","CHP",0.52,142.77000000000001,{"$f":"ROUNDDOWN(F154*G154,2)","v":74.239999999999995}]
[null,"COMPOSICAO","5685","ROLO COMPACTADOR VIBRATÓRIO DE UM CILINDRO AÇO LISO, POTÊNCIA 80 HP, PESO OPERACIONAL MÁXIMO 8,1 T, IMPACTO DINÂMICO 16,15 / 9,5 T, LARGURA DE TRABALHO 1,68 M","CHI",0.48,59.3,28.46]
[null,"COMPOSICAO","5901","CAMINHÃO PIPA 10.000 L TRUCADO, PESO BRUTO TOTAL 23.000 KG, CARGA ÚTIL MÁXIMA 15.935 KG, DISTÂNCIA ENTRE EIXOS 4,8 M, POTÊNCIA 230 CV, INCLUSIVE TANQUE DE AÇO PARA TRANSPORTE DE ÁGUA","CHP",0.34,{"$f":"G134","v":267.67},91]
[null,"COMPOSICAO","5903","CAMINHÃO PIPA 10.000 L TRUCADO, PESO BRUTO TOTAL 23.000 KG, CARGA ÚTIL MÁXIMA 15.935 KG, DISTÂNCIA ENTRE EIXOS 4,8 M, POTÊNCIA 230 CV, INCLUSIVE TANQUE DE AÇO PARA TRANSPORTE DE ÁGUA","CHI",0.66,{"$f":"G135","v":67.09},44.27]
[null,"COMPOSICAO",95127,"DISTRIBUIDOR DE AGREGADOS AUTOPROPELIDO, A DIESEL, POTÊNCIA 176CV","CHP",1,180.85,180.85]
[null,"COMPOSICAO",95128,"DISTRIBUIDOR DE AGREGADOS AUTOPROPELIDO, A DIESEL, POTÊNCIA 176CV","CHI",0,47.35,0]
[null,"COMPOSICAO","88316","SERVENTE COM ENCARGOS COMPLEMENTARES","H",1,19.760000000000002,19.760000000000002]
[null,"COMPOSICAO","96463","ROLO COMPACTADOR DE PNEUS, ESTATICO, PRESSAO VARIAVEL, POTENCIA 110 HP, PESO SEM/COM LASTRO 10,8/27 T, LARGURA DE ROLAGEM 2,30 M","CHP",0.65,{"$f":"G119","v":197.38},128.29]
[null,"COMPOSICAO","96464","ROLO COMPACTADOR DE PNEUS, ESTATICO, PRESSAO VARIAVEL, POTENCIA 110 HP, PESO SEM/COM LASTRO 10,8/27 T, LARGURA DE ROLAGEM 2,30 M","CHI",0.35,{"$f":"G120","v":82.85},28.99]
[null,"INSUMO",4748,"PEDRA BRITADA OU BICA CORRIDA, NAO CLASSIFICADA (POSTO PEDREIRA/FORNECEDOR,SEM FRETE)","M3",{"$f":"1.02*113.18","v":115.4436},100,{"$f":"ROUNDDOWN(F163*G163,2)","v":11544.36}]
[null,null,null,"FATOR DE INTERFERÊNCIA CLIMÁTICO","FIT",null,null,{"$f":"0.0474*E166","v":5.3647320000000001}]
[]
[null,"PRODUÇÃO DA EQUIPE",null,null,113.18,"CUSTO ",null,{"$f":"SUM(H154:H165)","v":12145.584732000001}]
[null,"TOTAL",{"$nulls":5},{"$f":"H166/E166","v":107.31211107969607},"OK"]
[null,"BDI                %",{"$nulls":5},{"$f":"1+$M$1","v":1.2237}]
[null,"TOTAL DO SERVIÇO - R$",{"$nulls":5},{"$f":"H167*H168","v":131.31783032822409}]
[]
[11,"CODEVASF",null,null," COMPOSIÇÃO DE PREÇO UNITÁRIO",null,null,null,{"$f":"H184","v":0.34250000000000003},{"$f":"H186","v":0.41911725000000005}]
[null,"OBRA:  ",{"$f":"$C$2","v":" PAVIMENTAÇÃO ASFÁLTICA EM CBUQ - ESTRADA PARA MUQUÉM - TRECHO 2 (EST.145  ATÉ EST.250)"},null,null,null,"DATA: ",{"$f":"$H$2","v":"JULHO DE 2023"}]
[null,"SERVIÇO:  ",{"$f":"VLOOKUP(A171,ORÇAMENTO!$A$10:$I$27,3)","v":"IMPRIMAÇÃO COM ASFALTO DILUIDO CM-30"},null,"SICRO",{"$f":"VLOOKUP(A171,ORÇAMENTO!$A$10:$I$27,4)","v":4011351},"UNIDADE: ",{"$f":"VLOOKUP(A171,ORÇAMENTO!$A$10:$I$27,5)","v":"M2"}]
[]
[null,"TIPO ITEM","CODIGO ITEM","DESCRIÇÃO ITEM","UNIDADE ITEM","COEFICIENTE","PRECO UNITARIO","CUSTO TOTAL"]
[null,"INSUMO",null,"ASFALTO DILUIDO DE PETROLEO CM-30 (FORNECIMENTO COM BDI DIFERENCIADO)","KG","1,2000000",null,{"$f":"ROUNDDOWN(F176*G176,2)","v":0}]
[null,"COMPOSICAO","83362","ESPARGIDOR DE ASFALTO PRESSURIZADO, TANQUE 6 M3 COM ISOLAÇÃO TÉRMICA, AQUECIDO COM 2 MAÇARICOS, COM BARRA ESPARGIDORA 3,60 M, MONTADO SOBRE CAMINHÃO  TOCO, PBT 14.300 KG, POTÊNCIA 185 CV","CHP",1,234.41,234.41]
[null,"COMPOSICAO","91486","ESPARGIDOR DE ASFALTO PRESSURIZADO, TANQUE 6 M3 COM ISOLAÇÃO TÉRMICA, AQUECIDO COM 2 MAÇARICOS, COM BARRA ESPARGIDORA 3,60 M, MONTADO SOBRE CAMINHÃO  TOCO, PBT 14.300 KG, POTÊNCIA 185 CV","CHI",0,66.12,{"$f":"ROUNDDOWN(F178*G178,2)","v":0}]
[null,"COMPOSICAO","88316","SERVENTE COM ENCARGOS COMPLEMENTARES","H",2,19.760000000000002,39.520000000000003]
[null,"COMPOSICAO","E9558","TANQUE DE ASFALTO ESTACIONÁRIO COM SERPENTINA, CAPACIDADE 30.000 L","CHP",{"$f":"2*1","v":2},54.962499999999999,109.92]
[null,"COMPOSICAO","E9558","TANQUE DE ASFALTO ESTACIONÁRIO COM SERPENTINA, CAPACIDADE 30.000 L","CHI",0,37.543399999999998,0]
[null,null,null,"FATOR DE INTERFERÊNCIA CLIMÁTICA","FIC",null,null,{"$f":"0.0013*E183","v":1.4624999999999999}]
[null,"PRODUÇÃO DA EQUIPE",null,null,1125,"CUSTO ",null,{"$f":"SUM(H176:H182)","v":385.3125}]
[null,"TOTAL",{"$nulls":5},{"$f":"H183/E183","v":0.34250000000000003},"OK"]
[null,"BDI                %",{"$nulls":5},{"$f":"1+$M$1","v":1.2237}]
[null,"TOTAL DO SERVIÇO - R$",{"$nulls":5},{"$f":"H184*H185","v":0.41911725000000005}]
[]
[12,"CODEVASF",null,null," COMPOSIÇÃO DE PREÇO UNITÁRIO",null,null,null,{"$f":"H201","v":0.25690000000000002},{"$f":"H203","v":0.31436853000000003}]
[null,"OBRA:  ",{"$f":"$C$2","v":" PAVIMENTAÇÃO ASFÁLTICA EM CBUQ - ESTRADA PARA MUQUÉM - TRECHO 2 (EST.145  ATÉ EST.250)"},null,null,null,"DATA: ",{"$f":"$H$2","v":"JULHO DE 2023"}]
[null,"SERVIÇO:  ",{"$f":"VLOOKUP(A188,ORÇAMENTO!$A$10:$I$27,3)","v":"PINTURA DE LIGAÇÃO COM EMULSÃO ASFÁLTICA RR-2C"},null,"SICRO",{"$f":"VLOOKUP(A188,ORÇAMENTO!$A$10:$I$27,4)","v":4011353},"UNIDADE: ",{"$f":"VLOOKUP(A188,ORÇAMENTO!$A$10:$I$27,5)","v":"M2"}]
[]
[null,"TIPO ITEM","CODIGO ITEM","DESCRIÇÃO ITEM","UNIDADE ITEM","COEFICIENTE","PRECO UNITARIO","CUSTO TOTAL"]
[null,"INSUMO",null,"EMULSAO ASFALTICA CATIONICA RR-2C PARA USO EM PAVIMENTACAO ASFALTICA (COLETADO CAIXA NA ANP ACRESCIDO DE ICMS)","KG","0,4500000",null,{"$f":"ROUNDDOWN(F193*G193,2)","v":0}]
[null,"COMPOSICAO","83362","ESPARGIDOR DE ASFALTO PRESSURIZADO, TANQUE 6 M3 COM ISOLAÇÃO TÉRMICA, AQUECIDO COM 2 MAÇARICOS, COM BARRA ESPARGIDORA 3,60 M, MONTADO SOBRE CAMINHÃO  TOCO, PBT 14.300 KG, POTÊNCIA 185 CV","CHP",1,{"$f":"G177","v":234.41},234.41]
[null,"COMPOSICAO","91486","ESPARGIDOR DE ASFALTO PRESSURIZADO, TANQUE 6 M3 COM ISOLAÇÃO TÉRMICA, AQUECIDO COM 2 MAÇARICOS, COM BARRA ESPARGIDORA 3,60 M, MONTADO SOBRE CAMINHÃO  TOCO, PBT 14.300 KG, POTÊNCIA 185 CV","CHI",0,{"$f":"G178","v":66.12},0]
[null,"COMPOSICAO","88316","SERVENTE COM ENCARGOS COMPLEMENTARES","H",2,19.760000000000002,39.520000000000003]
[null,"COMPOSICAO","E9558","TANQUE DE ASFALTO ESTACIONÁRIO COM SERPENTINA, CAPACIDADE 30.000 L","CHP",{"$f":"2*1","v":2},54.962499999999999,109.92]
[null,"COMPOSICAO","E9558","TANQUE DE ASFALTO ESTACIONÁRIO COM SERPENTINA, CAPACIDADE 30.000 L","CHI",0,37.543399999999998,0]
[null,null,null,"FATOR DE INTERFERÊNCIA CLIMÁTICA","FIC",null,null,{"$f":"0.001*E200","v":1.5}]
[null,"PRODUÇÃO DA EQUIPE",null,null,1500,"CUSTO ",null,{"$f":"SUM(H193:H199)","v":385.35}]
[null,"TOTAL",{"$nulls":5},{"$f":"H200/E200","v":0.25690000000000002},"OK"]
[null,"BDI                %",{"$nulls":5},{"$f":"1+$M$1","v":1.2237}]
[null,"TOTAL DO SERVIÇO - R$",{"$nulls":5},{"$f":"H201*H202","v":0.31436853000000003}]
[]
[13,"CODEVASF",null,null," COMPOSIÇÃO DE PREÇO UNITÁRIO",null,null,null,{"$f":"H221","v":16.685004417670683},{"$f":"H223","v":20.417439905903613}]
[null,"OBRA:  ",{"$f":"$C$2","v":" PAVIMENTAÇÃO ASFÁLTICA EM CBUQ - ESTRADA PARA MUQUÉM - TRECHO 2 (EST.145  ATÉ EST.250)"},null,null,null,"DATA: ",{"$f":"$H$2","v":"JULHO DE 2023"}]
[null,"SERVIÇO:  ",{"$f":"VLOOKUP(A205,ORÇAMENTO!$A$10:$I$27,3)","v":"EXECUÇÃO DE PAVIMENTO COM APLICAÇÃO DE CONCRETO ASFÁLTICO USINADO A QUENTE (CBUQ), CAMADA DE ROLAMENTO - EXCLUSIVE FORNECIMENTO E TRANSPORTE"},null,"SICRO",{"$f":"VLOOKUP(A205,ORÇAMENTO!$A$10:$I$27,4)","v":4011463},"UNIDADE: ",{"$f":"VLOOKUP(A205,ORÇAMENTO!$A$10:$I$27,5)","v":"T"}]
[]
[null,"TIPO ITEM","CODIGO ITEM","DESCRIÇÃO ITEM","UNIDADE ITEM","COEFICIENTE","PRECO UNITARIO","CUSTO TOTAL"]
[null,"INSUMO","1518","CONCRETO BETUMINOSO USINADO A QUENTE (CBUQ) PARA PAVIMENTACAO ASFALTICA, PADRAO DNIT, FAIXA C, COM CAP 50/70 - FORNECIMENTO COM BDI DIFERENCIADO","T","2,5548000",null,{"$f":"ROUNDDOWN(F210*G210,2)","v":0}]
[null,"COMPOSICAO","5835","VIBROACABADORA DE ASFALTO SOBRE ESTEIRAS, LARGURA DE PAVIMENTAÇÃO 1,90 M A 5,30 M, POTÊNCIA 105 HP CAPACIDADE 450 T/H","CHP",1,357.51,357.51]
[null,"COMPOSICAO","5837","VIBROACABADORA DE ASFALTO SOBRE ESTEIRAS, LARGURA DE PAVIMENTAÇÃO 1,90 M A 5,30 M, POTÊNCIA 105 HP CAPACIDADE 450 T/H","CHI",0,139.09,0]
[null,"COMPOSICAO","88314","RASTELEIRO COM ENCARGOS COMPLEMENTARES","H",8,21.21,169.68]
[null,"COMPOSICAO","95631","ROLO COMPACTADOR VIBRATORIO TANDEM, ACO LISO, POTENCIA 125 HP, PESO SEM/COM LASTRO 10,20/11,65 T, LARGURA DE TRABALHO 1,73 M","CHP",0.82,204.82,167.95]
[null,"COMPOSICAO","95632","ROLO COMPACTADOR VIBRATORIO TANDEM, ACO LISO, POTENCIA 125 HP, PESO SEM/COM LASTRO 10,20/11,65 T, LARGURA DE TRABALHO 1,73 M","CHI",0.18,77.02,13.86]
[null,"COMPOSICAO","96463","ROLO COMPACTADOR DE PNEUS, ESTATICO, PRESSAO VARIAVEL, POTENCIA 110 HP, PESO SEM/COM LASTRO 10,8/27 T, LARGURA DE ROLAGEM 2,30 M","CHP",0.71,{"$f":"G161","v":197.38},140.13]
[null,"COMPOSICAO","96464","ROLO COMPACTADOR DE PNEUS, ESTATICO, PRESSAO VARIAVEL, POTENCIA 110 HP, PESO SEM/COM LASTRO 10,8/27 T, LARGURA DE ROLAGEM 2,30 M","CHI",0.28999999999999998,{"$f":"G162","v":82.85},24.02]
[null,"COMPOSICAO",5914649,"CARGA, MANOBRA E DESCARGA DE MISTURA BETUMINOSA A QUENTE EM CAMINHÃO BASCULANTE - CARGA EM USINA, DESCARGA EM VIBROACABADORA","T",{"$f":"1.02*E220","v":101.592},7.73,785.3]
[null,null,null,"FATOR DE INTERFERÊNCIA CLIMÁTICA","FIC",null,null,{"$f":"0.0339*E220","v":3.3764399999999997}]
[null,"PRODUÇÃO DA EQUIPE",null,null,99.6,"CUSTO ",null,{"$f":"SUM(H210:H219)","v":1661.82644}]
[null,"TOTAL",{"$nulls":5},{"$f":"H220/E220","v":16.685004417670683},"OK"]
[null,"BDI                %",{"$nulls":5},{"$f":"1+$M$1","v":1.2237}]
[null,"TOTAL DO SERVIÇO - R$",{"$nulls":5},{"$f":"H221*H222","v":20.417439905903613}]
[]
[14,"CODEVASF",null,null," COMPOSIÇÃO DE PREÇO UNITÁRIO",null,null,null,{"$f":"H234","v":0.62485229808121379},{"$f":"H236","v":0.76463175716198128}]
[null,"OBRA:  ",{"$f":"$C$2","v":" PAVIMENTAÇÃO ASFÁLTICA EM CBUQ - ESTRADA PARA MUQUÉM - TRECHO 2 (EST.145  ATÉ EST.250)"},null,null,null,"DATA: ",{"$f":"$H$2","v":"JULHO DE 2023"}]
[null,"SERVIÇO:  ",{"$f":"VLOOKUP(A225,ORÇAMENTO!$A$10:$I$27,3)","v":"TRANSPORTE COM CAMINHÃO BASCULANTE, EM VIA URBANA EM REVESTIMENTO PRIMÁRIO"},null,"SICRO",{"$f":"VLOOKUP(A225,ORÇAMENTO!$A$10:$I$27,4)","v":5901638},"UNIDADE: ",{"$f":"VLOOKUP(A225,ORÇAMENTO!$A$10:$I$27,5)","v":"M3XKM"}]
[]
[null,"TIPO ITEM","CODIGO ITEM","DESCRIÇÃO ITEM","UNIDADE ITEM","COEFICIENTE","PRECO UNITARIO","CUSTO TOTAL"]
[null,"COMPOSICAO","89883","CAMINHÃO BASCULANTE 18 M3, COM CAVALO MECÂNICO DE CAPACIDADE MÁXIMA DE TRAÇÃO COMBINADO DE 45000 KG, POTÊNCIA 330 CV, INCLUSIVE SEMIREBOQUE COM CAÇAMBA METÁLICA","CHP",1,342.23,{"$f":"ROUNDDOWN(F230*G230,2)","v":342.23}]
[null,"COMPOSICAO","89884","CAMINHÃO BASCULANTE 18 M3, COM CAVALO MECÂNICO DE CAPACIDADE MÁXIMA DE TRAÇÃO COMBINADO DE 45000 KG, POTÊNCIA 330 CV, INCLUSIVE SEMIREBOQUE COM CAÇAMBA METÁLICA","CHI",0,83.37,0]
[null,null,null,"FATOR DE INTERFERÊNCIA CLIMÁTICA","FIC",null,null,{"$f":"0.014*E233","v":7.8435000000000006}]
[null,"PRODUÇÃO DA EQUIPE",null,null,560.25,"CUSTO ",null,{"$f":"SUM(H230:H232)","v":350.07350000000002}]
[null,"TOTAL",{"$nulls":5},{"$f":"H233/E233","v":0.62485229808121379},"OK"]
[null,"BDI                %",{"$nulls":5},{"$f":"1+$M$1","v":1.2237}]
[null,"TOTAL DO SERVIÇO - R$",{"$nulls":5},{"$f":"H234*H235","v":0.76463175716198128}]
[]
[15,"CODEVASF",null,null," COMPOSIÇÃO DE PREÇO UNITÁRIO",null,null,null,{"$f":"H247","v":0.47016213000148743},{"$f":"H249","v":0.57533739848282017}]
[null,"OBRA:  ",{"$f":"$C$2","v":" PAVIMENTAÇÃO ASFÁLTICA EM CBUQ - ESTRADA PARA MUQUÉM - TRECHO 2 (EST.145  ATÉ EST.250)"},null,null,null,"DATA: ",{"$f":"$H$2","v":"JULHO DE 2023"}]
[null,"SERVIÇO:  ",{"$f":"VLOOKUP(A238,ORÇAMENTO!$A$10:$I$43,3,0)","v":"TRANSPORTE COM CAMINHÃO BASCULANTE, EM VIA URBANA PAVIMENTADA"},null,"SICRO",{"$f":"VLOOKUP(A238,ORÇAMENTO!$A$10:$I$27,4,0)","v":5901640},"UNIDADE: ",{"$f":"VLOOKUP(A238,ORÇAMENTO!$A$10:$I$27,5,0)","v":"M3XKM"}]
[]
[null,"TIPO ITEM","CODIGO ITEM","DESCRIÇÃO ITEM","UNIDADE ITEM","COEFICIENTE","PRECO UNITARIO","CUSTO TOTAL"]
[null,"COMPOSICAO","89883","CAMINHÃO BASCULANTE 18 M3, COM CAVALO MECÂNICO DE CAPACIDADE MÁXIMA DE TRAÇÃO COMBINADO DE 45000 KG, POTÊNCIA 330 CV, INCLUSIVE SEMIREBOQUE COM CAÇAMBA METÁLICA","CHP",1,316.08999999999997,{"$f":"ROUNDDOWN(F243*G243,2)","v":316.08999999999997}]
[null,"COMPOSICAO","89884","CAMINHÃO BASCULANTE 18 M3, COM CAVALO MECÂNICO DE CAPACIDADE MÁXIMA DE TRAÇÃO COMBINADO DE 45000 KG, POTÊNCIA 330 CV, INCLUSIVE SEMIREBOQUE COM CAÇAMBA METÁLICA","CHI",0,86.09,0]
[null,null,null,"FATOR DE INTERFERÊNCIA CLIMÁTICA","FIC",null,null,{"$f":"0*E246","v":0}]
[null,"PRODUÇÃO DA EQUIPE",null,null,672.3,"CUSTO ",null,{"$f":"SUM(H243:H245)","v":316.08999999999997}]
[null,"TOTAL",{"$nulls":5},{"$f":"H246/E246","v":0.47016213000148743},"OK"]
[null,"BDI                %",{"$nulls":5},{"$f":"1+$M$1","v":1.2237}]
[null,"TOTAL DO SERVIÇO - R$",{"$nulls":5},{"$f":"H247*H248","v":0.57533739848282017}]
[]
[17,"CODEVASF",null,null," COMPOSIÇÃO DE PREÇO UNITÁRIO",null,null,null,{"$f":"H263","v":608.04999999999984},{"$f":"H265","v":744.07078499999977}]
[null,"OBRA:  ",{"$f":"$C$2","v":" PAVIMENTAÇÃO ASFÁLTICA EM CBUQ - ESTRADA PARA MUQUÉM - TRECHO 2 (EST.145  ATÉ EST.250)"},null,null,null,"DATA: ",{"$f":"$H$2","v":"JULHO DE 2023"}]
[null,"SERVIÇO:  ",{"$f":"VLOOKUP(A251,ORÇAMENTO!$A$10:$I$43,3)","v":"DESCIDA D’ÁGUA DE ATERROS EM DEGRAUS - DAD 04 - AREIA E BRITA COMERCIAIS"},null,"SINAPI",{"$f":"VLOOKUP(A251,ORÇAMENTO!$A$10:$I$43,4)","v":2003411},"UNIDADE: ",{"$f":"VLOOKUP(A251,ORÇAMENTO!$A$10:$I$43,5)","v":"M2"}]
[]
[null,"TIPO ITEM","CODIGO ITEM","DESCRIÇÃO ITEM","UNIDADE ITEM","COEFICIENTE","PRECO UNITARIO","CUSTO TOTAL"]
[null,"COMPOSIÇÃO",101616,"PREPARO DE FUNDO DE VALA COM LARGURA MENOR QUE 1,5 M (ACERTO DO SOLO NATURAL)","M2",0.9,6.02,{"$f":"ROUNDDOWN(F256*G256,2)","v":5.41}]
[null,"COMPOSIÇÃO",103797,"ARMAÇÃO DE DESCIDA DÁGUA UTILIZANDO AÇO CA-60 DE 5 MM","KG",11.96,15.92,190.4]
[null,"INSUMO","34492","CONCRETO USINADO BOMBEAVEL, CLASSE DE RESISTENCIA C20, COM BRITA 0 E 1, SLUMP = 100 +/- 20 MM","M3",0.59,550,324.5]
[null,"COMPOSIÇÃO",96527,"ESCAVAÇÃO MANUAL DE VALA ","M3",0.37,121.8,45.06]
[null,"COMPOSIÇÃO",103795,"FABRICAÇÃO, MONTAGEM E DESMONTAGEM DE FÔRMA PARA DRENAGEM EM CHAPA DE MADEIRA COMPENSADA RESINADA, E = 17 MM","M2",0.53,80.53,42.68]
[{"$nulls":7},0]
[null,"PRODUÇÃO DA EQUIPE",null,null,1,"CUSTO ",null,{"$f":"SUM(H256:H261)","v":608.04999999999984}]
[null,"TOTAL",{"$nulls":5},{"$f":"H262/E262","v":608.04999999999984},"OK"]
[null,"BDI                %",{"$nulls":5},{"$f":"1+$M$1","v":1.2237}]
[null,"TOTAL DO SERVIÇO - R$",{"$nulls":5},{"$f":"H263*H264","v":744.07078499999977}]
[]
[18,"CODEVASF",null,null," COMPOSIÇÃO DE PREÇO UNITÁRIO",null,null,null,{"$f":"H277","v":235.94},{"$f":"H279","v":288.71977800000002}]
[null,"OBRA:  ",{"$f":"$C$2","v":" PAVIMENTAÇÃO ASFÁLTICA EM CBUQ - ESTRADA PARA MUQUÉM - TRECHO 2 (EST.145  ATÉ EST.250)"},null,null,null,"DATA: ",{"$f":"$H$2","v":"JULHO DE 2023"}]
[null,"SERVIÇO:  ",{"$f":"VLOOKUP(A267,ORÇAMENTO!$A$10:$I$43,3)","v":"ENRONCAMENTO DE PEDRA ARRUMADA MANUALMENTE - PEDRA DE MÃO COMERCIAL - FORNECIMENTO E ASSENTAMENTO "},null,"SICRO",{"$f":"VLOOKUP(A267,ORÇAMENTO!$A$10:$I$43,4)","v":1505879},"UNIDADE: ",{"$f":"VLOOKUP(A267,ORÇAMENTO!$A$10:$I$43,5)","v":"M3"}]
[]
[null,"TIPO ITEM","CODIGO ITEM","DESCRIÇÃO ITEM","UNIDADE ITEM","COEFICIENTE","PRECO UNITARIO","CUSTO TOTAL"]
[null,"INSUMO",4730,"PEDRA DE MAO OU PEDRA RACHAO PARA ARRIMO/FUNDACAO","M3",1.2,102.85,{"$f":"ROUNDDOWN(F272*G272,2)","v":123.42}]
[null,"COMPOSICAO","88316","SERVENTE COM ENCARGOS COMPLEMENTARES","H",5,19.760000000000002,98.8]
[null,"COMPOSICAO",88309,"PEDREIRO COM ENCARGOS COMPLEMENTARES","H",0.5,27.45,13.72]
[{"$nulls":7},0]
[null,"PRODUÇÃO DA EQUIPE",null,null,1,"CUSTO ",null,{"$f":"SUM(H272:H275)","v":235.94}]
[null,"TOTAL",{"$nulls":5},{"$f":"H276/E276","v":235.94},"OK"]
[null,"BDI                %",{"$nulls":5},{"$f":"1+$M$1","v":1.2237}]
[null,"TOTAL DO SERVIÇO - R$",{"$nulls":5},{"$f":"H277*H278","v":288.71977800000002}]
[]
[22,"CODEVASF",null,null," COMPOSIÇÃO DE PREÇO UNITÁRIO",null,null,null,{"$f":"H291","v":313.69},{"$f":"H293","v":383.86245300000002}]
[null,"OBRA:  ",{"$f":"$C$2","v":" PAVIMENTAÇÃO ASFÁLTICA EM CBUQ - ESTRADA PARA MUQUÉM - TRECHO 2 (EST.145  ATÉ EST.250)"},null,null,null,"DATA: ",{"$f":"$H$2","v":"JULHO DE 2023"}]
[null,"SERVIÇO:  ",{"$f":"VLOOKUP(A281,ORÇAMENTO!$A$10:$I$43,3)","v":"SAÍDA D'ÁGUA EM TALUDES DE CORTE E ATERRO (SDA E SDC) - AREIA E BRITA COMERCIAIS"},null,"SINAPI",{"$f":"VLOOKUP(A281,ORÇAMENTO!$A$10:$I$43,4)","v":"RO-46167a"},"UNIDADE: ",{"$f":"VLOOKUP(A281,ORÇAMENTO!$A$10:$I$43,5)","v":"UNID"}]
[]
[null,"TIPO ITEM","CODIGO ITEM","DESCRIÇÃO ITEM","UNIDADE ITEM","COEFICIENTE","PRECO UNITARIO","CUSTO TOTAL"]
[null,"COMPOSIÇÃO",96527,"ESCAVAÇÃO MANUAL DE VALA ","M3",0.41099999999999998,121.8,{"$f":"ROUNDDOWN(F286*G286,2)","v":50.05}]
[null,"COMPOSIÇÃO",101616,"PREPARO DE FUNDO DE VALA COM LARGURA MENOR QUE 1,5 M (ACERTO DO SOLO NATURAL)","M2",2,{"$f":"G256","v":6.02},12.04]
[null,"COMPOSICAO",103795,"FABRICAÇÃO, MONTAGEM E DESMONTAGEM DE FÔRMA PARA DRENAGEM EM CHAPA DE MADEIRA COMPENSADA RESINADA, E = 17 MM","M2",0.73399999999999999,{"$f":"G260","v":80.53},{"$f":"ROUNDDOWN(F288*G288,2)","v":59.1}]
[null,"INSUMO","34492","CONCRETO USINADO BOMBEAVEL, CLASSE DE RESISTENCIA C20, COM BRITA 0 E 1, SLUMP = 100 +/- 20 MM","M3",0.35,{"$f":"G258","v":550},{"$f":"ROUNDDOWN(F289*G289,2)","v":192.5}]
[null,"PRODUÇÃO DA EQUIPE",null,null,1,"CUSTO ",null,{"$f":"SUM(H286:H289)","v":313.69}]
[null,"TOTAL",{"$nulls":5},{"$f":"H290/E290","v":313.69},"OK"]
[null,"BDI                %",{"$nulls":5},{"$f":"1+$M$1","v":1.2237}]
[null,"TOTAL DO SERVIÇO - R$",{"$nulls":5},{"$f":"H291*H292","v":383.86245300000002}]
[]
[23,"CODEVASF",null,null," COMPOSIÇÃO DE PREÇO UNITÁRIO",null,null,null,{"$f":"H304","v":29.69},{"$f":"H306","v":36.331653000000003}]
[null,"OBRA:  ",{"$f":"$C$2","v":" PAVIMENTAÇÃO ASFÁLTICA EM CBUQ - ESTRADA PARA MUQUÉM - TRECHO 2 (EST.145  ATÉ EST.250)"},null,null,null,"DATA: ",{"$f":"$H$2","v":"JULHO DE 2023"}]
[null,"SERVIÇO:  ",{"$f":"VLOOKUP(A295,ORÇAMENTO!$A$10:$I$43,3)","v":"SARJETA DE CONCRETO EM CORTE - SCC 50/20"},null,"SINAPI",{"$f":"VLOOKUP(A295,ORÇAMENTO!$A$10:$I$43,4)","v":"2003349a"},"UNIDADE: ",{"$f":"VLOOKUP(A295,ORÇAMENTO!$A$10:$I$43,5)","v":"M"}]
[]
[null,"TIPO ITEM","CODIGO ITEM","DESCRIÇÃO ITEM","UNIDADE ITEM","COEFICIENTE","PRECO UNITARIO","CUSTO TOTAL"]
[null,"INSUMO","34492","CONCRETO USINADO BOMBEAVEL, CLASSE DE RESISTENCIA C20, COM BRITA 0 E 1, SLUMP = 100 +/- 20 MM, EXCLUI SERVICO DE BOMBEAMENTO (NBR 8953)","M3",0.05,{"$f":"G289","v":550},{"$f":"ROUNDDOWN(F300*G300,2)","v":27.5}]
[null,"COMPOSICAO",98576,"TRATAMENTO DE JUNTA DE DILATAÇÃO COM MANTA ASFÁLTICA ADERIDA COM MAÇARICO","M",0.09,21.38,1.92]
[null,"INSUMO",4517,"GUIA DE MADEIRA DE 2,5 X 8,0 CM - CONFECÇÃO E INSTALAÇÃO","M",0.09,3.03,0.27]
[null,"PRODUÇÃO DA EQUIPE",null,null,1,"CUSTO ",null,{"$f":"SUM(H300:H302)","v":29.69}]
[null,"TOTAL",{"$nulls":5},{"$f":"H303/E303","v":29.69},"OK"]
[null,"BDI                %",{"$nulls":5},{"$f":"1+$M$1","v":1.2237}]
[null,"TOTAL DO SERVIÇO - R$",{"$nulls":5},{"$f":"H304*H305","v":36.331653000000003}]
[]
[25,"CODEVASF",null,null," COMPOSIÇÃO DE PREÇO UNITÁRIO",null,null,null,{"$f":"H323","v":27.583385101937086},{"$f":"H325","v":33.753788349240409}]
[null,"OBRA:  ",{"$f":"$C$2","v":" PAVIMENTAÇÃO ASFÁLTICA EM CBUQ - ESTRADA PARA MUQUÉM - TRECHO 2 (EST.145  ATÉ EST.250)"},null,null,null,"DATA: ",{"$f":"$H$2","v":"JULHO DE 2023"}]
[null,"SERVIÇO:  ",{"$f":"VLOOKUP(A308,ORÇAMENTO!$A$10:$I$43,3)","v":"PINTURA DE FAIXA COM TINTA ACRÍLICA - ESPESSURA DE 0,4MM"},null,"SINAPI",{"$f":"VLOOKUP(A308,ORÇAMENTO!$A$10:$I$43,4)","v":5213400},"UNIDADE: ",{"$f":"VLOOKUP(A308,ORÇAMENTO!$A$10:$I$43,5)","v":"M2"}]
[]
[null,"TIPO ITEM","CODIGO ITEM","DESCRIÇÃO ITEM","UNIDADE ITEM","COEFICIENTE","PRECO UNITARIO","CUSTO TOTAL"]
[null,"COMPOSICAO",95133,"MÁQUINA DEMARCADORA DE FAIXA DE TRÁFEGO À FRIO, AUTOPROPELIDA, POTÊNCIA 38 HP","CHP",1,166.26,{"$f":"ROUNDDOWN(F313*G313,2)","v":166.26}]
[null,"COMPOSICAO",88293,"OPERADOR DE DEMARCADORA DE FAIXAS COM ENCARGOS COMPLEMENTARES ","H",1,28.15,28.15]
[null,"COMPOSICAO","88316","SERVENTE COM ENCARGOS COMPLEMENTARES","H",4,19.760000000000002,79.040000000000006]
[null,"INSUMO","M2037","MICROESFERAS DE VIDRO PARA SINALIZACAO HORIZONTAL VIARIA, TIPO I-B","KG",{"$f":"E322*0.08","v":14.1656},10.172000000000001,144.09]
[null,"INSUMO","M2038","MICROESFERAS DE VIDRO PARA SINALIZACAO HORIZONTAL VIARIA, TIPO II-A","KG",{"$f":"E322*0.35","v":61.974499999999992},10.358499999999999,641.96]
[null,"INSUMO","M2034","SOLVENTE A BASE DE RESINA ACRÍLICA","L",{"$f":"$E$322*0.02","v":3.5413999999999999},15.669,55.49]
[null,"INSUMO","M2044","TINTA A BASE DE RESINA ACRILICA EMULSIONADA EM AGUA, PARA SINALIZACAO HORIZONTAL VIARIA","L",{"$f":"$E$322*0.00097","v":0.17175789999999999},20.867899999999999,3.58]
[null,"INSUMO","M2027","TINTA A BASE DE RESINA ACRILICA ESTIRENADA, PARA DEMARCAÇÃO VIARIA","L",{"$f":"$E$322*0.4","v":70.828000000000003},53.165700000000001,3765.62]
[{"$nulls":7},0]
[null,"PRODUÇÃO DA EQUIPE",null,null,177.07,"CUSTO ",null,{"$f":"SUM(H313:H321)","v":4884.1899999999996}]
[null,"TOTAL",{"$nulls":5},{"$f":"H322/E322","v":27.583385101937086},"OK"]
[null,"BDI                %",{"$nulls":5},{"$f":"1+$M$1","v":1.2237}]
[null,"TOTAL DO SERVIÇO - R$",{"$nulls":5},{"$f":"H323*H324","v":33.753788349240409}]
[]
[26,"CODEVASF",null,null," COMPOSIÇÃO DE PREÇO UNITÁRIO",null,null,null,{"$f":"H342","v":524.74},{"$f":"H344","v":642.12433799999997}]
[null,"OBRA:  ",{"$f":"$C$2","v":" PAVIMENTAÇÃO ASFÁLTICA EM CBUQ - ESTRADA PARA MUQUÉM - TRECHO 2 (EST.145  ATÉ EST.250)"},null,null,null,"DATA: ",{"$f":"$H$2","v":"JULHO DE 2023"}]
[null,"SERVIÇO:  ",{"$f":"VLOOKUP(A327,ORÇAMENTO!$A$10:$I$43,3)","v":"PLACA DE REGULAMENTAÇÃO EM AÇO, PELÍCULA RETRORREFLETIVA TIPO I+SI, INCLUSIVE SUPORTE METÁLICO - FORNECIMENTO E IMPLANTAÇÃO"},null,"SICRO",{"$f":"VLOOKUP(A327,ORÇAMENTO!$A$10:$I$43,4)","v":"5213440+\n5213863"},"UNIDADE: ",{"$f":"VLOOKUP(A327,ORÇAMENTO!$A$10:$I$43,5)","v":"UNID"}]
[]
[null,"TIPO ITEM","CODIGO ITEM","DESCRIÇÃO ITEM","UNIDADE ITEM","COEFICIENTE","PRECO UNITARIO","CUSTO TOTAL"]
[null,"COMPOSIÇÃO",96527,"ESCAVAÇÃO MANUAL DE VALA ","M3",5.0299999999999997E-2,{"$f":"G286","v":121.8},{"$f":"ROUNDDOWN(F332*G332,2)","v":6.12}]
[null,"INSUMO","34492","CONCRETO USINADO BOMBEAVEL, CLASSE DE RESISTENCIA C20, COM BRITA 0 E 1, SLUMP = 100 +/- 20 MM, EXCLUI SERVICO DE BOMBEAMENTO (NBR 8953)","M3",5.0299999999999997E-2,{"$f":"G300","v":550},27.66]
[null,"INSUMO","M0787","SUPORTE EM AÇO CARBONO GALVANIZADO PARA PLACA DE SINALIZAÇÃO","KG",12.717000000000001,28.9132,367.68]
[null,"INSUMO","M0789","CONJUNTO PARA FIXAÇÃO DE PLACAS EM AÇO GALVANIZADO (ABRAÇADEIRAS, PARAFUSOS, ARRUELAS, ETC.)","KG",0.69621999999999995,24.485700000000001,17.04]
[null,"COMPOSICAO",88278,"MONTADOR DE ESTRUTURA METÁLICA COM ENCARGOS COMPLEMENTARES ","H",{"$f":"1/4.1","v":0.24390243902439027},25.47,6.21]
[null,"COMPOSICAO","88316","SERVENTE COM ENCARGOS COMPLEMENTARES","H",{"$f":"1/4.1","v":0.24390243902439027},19.760000000000002,4.8099999999999996]
[null,"COMPOSICAO",5824,"CAMINHÃO TOCO, INCLUSIVE CARROCERIA FIXA ABERTA DE MADEIRA P/ TRANSPORTE CARGA SECA","CHP",0.3,184.66,55.39]
[null,"COMPOSICAO",5826,"CAMINHÃO TOCO, INCLUSIVE CARROCERIA FIXA ABERTA DE MADEIRA P/ TRANSPORTE CARGA SECA","CHI",0.7,56.91,39.83]
[{"$nulls":7},0]
[null,"PRODUÇÃO DA EQUIPE",null,null,1,"CUSTO ",null,{"$f":"SUM(H332:H340)","v":524.74}]
[null,"TOTAL",{"$nulls":5},{"$f":"H341/E341","v":524.74},"OK"]
[null,"BDI                %",{"$nulls":5},{"$f":"1+$M$1","v":1.2237}]
[null,"TOTAL DO SERVIÇO - R$",{"$nulls":5},{"$f":"H342*H343","v":642.12433799999997}]
[]
[27,"CODEVASF",null,null," COMPOSIÇÃO DE PREÇO UNITÁRIO",null,null,null,{"$f":"H358","v":22.17},{"$f":"H360","v":27.129429000000002}]
[null,"OBRA:  ",{"$f":"$C$2","v":" PAVIMENTAÇÃO ASFÁLTICA EM CBUQ - ESTRADA PARA MUQUÉM - TRECHO 2 (EST.145  ATÉ EST.250)"},null,null,null,"DATA: ",{"$f":"$H$2","v":"JULHO DE 2023"}]
[null,"SERVIÇO:  ",{"$f":"VLOOKUP(A346,ORÇAMENTO!$A$10:$I$43,3)","v":"RECOMPOSIÇÃO PARCIAL DE CERCA COM MOURÃO DE MADEIRA - ARAME E MOURÃO"},null,"SICRO",{"$f":"VLOOKUP(A346,ORÇAMENTO!$A$10:$I$43,4)","v":"4915732+\n4915731"},"UNIDADE: ",{"$f":"VLOOKUP(A346,ORÇAMENTO!$A$10:$I$43,5)","v":"M"}]
[]
[null,"TIPO ITEM","CODIGO ITEM","DESCRIÇÃO ITEM","UNIDADE ITEM","COEFICIENTE","PRECO UNITARIO","CUSTO TOTAL"]
[null,"COMPOSICAO","88316","SERVENTE COM ENCARGOS COMPLEMENTARES","H",{"$f":"10/60+10/40","v":0.41666666666666663},19.760000000000002,{"$f":"ROUNDDOWN(F351*G351,2)","v":8.23}]
[null,"INSUMO","M0069","ARAME FARPADO GALVANIZADO, 14 BWG (2,11 MM), CLASSE 250","M",4,0.70730000000000004,{"$f":"ROUNDDOWN(F352*G352,2)","v":2.82}]
[null,"INSUMO","M0745","GRAMPO DE ACO POLIDO 1 \" X 9","KG",8.2500000000000004E-3,9.6144999999999996,7.0000000000000007E-2]
[null,"INSUMO","M2014","MOURÃO DE MADEIRA, H=2,20M E D=0,10M","UNID.",0.42,24.19,10.15]
[null,"INSUMO","M2119","MOURÃO DE MADEIRA, H=2,80M E D=0,15M","UNID.",0.02,45.367400000000004,0.9]
[{"$nulls":7},0]
[null,"PRODUÇÃO DA EQUIPE",null,null,1,"CUSTO ",null,{"$f":"SUM(H351:H356)","v":22.17}]
[null,"TOTAL",{"$nulls":5},{"$f":"H357/E357","v":22.17},"OK"]
[null,"BDI                %",{"$nulls":5},{"$f":"1+$M$1","v":1.2237}]
[null,"TOTAL DO SERVIÇO - R$",{"$nulls":5},{"$f":"H358*H359","v":27.129429000000002}]
[]
[28,"CODEVASF",null,null," COMPOSIÇÃO DE PREÇO UNITÁRIO",null,null,null,{"$f":"H372","v":0.16741361201897045},{"$f":"H374","v":0.20486403702761413}]
[null,"OBRA:  ",{"$f":"$C$2","v":" PAVIMENTAÇÃO ASFÁLTICA EM CBUQ - ESTRADA PARA MUQUÉM - TRECHO 2 (EST.145  ATÉ EST.250)"},null,null,null,"DATA: ",{"$f":"$H$2","v":"JULHO DE 2023"}]
[null,"SERVIÇO:  ",{"$f":"VLOOKUP(A362,ORÇAMENTO!$A$10:$I$43,3)","v":"DESMATAMENTO, DESTOCAMENTO, LIMPEZA DE ÁREA E ESTOCAGEM DO MATERIAL DE LIMPEZA COM ARVORES DE DIÂMETRO ATÉ 0,15M"},null,"SICRO",{"$f":"VLOOKUP(A362,ORÇAMENTO!$A$10:$I$43,4)","v":5501700},"UNIDADE: ",{"$f":"VLOOKUP(A362,ORÇAMENTO!$A$10:$I$43,5)","v":"M2"}]
[]
[null,"TIPO ITEM","CODIGO ITEM","DESCRIÇÃO ITEM","UNIDADE ITEM","COEFICIENTE","PRECO UNITARIO","CUSTO TOTAL"]
[null,"COMPOSICAO","5847","TRATOR DE ESTEIRAS, POTÊNCIA 170 HP, PESO OPERACIONAL 19 T, CAÇAMBA 5,2 M3","CHP",1,{"$f":"G83","v":"217,11"},{"$f":"ROUNDDOWN(F367*G367,2)","v":217.11}]
[null,"COMPOSICAO","5849","TRATOR DE ESTEIRAS, POTÊNCIA 170 HP, PESO OPERACIONAL 19 T, CAÇAMBA 5,2 M3","CHI",0,{"$f":"G84","v":"71,35"},0]
[null,"COMPOSICAO","88316","SERVENTE COM ENCARGOS COMPLEMENTARES","H",2,{"$f":"G351","v":19.760000000000002},39.520000000000003]
[{"$nulls":7},{"$f":"ROUNDDOWN(F370*G370,2)","v":0}]
[null,"PRODUÇÃO DA EQUIPE",null,null,1532.91,"CUSTO ",null,{"$f":"SUM(H367:H370)","v":256.63}]
[null,"TOTAL",{"$nulls":5},{"$f":"H371/E371","v":0.16741361201897045},"OK"]
[null,"BDI                %",{"$nulls":5},{"$f":"1+$M$1","v":1.2237}]
[null,"TOTAL DO SERVIÇO - R$",{"$nulls":5},{"$f":"H372*H373","v":0.20486403702761413}]
[]
[30,"CODEVASF",null,null," COMPOSIÇÃO DE PREÇO UNITÁRIO",null,null,null,{"$f":"H384","v":0.47},{"$f":"H386","v":0.54049999999999998}]
[null,"OBRA:  ",{"$f":"$C$2","v":" PAVIMENTAÇÃO ASFÁLTICA EM CBUQ - ESTRADA PARA MUQUÉM - TRECHO 2 (EST.145  ATÉ EST.250)"},null,null,null,"DATA: ",{"$f":"$H$2","v":"JULHO DE 2023"}]
[null,"SERVIÇO:  ",{"$f":"VLOOKUP(A376,ORÇAMENTO!A10:I43,3)","v":"TRANSPORTE COM CAMINHÃO TANQUE DE TRANSPORTE DE MATERIAL ASFÁLTICO DE 30000 L, EM VIA URBANA PAVIMENTADA"},null,"SINAPI",{"$f":"VLOOKUP(A376,ORÇAMENTO!$A$10:$I$43,4)","v":102331},"UNIDADE: ",{"$f":"VLOOKUP(A376,ORÇAMENTO!$A$10:$I$43,5)","v":"TXKM"}]
[]
[null,"TIPO ITEM","CODIGO ITEM","DESCRIÇÃO ITEM","UNIDADE ITEM","COEFICIENTE","PRECO UNITARIO","CUSTO TOTAL"]
[null,"COMPOSICAO","91645","CAMINHÃO DE TRANSPORTE DE MATERIAL ASFÁLTICO 30.000 L, COM CAVALO MECÂNICO DE CAPACIDADE MÁXIMA DE TRAÇÃO COMBINADO DE 66.000 KG, POTÊNCIA 360 CV, INCLUSIVE TANQUE DE ASFALTO COM SERPENTINA","CHP","0,0011000","399,12",{"$f":"ROUNDDOWN(F381*G381,2)","v":0.43}]
[null,"COMPOSICAO","91646","CAMINHÃO DE TRANSPORTE DE MATERIAL ASFÁLTICO 30.000 L, COM CAVALO MECÂNICO DE CAPACIDADE MÁXIMA DE TRAÇÃO COMBINADO DE 66.000 KG, POTÊNCIA 360 CV, INCLUSIVE TANQUE DE ASFALTO COM SERPENTINA","CHI","0,0005000","91,45",0.04]
[null,"PRODUÇÃO DA EQUIPE",null,null,1,"CUSTO ",null,{"$f":"SUM(H381:H382)","v":0.47}]
[null,"TOTAL",{"$nulls":5},{"$f":"H383/E383","v":0.47},"OK"]
[null,"BDI                %",{"$nulls":5},{"$f":"1+$M$2","v":1.1499999999999999}]
[null,"TOTAL DO SERVIÇO - R$",{"$nulls":5},{"$f":"H384*H385","v":0.54049999999999998}]
[]
[31,"CODEVASF",null,null," COMPOSIÇÃO DE PREÇO UNITÁRIO",null,null,null,{"$f":"H397","v":0.47016213000148743},{"$f":"H399","v":0.54068644950171052}]
[null,"OBRA:  ",{"$f":"$C$2","v":" PAVIMENTAÇÃO ASFÁLTICA EM CBUQ - ESTRADA PARA MUQUÉM - TRECHO 2 (EST.145  ATÉ EST.250)"},null,null,null,"DATA: ",{"$f":"$H$2","v":"JULHO DE 2023"}]
[null,"SERVIÇO:  ",{"$f":"VLOOKUP(A388,ORÇAMENTO!$A$10:$I$43,3,0)","v":"TRANSPORTE MASSA ASFÁLTICA COM CAMINHÃO BASCULANTE, EM VIA URBANA PAVIMENTADA"},null,"SICRO",{"$f":"VLOOKUP(A388,ORÇAMENTO!$A$10:$I$43,4,0)","v":"5901640a"},"UNIDADE: ",{"$f":"VLOOKUP(A388,ORÇAMENTO!$A$10:$I$43,5,0)","v":"TXKM"}]
[]
[null,"TIPO ITEM","CODIGO ITEM","DESCRIÇÃO ITEM","UNIDADE ITEM","COEFICIENTE","PRECO UNITARIO","CUSTO TOTAL"]
[null,"COMPOSICAO","89883","CAMINHÃO BASCULANTE 18 M3, COM CAVALO MECÂNICO DE CAPACIDADE MÁXIMA DE TRAÇÃO COMBINADO DE 45000 KG, POTÊNCIA 330 CV, INCLUSIVE SEMIREBOQUE COM CAÇAMBA METÁLICA","CHP",1,316.08999999999997,{"$f":"ROUNDDOWN(F393*G393,2)","v":316.08999999999997}]
[null,"COMPOSICAO","89884","CAMINHÃO BASCULANTE 18 M3, COM CAVALO MECÂNICO DE CAPACIDADE MÁXIMA DE TRAÇÃO COMBINADO DE 45000 KG, POTÊNCIA 330 CV, INCLUSIVE SEMIREBOQUE COM CAÇAMBA METÁLICA","CHI",0,86.09,0]
[null,null,null,"FATOR DE INTERFERÊNCIA CLIMÁTICA","FIC",null,null,{"$f":"0*E396","v":0}]
[null,"PRODUÇÃO DA EQUIPE",null,null,672.3,"CUSTO ",null,{"$f":"SUM(H393:H395)","v":316.08999999999997}]
[null,"TOTAL",{"$nulls":5},{"$f":"H396/E396","v":0.47016213000148743},"OK"]
[null,"BDI                %",{"$nulls":5},{"$f":"1+$M$2","v":1.1499999999999999}]
[null,"TOTAL DO SERVIÇO - R$",{"$nulls":5},{"$f":"H397*H398","v":0.54068644950171052}]
[]
[32,"CODEVASF",null,null," COMPOSIÇÃO DE PREÇO UNITÁRIO",null,null,null,{"$f":"H408","v":4920.43},{"$f":"H410","v":5658.4944999999998}]
[null,"OBRA:  ",{"$f":"$C$2","v":" PAVIMENTAÇÃO ASFÁLTICA EM CBUQ - ESTRADA PARA MUQUÉM - TRECHO 2 (EST.145  ATÉ EST.250)"},null,null,null,"DATA: ",{"$f":"$H$2","v":"JULHO DE 2023"}]
[null,"SERVIÇO:  ",{"$f":"VLOOKUP(A401,ORÇAMENTO!$A$10:$I$50,3)","v":"AQUISIÇÃO DE ASFALTO DILUIDO DE PETROLEO CM-30 - EXCLUSIVE TRANSPORTE"},null,"SINAPI",{"$f":"VLOOKUP(A401,ORÇAMENTO!$A$10:$I$50,4)","v":"CPU.4"},"UNIDADE: ",{"$f":"VLOOKUP(A401,ORÇAMENTO!$A$10:$I$50,5)","v":"T"}]
[]
[null,"TIPO ITEM","CODIGO ITEM","DESCRIÇÃO ITEM","UNIDADE ITEM","COEFICIENTE","PRECO UNITARIO","CUSTO TOTAL"]
[null,"INSUMO","COTAÇÃO","ASFALTO DILUIDO CM-30 (COLETA ANP INCLUINDO ICMS)","T",1,{"$f":"4.03476*1000*1.2195122","v":4920.4390440720008},{"$f":"ROUNDDOWN(F406*G406,2)","v":4920.43}]
[null,"PRODUÇÃO DA EQUIPE",null,null,1,"CUSTO ",null,{"$f":"SUM(H406:H406)","v":4920.43}]
[null,"TOTAL",{"$nulls":5},{"$f":"H407/E407","v":4920.43}]
[null,"BDI                %",{"$nulls":5},{"$f":"1+$M$2","v":1.1499999999999999}]
[null,"TOTAL DO SERVIÇO - R$",{"$nulls":5},{"$f":"H408*H409","v":5658.4944999999998}]
[]
[33,"CODEVASF",null,null," COMPOSIÇÃO DE PREÇO UNITÁRIO",null,null,null,{"$f":"H419","v":2837.6},{"$f":"H421","v":3263.24}]
[null,"OBRA:  ",{"$f":"$C$2","v":" PAVIMENTAÇÃO ASFÁLTICA EM CBUQ - ESTRADA PARA MUQUÉM - TRECHO 2 (EST.145  ATÉ EST.250)"},null,null,null,"DATA: ",{"$f":"$H$2","v":"JULHO DE 2023"}]
[null,"SERVIÇO:  ",{"$f":"VLOOKUP(A412,ORÇAMENTO!$A$10:$I$50,3)","v":"AQUISIÇÃO DE EMULSAO ASFALTICA CATIONICA RR-1C - EXCLUSIVE TRANSPORTE"},null,"SINAPI",{"$f":"VLOOKUP(A412,ORÇAMENTO!$A$10:$I$50,4)","v":"CPU.5"},"UNIDADE: ",{"$f":"VLOOKUP(A412,ORÇAMENTO!$A$10:$I$50,5)","v":"T"}]
[]
[null,"TIPO ITEM","CODIGO ITEM","DESCRIÇÃO ITEM","UNIDADE ITEM","COEFICIENTE","PRECO UNITARIO","CUSTO TOTAL"]
[null,"INSUMO","COTAÇÃO","EMULSÃO ASFÁLTICA CATIÔNICA RR-1C (COLETA ANP INCLUINDO ICMS)","T",1,{"$f":"2.32684*1000*1.2195122","v":2837.6097674479997},{"$f":"ROUNDDOWN(F417*G417,2)","v":2837.6}]
[null,"PRODUÇÃO DA EQUIPE",null,null,1,"CUSTO ",null,{"$f":"SUM(H417:H417)","v":2837.6}]
[null,"TOTAL",{"$nulls":5},{"$f":"H418/E418","v":2837.6}]
[null,"BDI                %",{"$nulls":5},{"$f":"1+$M$2","v":1.1499999999999999}]
[null,"TOTAL DO SERVIÇO - R$",{"$nulls":5},{"$f":"H419*H420","v":3263.24}]
[]
[34,"CODEVASF",null,null," COMPOSIÇÃO DE PREÇO UNITÁRIO",null,null,null,{"$f":"H430","v":600},{"$f":"H432","v":690}]
[null,"OBRA:  ",{"$f":"$C$2","v":" PAVIMENTAÇÃO ASFÁLTICA EM CBUQ - ESTRADA PARA MUQUÉM - TRECHO 2 (EST.145  ATÉ EST.250)"},null,null,null,"DATA: ",{"$f":"$H$2","v":"JULHO DE 2023"}]
[null,"SERVIÇO:  ",{"$f":"VLOOKUP(A423,ORÇAMENTO!$A$10:$I$50,3)","v":"AQUISIÇÃO DE CONCRETO BETUMINOSO USINADO A QUENTE (CBUQ) PARA PAVIMENTACAO ASFALTICA, PADRAO DNIT, FAIXA C, COM CAP 50/70 - EXCLUSIVE TRANSPORTE"},null,"SINAPI",{"$f":"VLOOKUP(A423,ORÇAMENTO!$A$10:$I$50,4)","v":"CPU.6"},"UNIDADE: ",{"$f":"VLOOKUP(A423,ORÇAMENTO!$A$10:$I$50,5)","v":"T"}]
[]
[null,"TIPO ITEM","CODIGO ITEM","DESCRIÇÃO ITEM","UNIDADE ITEM","COEFICIENTE","PRECO UNITARIO","CUSTO TOTAL"]
[null,"INSUMO","COTAÇÃO","CONCRETO BETUMINOSO USINADO A QUENTE (CBUQ) PARA PAVIMENTACAO ASFALTICA, PADRAO DNIT, FAIXA C, COM CAP 50/70 - AQUISICAO POSTO USINA","T",1,600,{"$f":"ROUNDDOWN(F428*G428,2)","v":600}]
[null,"PRODUÇÃO DA EQUIPE",null,null,1,"CUSTO ",null,{"$f":"SUM(H428:H428)","v":600}]
[null,"TOTAL",{"$nulls":5},{"$f":"H429/E429","v":600}]
[null,"BDI                %",{"$nulls":5},{"$f":"1+$M$2","v":1.1499999999999999}]
[null,"TOTAL DO SERVIÇO - R$",{"$nulls":5},{"$f":"H430*H431","v":690}]
[]
[{"$nulls":7},{"$f":"ORÇAMENTO!I43","v":1719073.54}]

{"sheet":"BDI SERV","index":2,"n_rows":37,"n_cols":5,"rows_kept":37,"cut":false,"hidden":false,"merged":[[36,0,36,5],[3,1,4,1],[3,2,4,2],[0,1,2,4],[32,0,34,5],[28,0,28,5],[30,1,30,2],[31,1,31,2]]}
[null,"DETALHAMENTO DO BDI - SERVIÇOS"]
[]
[]
[null,"Item","Descrição dos Serviços","%","%"]
[null,null,null,"PV","CD"]
[]
[null,1,"ADMINISTRAÇÃO CENTRAL"," ",4.01]
[null,"1.1","ESCRITÓRIO CENTRAL"," "," "]
[null,"1.2","VIAGENS"," "," "]
[null,"1.3","OUTROS"," "," "]
[null," "," "," "," "]
[null,2,"IMPOSTOS E TAXAS",{"$f":"SUM(D13:D16)","v":6.15},{"$f":"SUM(E13:E16)","v":7.6899999999999995}]
[null,"2.1","ISS (*)",2.5,{"$f":"ROUND(D13*1.2515,2)","v":3.13}]
[null,"2.2","PIS",0.65,0.81]
[null,"2.3","Cofins",3,3.75]
[null,"2.4","CONTRIBUIÇÃO PREVIDENCIÁRIA SOBRE A RENDA BRUTA",0,0]
[]
[null,3,"TAXA DE RISCO"," ",{"$f":"SUM(E19:E22)","v":1.1600000000000001}]
[null,"3.1","SEGURO",null,0.2]
[null,"3.2","RISCO",null,0.56000000000000005]
[null,"3.3","GARANTIA",null,0.4]
[]
[null,4,"DESPESAS FINANCEIRAS"," ",1.1100000000000001]
[]
[null,5,"LUCRO",null,8]
[]
[null," ","BDI - CALCULADO"," ",{"$f":"ROUND((((1+(E7+E18)/100)*(1+E23/100)*(1+E25/100)/(1-D12/100)-1)*100),2)","v":22.37}]
[]
["BDI = ((1+((AC+S+R+G)/100))x(1+DF/100)x(1+L/100)/(1-I/100)-1)*100"]
[]
[null,"BDI (CALCULADO):",null,{"$f":"ROUND((((1+((E7+E18)/100))*(1+E23/100)*(1+E25/100))/(1-D12/100)-1)*100,2)","v":22.37},"%"]
[null," "]
["(*) ISS CONFORME LEI MUNICIPAL Nº 1241 / 2017 - DECLARAÇÃO EM ANEXO, \nAPLICANDO-SE A DEDUÇÃO PREVISTA NO §12 DO ART. 120 REFERENTE AOS MATERIAIS \n(50% SEM NECESSIDADE DE COMPROVAÇÃO)"]
[]
[]
[]
["BDI EM CONFORMIDADE COM OS ACÓRDÃOS Nº 2369/2011 e ACÓRDÃO Nº 2.622/2013 - TCU - PLENÁRIO"]

{"sheet":"BDI FORN","index":3,"n_rows":37,"n_cols":5,"rows_kept":37,"cut":false,"hidden":false,"merged":[[32,0,34,5],[36,0,36,5],[0,1,2,4],[3,1,4,1],[3,2,4,2],[28,0,28,5],[30,1,30,2],[31,1,31,2]]}
[null,"DETALHAMENTO DO BDI - FORNECIMENTO \n(MATERIAL ASFÁLTICO)"]
[]
[]
[null,"Item","Descrição dos Serviços","%","%"]
[null,null,null,"PV","CD"]
[]
[null,1,"ADMINISTRAÇÃO CENTRAL"," ",3.72]
[null,"1.1","ESCRITÓRIO CENTRAL"," "," "]
[null,"1.2","VIAGENS"," "," "]
[null,"1.3","OUTROS"," "," "]
[null," "," "," "," "]
[null,2,"IMPOSTOS E TAXAS",{"$f":"SUM(D13:D16)","v":3.65},{"$f":"SUM(E13:E16)","v":4.5600000000000005}]
[null,"2.1","ISS (*)",null,{"$f":"ROUND(D13*1.2515,2)","v":0}]
[null,"2.2","PIS",0.65,0.81]
[null,"2.3","Cofins",3,3.75]
[null,"2.4","CONTRIBUIÇÃO PREVIDENCIÁRIA SOBRE A RENDA BRUTA",0,0]
[]
[null,3,"TAXA DE RISCO"," ",{"$f":"SUM(E19:E22)","v":0.82000000000000006}]
[null,"3.1","SEGURO",null,0.16]
[null,"3.2","RISCO",null,0.5]
[null,"3.3","GARANTIA",null,0.16]
[]
[null,4,"DESPESAS FINANCEIRAS"," ",0.94]
[]
[null,5,"LUCRO",null,5]
[]
[null," ","BDI - CALCULADO"," ",{"$f":"ROUND((((1+(E7+E18)/100)*(1+E23/100)*(1+E25/100)/(1-D12/100)-1)*100),2)","v":15}]
[]
["BDI = ((1+((AC+S+R+G)/100))x(1+DF/100)x(1+L/100)/(1-I/100)-1)*100"]
[]
[null,"BDI (CALCULADO):",null,{"$f":"ROUND((((1+((E7+E18)/100))*(1+E23/100)*(1+E25/100))/(1-D12/100)-1)*100,2)","v":15},"%"]
[null," "]
[]
[]
[]
[]
["BDI EM CONFORMIDADE COM OS ACÓRDÃOS Nº 2369/2011 e ACÓRDÃO Nº 2.622/2013 - TCU - PLENÁRIO"]

{"sheet":"CRONOGRAMA","index":4,"n_rows":21,"n_cols":12,"rows_kept":21,"cut":false,"hidden":false,"merged":[[7,0,8,0],[9,0,10,0],[11,0,12,0],[0,1,0,11],[1,6,1,11],[2,6,2,11],[3,1,3,6],[5,0,6,0],[5,2,6,2],[1,1,2,1],[5,1,6,1],[1,2,2,4],[7,2,8,2],[9,2,10,2],[11,2,12,2],[7,1,8,1],[17,1,18,2],[20,1,24,11],[9,1,10,1],[11,1,12,1],[15,0,16,0],[15,1,16,1],[15,2,16,2],[13,1,14,1],[13,2,14,2],[13,0,14,0]]}
[null,"CRONOGRAMA FÍSICO-FINANCEIRO"]
[null,"OBRA: ",{"$f":"ORÇAMENTO!C5","v":" PAVIMENTAÇÃO ASFÁLTICA EM CBUQ - ESTRADA PARA MUQUÉM - TRECHO 2 (EST.145  ATÉ EST.250)"},null,null,"VALOR:",{"$f":"ORÇAMENTO!I43","v":1719073.54}]
[{"$nulls":5},"PRAZO: ","180 DIAS "]
[]
[null,"ITEM","ETAPAS/DESCRIÇAO","FISICO/  FINANCEIRO","TOTAL    ETAPAS","MÊS 1","MÊS 2","MÊS 3","MÊS 4","MÊS 5","MÊS 6","TOTAL"]
["A",{"$f":"VLOOKUP(A6,ORÇAMENTO!$A$9:$I$43,2)","v":1},{"$f":"VLOOKUP(A6,ORÇAMENTO!$A$9:$I$43,3)","v":"SERVIÇOS PRELIMINARES "},"FISICO ",{"$f":"ROUND(E7/$G$2,4)","v":8.1299999999999997E-2},0.15,0.2,0.2,0.2,0.15,0.1,{"$f":"SUM(F6:K6)","v":1}]
[null,null,null,"FINANCEIRO",{"$f":"ORÇAMENTO!I9","v":139724.03000000003},{"$f":"ROUND($E$7*F6,2)","v":20958.599999999999},27944.81,27944.81,{"$f":"ROUND($E$7*I6,2)","v":27944.81},20958.599999999999,13972.4,139724.03]
["B",{"$f":"VLOOKUP(A8,ORÇAMENTO!$A$9:$I$43,2)","v":2},{"$f":"VLOOKUP(A8,ORÇAMENTO!$A$9:$I$43,3)","v":"TERRAPLANAGEM E PAVIMENTAÇÃO"},"FISICO ",{"$f":"ROUND(E9/$G$2,4)","v":0.28210000000000002},0.1,0.25,0.25,0.25,0.15,null,1]
[null,null,null,"FINANCEIRO",{"$f":"ORÇAMENTO!I15","v":484879.59},{"$f":"ROUND($E$9*F8,2)","v":48487.96},121219.9,121219.9,{"$f":"ROUND($E$9*I8,2)","v":121219.9},72731.94,0,484879.60000000003]
["C",{"$f":"VLOOKUP(A10,ORÇAMENTO!$A$9:$I$43,2)","v":3},{"$f":"VLOOKUP(A10,ORÇAMENTO!$A$9:$I$43,3)","v":"TRANSPORTE DE MATERIAIS"},"FISICO ",{"$f":"ROUND(E11/$G$2,4)","v":2.5700000000000001E-2},null,0.25,0.25,0.25,0.25,null,1]
[null,null,null,"FINANCEIRO",{"$f":"ORÇAMENTO!I24","v":44116.15},{"$f":"ROUND($E$11*F10,2)","v":0},{"$f":"ROUND($E$11*G10,2)","v":11029.04},11029.04,{"$f":"ROUND($E$11*I10,2)","v":11029.04},11029.04,0,44116.160000000003]
["E",{"$f":"VLOOKUP(A12,ORÇAMENTO!$A$9:$I$43,2)","v":4},{"$f":"VLOOKUP(A12,ORÇAMENTO!$A$9:$I$43,3)","v":"OBRAS COMPLEMENTARES E SINALIZAÇÃO"},"FISICO ",{"$f":"ROUND(E13/$G$2,4)","v":4.7600000000000003E-2},null,null,0.25,0.25,0.25,0.25,1]
[null,null,null,"FINANCEIRO",{"$f":"ORÇAMENTO!I27","v":81769.89},{"$f":"ROUND($E$13*F12,2)","v":0},0,20442.47,{"$f":"ROUND($E$13*I12,2)","v":20442.47},20442.47,20442.47,81769.88]
["F",{"$f":"VLOOKUP(A14,ORÇAMENTO!$A$9:$I$43,2)","v":4},{"$f":"VLOOKUP(A14,ORÇAMENTO!$A$9:$I$43,3)","v":"OBRAS COMPLEMENTARES E SINALIZAÇÃO"},"FISICO ",{"$f":"ROUND(E15/$G$2,4)","v":2.9600000000000001E-2},null,0.25,0.25,0.25,0.25,null,1]
[null,null,null,"FINANCEIRO",{"$f":"ORÇAMENTO!I36","v":50822.29},{"$f":"ROUND($E$13*F14,2)","v":0},{"$f":"ROUND($E$15*G14,2)","v":12705.57},{"$f":"ROUND($E$15*H14,2)","v":12705.57},{"$f":"ROUND($E$15*I14,2)","v":12705.57},{"$f":"ROUND($E$15*J14,2)","v":12705.57},0,50822.28]
["G",{"$f":"VLOOKUP(A16,ORÇAMENTO!$A$9:$I$43,2)","v":6},{"$f":"VLOOKUP(A16,ORÇAMENTO!$A$9:$I$43,3)","v":"FORNECIMENTOS - MATERIAL ASFÁLTICO (BDI DIFERENCIADO)"},"FISICO ",{"$f":"ROUND(E17/$G$2,4)","v":0.53390000000000004},null,0.25,0.25,0.25,0.25,null,1]
[null,null,null,"FINANCEIRO",{"$f":"ORÇAMENTO!I39","v":917761.59},{"$f":"ROUND($E$13*F16,2)","v":0},{"$f":"ROUND($E$17*G16,2)","v":229440.4},{"$f":"ROUND($E$17*H16,2)","v":229440.4},{"$f":"ROUND($E$17*I16,2)","v":229440.4},229440.4,0,917761.6]
[null,"TOTAL",null,"FISICO ",{"$f":"SUM(F18:K18)","v":1.0000000058170868},{"$f":"F19/E19","v":4.039766675717666E-2},{"$f":"G19/E19","v":0.23404450748511901},{"$f":"H19/E19","v":0.24593606972741841},{"$f":"I19/E19","v":0.24593606972741841},{"$f":"J19/E19","v":0.21366626351540494},{"$f":"K19/E19","v":2.0019428604549402E-2},1.0000000058170868]
[null,null,null,"FINANCEIRO",{"$f":"E11+E9+E7+E13+E17+E15","v":1719073.54},69446.559999999998,402339.72000000003,422782.19,422782.19,367308.02,34414.870000000003,{"$f":"SUM(F19:K19)-0.02","v":1719073.53}]
[]
[null,"OBSERVAÇÕES:"]