{"text_format":"2","workbook":"xlsx","n_sheets":5,"sheets":["ORÇAMENTO","CPU","BDI SERV","BDI FORN","CRONOGRAMA"],"not_rendered":{"charts":0,"images":2,"macros":0,"external_links":0,"defined_names":5,"comments":1,"pivot_tables":0},"unopened":[],"bounds":{"document_bytes":16777216,"sheet_cells":100000,"run_cost":"one","rows_first":2000,"rows_last":500,"rows_between":2000,"halvings":0,"cell_chars":16384,"cell_head_chars":4096},"cells_cut":0,"cells_raw":0,"read":"whole","date_system":"1900"}

{"sheet":"ORÇAMENTO","index":0,"n_rows":43,"n_cols":9,"rows_kept":43,"cut":false,"hidden":false,"merged":[[15,10,16,10],[45,8,46,8],[6,3,6,7],[0,0,7,0],[0,2,0,8],[1,2,1,8],[2,2,2,8],[4,2,4,8],[5,6,5,7],[6,1,6,2],[42,1,42,7]]}
["<---- NUMERAR SERVIÇOS PARA CPU",null,"Ministério do Desenvolvimento Regional"]
[null,null,"Companhia de Desenvolvimento dos Vales do São Francisco e do Parnaíba"]
[null,null,"1ª Superintendência Regional"]
[]
[null,"OBRA: "," PAVIMENTAÇÃO ASFÁLTICA EM CBUQ - ESTRADA PARA MUQUÉM - TRECHO 2 (EST.145  ATÉ EST.250)"]
[null,"DATA:","JULHO DE 2023",null,null,null,"BDI Serviços:",null,{"$f":"'BDI SERV'!D31/100","v":0.22370000000000001}]
[null,"PRAZO DE EXECUÇÃO:     180 DIAS",null,"BDI Fornecimento e Transporte - Insumos Asfálticos:",{"$nulls":4},{"$f":"'BDI FORN'!D31/100","v":0.15}]
[null,"ITEM","DISCRIMINAÇÃO",null,"UNID.","QUANT.","P. UNITÁRIO","P.UNIT.C/ BDI","P. TOTAL"]
["A",1,"SERVIÇOS PRELIMINARES ",{"$nulls":5},{"$f":"SUM(I10:I14)","v":139724.03000000003}]
[1,"1.1","MOBILIZAÇÃO E DESMOBILIZAÇÃO","CPU.1","GL",1,{"$f":"VLOOKUP(A10,CPU!$A$1:$N$4735,9)","v":6180.16},{"$f":"VLOOKUP(A10,CPU!$A$1:$N$4735,10)","v":7562.6617919999999},{"$f":"ROUND(F10*H10,2)","v":7562.66}]
[2,"1.2","ADMINISTRAÇÃO LOCAL","CPU.2","GL",1,{"$f":"VLOOKUP(A11,CPU!$A$1:$N$4735,9)","v":94912.320000000007},{"$f":"VLOOKUP(A11,CPU!$A$1:$N$4735,10)","v":116144.20598400001},{"$f":"ROUND(F11*H11,2)","v":116144.21}]
[3,"1.3","CANTEIRO DE OBRAS","CPU.3","GL",1,{"$f":"VLOOKUP(A12,CPU!$A$1:$N$4735,9)","v":6849},{"$f":"VLOOKUP(A12,CPU!$A$1:$N$4735,10)","v":8381.1213000000007},{"$f":"ROUND(F12*H12,2)","v":8381.1200000000008}]
[4,"1.4","PLACA DE OBRA EM CHAPA DE AÇO GALVANIZADO",103689,"M2",2,{"$f":"VLOOKUP(A13,CPU!$A$1:$N$4735,9)","v":308.06},{"$f":"VLOOKUP(A13,CPU!$A$1:$N$4735,10)","v":376.97302200000001},{"$f":"ROUND(F13*H13,2)","v":753.95}]
[5,"1.5","SERVIÇOS TOPOGRÁFICOS PARA PAVIMENTAÇÃO, INCLUSIVE NOTA DE SERVIÇO, ACOMPANHAMENTO E GREIDE",78472,"M2",15200,{"$f":"VLOOKUP(A14,CPU!$A$1:$N$4735,9)","v":0.37},{"$f":"VLOOKUP(A14,CPU!$A$1:$N$4735,10)","v":0.45276899999999998},{"$f":"ROUND(F14*H14,2)","v":6882.09}]
["B",2,"TERRAPLANAGEM E PAVIMENTAÇÃO",{"$nulls":5},{"$f":"SUM(I16:I23)","v":484879.59}]
[6,"2.1","ESCAVAÇÃO HORIZONTAL EM SOLO DE 1A CATEGORIA",101116,"M3",7199.9999999999991,{"$f":"VLOOKUP(A16,CPU!$A$1:$N$4735,9)","v":1.87},{"$f":"VLOOKUP(A16,CPU!$A$1:$N$4735,10)","v":2.288319},{"$f":"ROUND(F16*H16,2)","v":16475.900000000001}]
[7,"2.2","CARGA, MANOBRA E DESCARGA DE AGREGADOS OU SOLOS EM CAMINHÃO BASCULANTE - DESCARGA LIVRE",5914351,"M3",7199.9999999999991,{"$f":"VLOOKUP(A17,CPU!$A$1:$N$4735,9)","v":1.8440370986088019},{"$f":"VLOOKUP(A17,CPU!$A$1:$N$4735,10)","v":2.2565481975675907},{"$f":"ROUND(F17*H17,2)","v":16247.15}]
[8,"2.3","REGULARIZAÇÃO E COMPACTAÇÃO DE SUBLEITO",4011209,"M2",15200,{"$f":"VLOOKUP(A18,CPU!$A$1:$N$4735,9)","v":0.8648084497873062},{"$f":"VLOOKUP(A18,CPU!$A$1:$N$4735,10)","v":1.0582661000047267},16085.64]
[9,"2.4","COMPACTAÇÃO DE ATERROS A 100% DOP PROCTOR NORMAL",5502978,"M3",599.99999999999955,{"$f":"VLOOKUP(A19,CPU!$A$1:$N$4735,9)","v":4.1581796670630204},{"$f":"VLOOKUP(A19,CPU!$A$1:$N$4735,10)","v":5.0883644585850183},{"$f":"ROUND(F19*H19,2)","v":3053.02}]
[10,"2.5","BASE OU SUB-BASE DE BICA CORRIDA COM BRITA COMERCIAL","4011276a","M3",3040,{"$f":"VLOOKUP(A20,CPU!$A$1:$N$4735,9)","v":107.31211107969607},{"$f":"VLOOKUP(A20,CPU!$A$1:$N$4735,10)","v":131.31783032822409},399206.2]
[11,"2.6","IMPRIMAÇÃO COM ASFALTO DILUIDO CM-30",4011351,"M2",15200,{"$f":"VLOOKUP(A21,CPU!$A$1:$N$4735,9)","v":0.34250000000000003},{"$f":"VLOOKUP(A21,CPU!$A$1:$N$4735,10)","v":0.41911725000000005},6370.58]
[12,"2.7","PINTURA DE LIGAÇÃO COM EMULSÃO ASFÁLTICA RR-2C",4011353,"M2",12600,{"$f":"VLOOKUP(A22,CPU!$A$1:$N$4735,9)","v":0.25690000000000002},{"$f":"VLOOKUP(A22,CPU!$A$1:$N$4735,10)","v":0.31436853000000003},3961.04]
[13,"2.8","EXECUÇÃO DE PAVIMENTO COM APLICAÇÃO DE CONCRETO ASFÁLTICO USINADO A QUENTE (CBUQ), CAMADA DE ROLAMENTO - EXCLUSIVE FORNECIMENTO E TRANSPORTE",4011463,"T",1150,{"$f":"VLOOKUP(A23,CPU!$A$1:$N$4735,9)","v":16.685004417670683},{"$f":"VLOOKUP(A23,CPU!$A$1:$N$4735,10)","v":20.417439905903613},23480.06]
["C",3,"TRANSPORTE DE MATERIAIS",{"$nulls":5},{"$f":"SUM(I25:I26)","v":44116.15}]
[14,"3.1","TRANSPORTE COM CAMINHÃO BASCULANTE, EM VIA URBANA EM REVESTIMENTO PRIMÁRIO",5901638,"M3XKM",37003.913082824489,{"$f":"VLOOKUP(A25,CPU!$A$1:$N$4735,9,0)","v":0.62485229808121379},{"$f":"VLOOKUP(A25,CPU!$A$1:$N$4735,10)","v":0.76463175716198128},{"$f":"ROUND(F25*H25,2)","v":28294.37}]
[15,"3.2","TRANSPORTE COM CAMINHÃO BASCULANTE, EM VIA URBANA PAVIMENTADA",5901640,"M3XKM",27500.004209315201,{"$f":"VLOOKUP(A26,CPU!$A$1:$N$4735,9,0)","v":0.47016213000148743},{"$f":"VLOOKUP(A26,CPU!$A$1:$N$4735,10,0)","v":0.57533739848282017},{"$f":"ROUND(F26*H26,2)","v":15821.78}]
["E",4,"OBRAS COMPLEMENTARES E SINALIZAÇÃO",{"$nulls":5},{"$f":"SUM(I28:I35)","v":81769.89}]
[17,"4.1","DESCIDA D’ÁGUA DE ATERROS EM DEGRAUS - DAD 04 - AREIA E BRITA COMERCIAIS",2003411,"M2",9,{"$f":"VLOOKUP(A28,CPU!$A$1:$N$4735,9,0)","v":608.04999999999984},{"$f":"VLOOKUP(A28,CPU!$A$1:$N$4735,10,0)","v":744.07078499999977},{"$f":"ROUND(F28*H28,2)","v":6696.64}]
[18,"4.2","ENRONCAMENTO DE PEDRA ARRUMADA MANUALMENTE - PEDRA DE MÃO COMERCIAL - FORNECIMENTO E ASSENTAMENTO ",1505879,"M3",2.9995999999999996,{"$f":"VLOOKUP(A29,CPU!$A$1:$N$4735,9,0)","v":235.94},{"$f":"VLOOKUP(A29,CPU!$A$1:$N$4735,10,0)","v":288.71977800000002},{"$f":"ROUND(F29*H29,2)","v":866.04}]
[22,"4.3","SAÍDA D'ÁGUA EM TALUDES DE CORTE E ATERRO (SDA E SDC) - AREIA E BRITA COMERCIAIS","RO-46167a","UNID",3,{"$f":"VLOOKUP(A30,CPU!$A$1:$N$4735,9,0)","v":313.69},{"$f":"VLOOKUP(A30,CPU!$A$1:$N$4735,10,0)","v":383.86245300000002},{"$f":"ROUND(F30*H30,2)","v":1151.5899999999999}]
[23,"4.4","SARJETA DE CONCRETO EM CORTE - SCC 50/20","2003349a","M",680,{"$f":"VLOOKUP(A31,CPU!$A$1:$N$4735,9,0)","v":29.69},{"$f":"VLOOKUP(A31,CPU!$A$1:$N$4735,10,0)","v":36.331653000000003},{"$f":"ROUND(F31*H31,2)","v":24705.52}]
[25,"4.5","PINTURA DE FAIXA COM TINTA ACRÍLICA - ESPESSURA DE 0,4MM",5213400,"M2",680,{"$f":"VLOOKUP(A32,CPU!$A$1:$N$4735,9,0)","v":27.583385101937086},{"$f":"VLOOKUP(A32,CPU!$A$1:$N$4735,10,0)","v":33.753788349240409},{"$f":"ROUND(F32*H32,2)","v":22952.58}]
[26,"4.6","PLACA DE REGULAMENTAÇÃO EM AÇO, PELÍCULA RETRORREFLETIVA TIPO I+SI, INCLUSIVE SUPORTE METÁLICO - FORNECIMENTO E IMPLANTAÇÃO","5213440+\n5213863","UNID",28,{"$f":"VLOOKUP(A33,CPU!$A$1:$N$4735,9,0)","v":524.74},{"$f":"VLOOKUP(A33,CPU!$A$1:$N$4735,10,0)","v":642.12433799999997},17979.48]
[27,"4.7","RECOMPOSIÇÃO PARCIAL DE CERCA COM MOURÃO DE MADEIRA - ARAME E MOURÃO","4915732+\n4915731","M",210,{"$f":"VLOOKUP(A34,CPU!$A$1:$N$4735,9,0)","v":22.17},{"$f":"VLOOKUP(A34,CPU!$A$1:$N$4735,10,0)","v":27.129429000000002},{"$f":"ROUND(F34*H34,2)","v":5697.18}]
[28,"4.8","DESMATAMENTO, DESTOCAMENTO, LIMPEZA DE ÁREA E ESTOCAGEM DO MATERIAL DE LIMPEZA COM ARVORES DE DIÂMETRO ATÉ 0,15M",5501700,"M2",8400,{"$f":"VLOOKUP(A35,CPU!$A$1:$N$4735,9,0)","v":0.16741361201897045},{"$f":"VLOOKUP(A35,CPU!$A$1:$N$4735,10,0)","v":0.20486403702761413},{"$f":"ROUND(F35*H35,2)","v":1720.86}]
[null,5,"TRANSPORTE - MATERIAL ASFÁLTICO (BDI DIFERENCIADO)",{"$nulls":5},{"$f":"SUM(I37:I38)","v":50822.29}]
[30,"5.1","TRANSPORTE COM CAMINHÃO TANQUE DE TRANSPORTE DE MATERIAL ASFÁLTICO DE 30000 L, EM VIA URBANA PAVIMENTADA",102331,"TXKM",12000,{"$f":"VLOOKUP(A37,CPU!$A$1:$N$4735,9,0)","v":0.47},{"$f":"VLOOKUP(A37,CPU!$A$1:$N$4735,10,0)","v":0.54049999999999998},{"$f":"ROUND(F37*H37,2)","v":6486}]
[31,"5.2","TRANSPORTE MASSA ASFÁLTICA COM CAMINHÃO BASCULANTE, EM VIA URBANA PAVIMENTADA","5901640a","TXKM",82000,{"$f":"VLOOKUP(A38,CPU!$A$1:$N$4735,9,0)","v":0.47016213000148743},{"$f":"VLOOKUP(A38,CPU!$A$1:$N$4735,10,0)","v":0.54068644950171052},{"$f":"ROUND(F38*H38,2)","v":44336.29}]
["G",6,"FORNECIMENTOS - MATERIAL ASFÁLTICO (BDI DIFERENCIADO)",{"$nulls":5},{"$f":"SUM(I40:I42)","v":917761.59}]
[32,"6.1","AQUISIÇÃO DE ASFALTO DILUIDO DE PETROLEO CM-30 - EXCLUSIVE TRANSPORTE","CPU.4","T",18.500000000000004,{"$f":"VLOOKUP(A40,CPU!$A$1:$N$4735,9)","v":4920.43},{"$f":"VLOOKUP(A40,CPU!$A$1:$N$4735,10)","v":5658.4944999999998},{"$f":"ROUND(F40*H40,2)","v":104682.15}]
{"$rows_left_out":4}
{"sheet":"CPU","index":1,"n_rows":434,"n_cols":13,"rows_kept":434,"cut":false,"hidden":false,"merged":[[297,1,297,7],[302,1,302,3],[302,5,302,6],[303,1,303,6],[304,1,304,6],[305,1,305,6],[361,0,373,0],[361,1,361,3],[361,4,361,7],[362,2,362,5],[363,2,363,3],[364,1,364,7],[370,1,370,3],[370,5,370,6],[371,1,371,6],[372,1,372,6],[373,1,373,6],[345,0,359,0],[345,1,345,3],[345,4,345,7],[346,2,346,5],[347,2,347,3],[348,1,348,7],[356,1,356,3],[356,5,356,6],[357,1,357,6],[358,1,358,6],[359,1,359,6],[326,0,343,0],[326,1,326,3],[326,4,326,7],[327,2,327,5],[328,2,328,3],[329,1,329,7],[340,1,340,3],[340,5,340,6],[341,1,341,6],[342,1,342,6],[343,1,343,6],[281,2,281,5],[282,2,282,3],[283,1,283,7],[289,1,289,3],[289,5,289,6],[290,1,290,6],[291,1,291,6],[292,1,292,6],[307,0,324,0],[307,1,307,3],[307,4,307,7],[308,2,308,5],[309,2,309,3],[310,1,310,7],[321,1,321,3],[321,5,321,6],[322,1,322,6],[323,1,323,6],[324,1,324,6],[294,0,305,0],[294,1,294,3],[294,4,294,7],[295,2,295,5],[296,2,296,3],[224,0,235,0],[237,0,248,0],[199,1,199,3],[199,5,199,6],[204,4,204,7],[189,2,189,3],[205,2,205,5],[206,2,206,3],[207,1,207,7],[200,1,200,6],[201,1,201,6],[202,1,202,6],[204,0,223,0],[146,1,146,6],[248,1,248,6],[168,1,168,6],[224,1,224,3],[224,4,224,7],[204,1,204,3],[148,1,148,3],[148,4,148,7],[149,2,149,5],[150,2,150,3],[151,1,151,7],[220,1,220,6],[219,1,219,3],[219,5,219,6],[126,1,126,3],[126,4,126,7],[127,2,127,5],[128,2,128,3],[129,1,129,7],[143,1,143,3],[143,5,143,6],[144,1,144,6],[145,1,145,6],[45,10,45,11],[46,2,46,5],[245,1,245,3],[245,5,245,6],[246,1,246,6],[247,1,247,6],[28,1,28,6],[29,1,29,6],[30,1,30,6],[102,1,102,6],[90,1,90,3],[90,4,90,7],[91,2,91,5],[92,2,92,3],[93,1,93,7],[99,1,99,3],[99,5,99,6],[100,1,100,6],[101,1,101,6],[32,1,32,3],[32,4,32,7],[43,1,43,6],[45,1,45,3],[45,4,45,7],[32,10,32,11],[33,2,33,5],[34,2,34,3],[35,1,35,7],[33,8,34,9],[40,1,40,3],[40,5,40,6],[41,1,41,6],[42,1,42,6],[11,1,11,6],[12,1,12,6],[14,1,14,3],[14,4,14,7],[14,10,14,11],[15,2,15,5],[16,2,16,3],[17,1,17,7],[27,1,27,3],[27,5,27,6],[15,8,16,9],[0,1,0,3],[0,4,0,7],[0,10,0,11],[1,2,1,5],[2,2,2,3],[3,1,3,7],[9,1,9,3],[9,5,9,6],[10,1,10,6],[1,10,1,11],[47,2,47,3],[48,1,48,7],[57,1,57,3],[57,5,57,6],[58,1,58,6],[59,1,59,6],[60,1,60,6],[62,10,62,11],[63,2,63,5],[62,1,62,3],[62,4,62,7],[104,10,104,11],[105,2,105,5],[104,1,104,3],[104,4,104,7],[95,8,98,8],[64,2,64,3],[65,1,65,7],[72,1,72,3],[72,5,72,6],[73,1,73,6],[74,1,74,6],[75,1,75,6],[77,10,77,11],[78,2,78,5],[77,1,77,3],[77,4,77,7],[79,2,79,3],[80,1,80,7],[85,1,85,3],[85,5,85,6],[86,1,86,6],[87,1,87,6],[88,1,88,6],[204,10,204,11],[106,2,106,3],[107,1,107,7],[121,1,121,3],[121,5,121,6],[187,10,187,11],[122,1,122,6],[123,1,123,6],[124,1,124,6],[170,1,170,3],[170,4,170,7],[170,10,170,11],[171,2,171,5],[172,2,172,3],[173,1,173,7],[182,1,182,3],[182,5,182,6],[183,1,183,6],[184,1,184,6],[185,1,185,6],[187,1,187,3],[187,4,187,7],[188,2,188,5],[190,1,190,7],[224,10,224,11],[225,2,225,5],[226,2,226,3],[227,1,227,7],[385,1,385,6],[383,1,383,6],[384,1,384,6],[221,1,221,6],[222,1,222,6],[232,1,232,3],[232,5,232,6],[233,1,233,6],[234,1,234,6],[237,1,237,3],[237,4,237,7],[238,2,238,5],[239,2,239,3],[240,1,240,7],[375,1,375,3],[376,2,376,5],[377,2,377,3],[378,1,378,7],[382,1,382,3],[382,5,382,6],[0,0,13,0],[14,0,31,0],[32,0,44,0],[45,0,61,0],[62,0,76,0],[77,0,89,0],[104,0,125,0],[170,0,186,0],[187,0,203,0],[90,0,102,0],[126,0,146,0],[148,0,168,0],[375,4,375,7],[250,0,264,0],[250,1,250,3],[250,4,250,7],[251,2,251,5],[252,2,252,3],[253,1,253,7],[261,1,261,3],[261,5,261,6],[375,0,385,0],[266,0,278,0],[266,1,266,3],[266,4,266,7],[267,2,267,5],[268,2,268,3],[269,1,269,7],[275,1,275,3],[275,5,275,6],[276,1,276,6],[277,1,277,6],[278,1,278,6],[280,0,292,0],[280,1,280,3],[280,4,280,7],[400,0,409,0],[411,0,420,0],[411,1,411,3],[411,4,411,7],[412,2,412,5],[413,2,413,3],[414,1,414,7],[417,1,417,3],[417,5,417,6],[387,0,398,0],[387,1,387,3],[387,4,387,7],[388,2,388,5],[389,2,389,3],[390,1,390,7],[395,1,395,3],[395,5,395,6],[396,1,396,6],[397,1,397,6],[398,1,398,6],[422,0,431,0],[422,1,422,3],[422,4,422,7],[423,2,423,5],[424,2,424,3],[425,1,425,7],[428,1,428,3],[428,5,428,6],[429,1,429,6],[430,1,430,6],[431,1,431,6],[161,8,161,10],[426,8,426,11],[262,1,262,6],[263,1,263,6],[264,1,264,6],[418,1,418,6],[419,1,419,6],[420,1,420,6],[400,1,400,3],[400,4,400,7],[401,2,401,5],[402,2,402,3],[403,1,403,7],[406,1,406,3],[406,5,406,6],[407,1,407,6],[408,1,408,6],[409,1,409,6],[165,1,165,3],[165,5,165,6],[166,1,166,6],[167,1,167,6],[235,1,235,6],[209,8,209,9]]}
[1,"CODEVASF",null,null," COMPOSIÇÃO DE PREÇO UNITÁRIO",null,null,null,{"$f":"H11","v":6180.16},{"$f":"H13","v":7562.6617919999999},"BDI CALCULADO:",null,{"$f":"ORÇAMENTO!I6","v":0.22370000000000001}]
[null,"OBRA:  ",{"$f":"ORÇAMENTO!C5","v":" PAVIMENTAÇÃO ASFÁLTICA EM CBUQ - ESTRADA PARA MUQUÉM - TRECHO 2 (EST.145  ATÉ EST.250)"},null,null,null,"DATA: ",{"$f":"ORÇAMENTO!C6","v":"JULHO DE 2023"},null,null,"BDI DIFERENCIADO:",null,{"$f":"'BDI FORN'!D31/100","v":0.15}]
[null,"SERVIÇO:  ",{"$f":"VLOOKUP(A1,ORÇAMENTO!A10:I27,3)","v":"MOBILIZAÇÃO E DESMOBILIZAÇÃO"},null,"Referência:",{"$f":"VLOOKUP(A1,ORÇAMENTO!A10:I27,4)","v":"CPU.1"},"UNIDADE: ",{"$f":"VLOOKUP(A1,ORÇAMENTO!A10:I27,5)","v":"GL"}]
[]
[null,"TIPO ITEM","CODIGO ITEM","DESCRIÇÃO ITEM","UNIDADE ITEM","COEFICIENTE","PRECO UNITARIO","CUSTO TOTAL"]
[null,"COMPOSICAO",89876,"CAMINHÃO BASCULANTE 14 M3, COM CAVALO MECÂNICO DE CAPACIDADE MÁXIMA DE TRAÇÃO COMBINADO DE 36000 KG, POTÊNCIA 286 CV, INCLUSIVE SEMIREBOQUE COM CAÇAMBA METÁLICA","CHP DIURNO.",12,287.48,{"$f":"ROUNDDOWN(F6*G6,2)","v":3449.76}]
[null,"COMPOSICAO",89877,"CAMINHÃO BASCULANTE 14 M3, COM CAVALO MECÂNICO DE CAPACIDADE MÁXIMA DE TRAÇÃO COMBINADO DE 36000 KG, POTÊNCIA 286 CV, INCLUSIVE SEMIREBOQUE COM CAÇAMBA METÁLICA","CHI DIURNO.",6,82.59,{"$f":"ROUNDDOWN(F7*G7,2)","v":495.54}]
[null,"COMPOSICAO",5914640,"TRANSPORTE COM CAVALO MECÂNICO COM SEMIRREBOQUE COM CAPACIDADE DE 30 T - RODOVIA PAVIMENTADA","T.KM",3386,0.59,1997.74]
[null,"COMPOSIÇÃO",88316,"SERVENTE COM ENCARGOS COMPLEMENTARES","H",12,19.760000000000002,237.12]
[null,"PRODUÇÃO DA EQUIPE",null,null,1,"CUSTO ",null,{"$f":"SUM(H6:H9)","v":6180.16}]
[null,"TOTAL",{"$nulls":5},{"$f":"H10/E10","v":6180.16},"OK"]
[null,"BDI                %",{"$nulls":5},{"$f":"1+$M$1","v":1.2237}]
[null,"TOTAL DO SERVIÇO - R$",{"$nulls":5},{"$f":"H11*H12","v":7562.6617919999999}]
[]
[{"$f":"A1+1","v":2},"CODEVASF",null,null," COMPOSIÇÃO DE PREÇO UNITÁRIO",null,null,null,{"$f":"H29","v":94912.320000000007},{"$f":"H31","v":116144.20598400001}]
[null,"OBRA:  ",{"$f":"$C$2","v":" PAVIMENTAÇÃO ASFÁLTICA EM CBUQ - ESTRADA PARA MUQUÉM - TRECHO 2 (EST.145  ATÉ EST.250)"},null,null,null,"DATA: ",{"$f":"$H$2","v":"JULHO DE 2023"}]
[null,"SERVIÇO:  ",{"$f":"VLOOKUP(A15,ORÇAMENTO!$A$10:$I$27,3)","v":"ADMINISTRAÇÃO LOCAL"},null,"SINAPI","CPU","UNIDADE: ",{"$f":"VLOOKUP(A15,ORÇAMENTO!$A$10:$I$27,5)","v":"GL"}]
[]
[null,"TIPO ITEM","CODIGO ITEM","DESCRIÇÃO ITEM","UNIDADE ITEM","COEFICIENTE","PRECO UNITARIO","CUSTO TOTAL"]
[null,"INSUMO",14250,"ENERGIA ELÉTRICA","kwh",80,0.86,{"$f":"ROUNDDOWN(F20*G20,2)","v":68.8}]
[null,"INSUMO",44480,"TARIFA ÁGUA/ESGOTO ","m³",6,16.27,97.62]
[null,"COTAÇÃO","MERC.","TELEFONE (PLANO CONTROLE)","UNID",2,60,120]
[null,"COMPOSICAO",90777,"Engenheiro Civil Júnior com encargos complementares","H",40,114.12,4564.8]
[null,"COMPOSICAO",90776,"Encarregado Geral com encargos complementares","H",110,57.73,6350.3]
[null,"COMPOSICAO",88321,"Tecnico de Laboratório com encargos complementares","H",40,45.67,1826.8]
[null,"COMPOSICAO",100309,"Tecnico de Segurança do Trabalho com encargos complementares","H",40,45.93,{"$f":"ROUNDDOWN(F26*G26,2)","v":1837.2}]
[null,"COMPOSICAO",90772,"Auxiliar de escritório com encargos complementares","H",40,23.83,953.2]
[null,"PRODUÇÃO DA EQUIPE",null,null,{"$f":"1/6","v":0.16666666666666666},"CUSTO ",null,{"$f":"SUM(H20:H27)","v":15818.720000000001}]
[null,"TOTAL",{"$nulls":5},{"$f":"H28/E28","v":94912.320000000007},"OK"]
[null,"BDI                %",{"$nulls":5},{"$f":"1+$M$1","v":1.2237}]
[null,"TOTAL DO SERVIÇO - R$",{"$nulls":5},{"$f":"H29*H30","v":116144.20598400001}]
[]
[{"$f":"A15+1","v":3},"CODEVASF",null,null," COMPOSIÇÃO DE PREÇO UNITÁRIO",null,null,null,{"$f":"H42","v":6849},{"$f":"H44","v":8381.1213000000007}]
[null,"OBRA:  ",{"$f":"$C$2","v":" PAVIMENTAÇÃO ASFÁLTICA EM CBUQ - ESTRADA PARA MUQUÉM - TRECHO 2 (EST.145  ATÉ EST.250)"},null,null,null,"DATA: ",{"$f":"$H$2","v":"JULHO DE 2023"}]
[null,"SERVIÇO:  ",{"$f":"VLOOKUP(A33,ORÇAMENTO!$A$10:$I$27,3)","v":"CANTEIRO DE OBRAS"},null,"SINAPI",{"$f":"VLOOKUP(A33,ORÇAMENTO!$A$10:$I$27,4)","v":"CPU.3"},"UNIDADE: ",{"$f":"VLOOKUP(A33,ORÇAMENTO!$A$10:$I$27,5)","v":"GL"}]
[]
[null,"TIPO ITEM","CODIGO ITEM","DESCRIÇÃO ITEM","UNIDADE ITEM","COEFICIENTE","PRECO UNITARIO","CUSTO TOTAL"]
[null,"INSUMO",10775,"ALUGUEL DE IMÓVEL OU CONTEINER QUE ATENDA AOS REQUISITOS MÍNIMOS PARA INSTALAÇÃO DO CANTEIRO DE OBRAS","MÊS",6,1040,{"$f":"ROUNDDOWN(F38*G38,2)","v":6240}]
[null,"INSUMO","37525","TELA PLASTICA TECIDA LISTRADA BRANCA E LARANJA, TIPO GUARDA CORPO, EM POLIETILENO MONOFILADO, ROLO 1,20 X 50 M (L X C)","M",100,3.69,{"$f":"ROUNDDOWN(F39*G39,2)","v":369}]
[null,"COMPOSICAO"," - ","PLACA DE SINALIZAÇÃO - \"PERIGO - OBRAS A FRENTE\" - FORNECIMENTO E MOVIMENTAÇÃO","UNID.",12,20,240]
{"$rows_left_out":395}
{"sheet":"BDI SERV","index":2,"n_rows":37,"n_cols":5,"rows_kept":37,"cut":false,"hidden":false,"merged":[[36,0,36,5],[3,1,4,1],[3,2,4,2],[0,1,2,4],[32,0,34,5],[28,0,28,5],[30,1,30,2],[31,1,31,2]]}
[null,"DETALHAMENTO DO BDI - SERVIÇOS"]
[]
[]
[null,"Item","Descrição dos Serviços","%","%"]
[null,null,null,"PV","CD"]
[]
[null,1,"ADMINISTRAÇÃO CENTRAL"," ",4.01]
[null,"1.1","ESCRITÓRIO CENTRAL"," "," "]
[null,"1.2","VIAGENS"," "," "]
[null,"1.3","OUTROS"," "," "]
[null," "," "," "," "]
[null,2,"IMPOSTOS E TAXAS",{"$f":"SUM(D13:D16)","v":6.15},{"$f":"SUM(E13:E16)","v":7.6899999999999995}]
[null,"2.1","ISS (*)",2.5,{"$f":"ROUND(D13*1.2515,2)","v":3.13}]
[null,"2.2","PIS",0.65,0.81]
[null,"2.3","Cofins",3,3.75]
[null,"2.4","CONTRIBUIÇÃO PREVIDENCIÁRIA SOBRE A RENDA BRUTA",0,0]
[]
[null,3,"TAXA DE RISCO"," ",{"$f":"SUM(E19:E22)","v":1.1600000000000001}]
[null,"3.1","SEGURO",null,0.2]
[null,"3.2","RISCO",null,0.56000000000000005]
[null,"3.3","GARANTIA",null,0.4]
[]
[null,4,"DESPESAS FINANCEIRAS"," ",1.1100000000000001]
[]
[null,5,"LUCRO",null,8]
[]
[null," ","BDI - CALCULADO"," ",{"$f":"ROUND((((1+(E7+E18)/100)*(1+E23/100)*(1+E25/100)/(1-D12/100)-1)*100),2)","v":22.37}]
[]
["BDI = ((1+((AC+S+R+G)/100))x(1+DF/100)x(1+L/100)/(1-I/100)-1)*100"]
[]
[null,"BDI (CALCULADO):",null,{"$f":"ROUND((((1+((E7+E18)/100))*(1+E23/100)*(1+E25/100))/(1-D12/100)-1)*100,2)","v":22.37},"%"]
[null," "]
["(*) ISS CONFORME LEI MUNICIPAL Nº 1241 / 2017 - DECLARAÇÃO EM ANEXO, \nAPLICANDO-SE A DEDUÇÃO PREVISTA NO §12 DO ART. 120 REFERENTE AOS MATERIAIS \n(50% SEM NECESSIDADE DE COMPROVAÇÃO)"]
[]
[]
[]
["BDI EM CONFORMIDADE COM OS ACÓRDÃOS Nº 2369/2011 e ACÓRDÃO Nº 2.622/2013 - TCU - PLENÁRIO"]

{"sheet":"BDI FORN","index":3,"n_rows":37,"n_cols":5,"rows_kept":37,"cut":false,"hidden":false,"merged":[[32,0,34,5],[36,0,36,5],[0,1,2,4],[3,1,4,1],[3,2,4,2],[28,0,28,5],[30,1,30,2],[31,1,31,2]]}
[null,"DETALHAMENTO DO BDI - FORNECIMENTO \n(MATERIAL ASFÁLTICO)"]
[]
[]
[null,"Item","Descrição dos Serviços","%","%"]
[null,null,null,"PV","CD"]
[]
[null,1,"ADMINISTRAÇÃO CENTRAL"," ",3.72]
[null,"1.1","ESCRITÓRIO CENTRAL"," "," "]
[null,"1.2","VIAGENS"," "," "]
[null,"1.3","OUTROS"," "," "]
[null," "," "," "," "]
[null,2,"IMPOSTOS E TAXAS",{"$f":"SUM(D13:D16)","v":3.65},{"$f":"SUM(E13:E16)","v":4.5600000000000005}]
[null,"2.1","ISS (*)",null,{"$f":"ROUND(D13*1.2515,2)","v":0}]
[null,"2.2","PIS",0.65,0.81]
[null,"2.3","Cofins",3,3.75]
[null,"2.4","CONTRIBUIÇÃO PREVIDENCIÁRIA SOBRE A RENDA BRUTA",0,0]
[]
[null,3,"TAXA DE RISCO"," ",{"$f":"SUM(E19:E22)","v":0.82000000000000006}]
[null,"3.1","SEGURO",null,0.16]
[null,"3.2","RISCO",null,0.5]
[null,"3.3","GARANTIA",null,0.16]
[]
[null,4,"DESPESAS FINANCEIRAS"," ",0.94]
[]
[null,5,"LUCRO",null,5]
[]
[null," ","BDI - CALCULADO"," ",{"$f":"ROUND((((1+(E7+E18)/100)*(1+E23/100)*(1+E25/100)/(1-D12/100)-1)*100),2)","v":15}]
[]
["BDI = ((1+((AC+S+R+G)/100))x(1+DF/100)x(1+L/100)/(1-I/100)-1)*100"]
[]
[null,"BDI (CALCULADO):",null,{"$f":"ROUND((((1+((E7+E18)/100))*(1+E23/100)*(1+E25/100))/(1-D12/100)-1)*100,2)","v":15},"%"]
[null," "]
[]
[]
[]
[]
["BDI EM CONFORMIDADE COM OS ACÓRDÃOS Nº 2369/2011 e ACÓRDÃO Nº 2.622/2013 - TCU - PLENÁRIO"]

{"sheet":"CRONOGRAMA","index":4,"n_rows":21,"n_cols":12,"rows_kept":21,"cut":false,"hidden":false,"merged":[[7,0,8,0],[9,0,10,0],[11,0,12,0],[0,1,0,11],[1,6,1,11],[2,6,2,11],[3,1,3,6],[5,0,6,0],[5,2,6,2],[1,1,2,1],[5,1,6,1],[1,2,2,4],[7,2,8,2],[9,2,10,2],[11,2,12,2],[7,1,8,1],[17,1,18,2],[20,1,24,11],[9,1,10,1],[11,1,12,1],[15,0,16,0],[15,1,16,1],[15,2,16,2],[13,1,14,1],[13,2,14,2],[13,0,14,0]]}
[null,"CRONOGRAMA FÍSICO-FINANCEIRO"]
[null,"OBRA: ",{"$f":"ORÇAMENTO!C5","v":" PAVIMENTAÇÃO ASFÁLTICA EM CBUQ - ESTRADA PARA MUQUÉM - TRECHO 2 (EST.145  ATÉ EST.250)"},null,null,"VALOR:",{"$f":"ORÇAMENTO!I43","v":1719073.54}]
[{"$nulls":5},"PRAZO: ","180 DIAS "]
[]
[null,"ITEM","ETAPAS/DESCRIÇAO","FISICO/  FINANCEIRO","TOTAL    ETAPAS","MÊS 1","MÊS 2","MÊS 3","MÊS 4","MÊS 5","MÊS 6","TOTAL"]
["A",{"$f":"VLOOKUP(A6,ORÇAMENTO!$A$9:$I$43,2)","v":1},{"$f":"VLOOKUP(A6,ORÇAMENTO!$A$9:$I$43,3)","v":"SERVIÇOS PRELIMINARES "},"FISICO ",{"$f":"ROUND(E7/$G$2,4)","v":8.1299999999999997E-2},0.15,0.2,0.2,0.2,0.15,0.1,{"$f":"SUM(F6:K6)","v":1}]
[null,null,null,"FINANCEIRO",{"$f":"ORÇAMENTO!I9","v":139724.03000000003},{"$f":"ROUND($E$7*F6,2)","v":20958.599999999999},27944.81,27944.81,{"$f":"ROUND($E$7*I6,2)","v":27944.81},20958.599999999999,13972.4,139724.03]
["B",{"$f":"VLOOKUP(A8,ORÇAMENTO!$A$9:$I$43,2)","v":2},{"$f":"VLOOKUP(A8,ORÇAMENTO!$A$9:$I$43,3)","v":"TERRAPLANAGEM E PAVIMENTAÇÃO"},"FISICO ",{"$f":"ROUND(E9/$G$2,4)","v":0.28210000000000002},0.1,0.25,0.25,0.25,0.15,null,1]
[null,null,null,"FINANCEIRO",{"$f":"ORÇAMENTO!I15","v":484879.59},{"$f":"ROUND($E$9*F8,2)","v":48487.96},121219.9,121219.9,{"$f":"ROUND($E$9*I8,2)","v":121219.9},72731.94,0,484879.60000000003]
["C",{"$f":"VLOOKUP(A10,ORÇAMENTO!$A$9:$I$43,2)","v":3},{"$f":"VLOOKUP(A10,ORÇAMENTO!$A$9:$I$43,3)","v":"TRANSPORTE DE MATERIAIS"},"FISICO ",{"$f":"ROUND(E11/$G$2,4)","v":2.5700000000000001E-2},null,0.25,0.25,0.25,0.25,null,1]
[null,null,null,"FINANCEIRO",{"$f":"ORÇAMENTO!I24","v":44116.15},{"$f":"ROUND($E$11*F10,2)","v":0},{"$f":"ROUND($E$11*G10,2)","v":11029.04},11029.04,{"$f":"ROUND($E$11*I10,2)","v":11029.04},11029.04,0,44116.160000000003]
["E",{"$f":"VLOOKUP(A12,ORÇAMENTO!$A$9:$I$43,2)","v":4},{"$f":"VLOOKUP(A12,ORÇAMENTO!$A$9:$I$43,3)","v":"OBRAS COMPLEMENTARES E SINALIZAÇÃO"},"FISICO ",{"$f":"ROUND(E13/$G$2,4)","v":4.7600000000000003E-2},null,null,0.25,0.25,0.25,0.25,1]
[null,null,null,"FINANCEIRO",{"$f":"ORÇAMENTO!I27","v":81769.89},{"$f":"ROUND($E$13*F12,2)","v":0},0,20442.47,{"$f":"ROUND($E$13*I12,2)","v":20442.47},20442.47,20442.47,81769.88]
["F",{"$f":"VLOOKUP(A14,ORÇAMENTO!$A$9:$I$43,2)","v":4},{"$f":"VLOOKUP(A14,ORÇAMENTO!$A$9:$I$43,3)","v":"OBRAS COMPLEMENTARES E SINALIZAÇÃO"},"FISICO ",{"$f":"ROUND(E15/$G$2,4)","v":2.9600000000000001E-2},null,0.25,0.25,0.25,0.25,null,1]
[null,null,null,"FINANCEIRO",{"$f":"ORÇAMENTO!I36","v":50822.29},{"$f":"ROUND($E$13*F14,2)","v":0},{"$f":"ROUND($E$15*G14,2)","v":12705.57},{"$f":"ROUND($E$15*H14,2)","v":12705.57},{"$f":"ROUND($E$15*I14,2)","v":12705.57},{"$f":"ROUND($E$15*J14,2)","v":12705.57},0,50822.28]
["G",{"$f":"VLOOKUP(A16,ORÇAMENTO!$A$9:$I$43,2)","v":6},{"$f":"VLOOKUP(A16,ORÇAMENTO!$A$9:$I$43,3)","v":"FORNECIMENTOS - MATERIAL ASFÁLTICO (BDI DIFERENCIADO)"},"FISICO ",{"$f":"ROUND(E17/$G$2,4)","v":0.53390000000000004},null,0.25,0.25,0.25,0.25,null,1]
[null,null,null,"FINANCEIRO",{"$f":"ORÇAMENTO!I39","v":917761.59},{"$f":"ROUND($E$13*F16,2)","v":0},{"$f":"ROUND($E$17*G16,2)","v":229440.4},{"$f":"ROUND($E$17*H16,2)","v":229440.4},{"$f":"ROUND($E$17*I16,2)","v":229440.4},229440.4,0,917761.6]
[null,"TOTAL",null,"FISICO ",{"$f":"SUM(F18:K18)","v":1.0000000058170868},{"$f":"F19/E19","v":4.039766675717666E-2},{"$f":"G19/E19","v":0.23404450748511901},{"$f":"H19/E19","v":0.24593606972741841},{"$f":"I19/E19","v":0.24593606972741841},{"$f":"J19/E19","v":0.21366626351540494},{"$f":"K19/E19","v":2.0019428604549402E-2},1.0000000058170868]
[null,null,null,"FINANCEIRO",{"$f":"E11+E9+E7+E13+E17+E15","v":1719073.54},69446.559999999998,402339.72000000003,422782.19,422782.19,367308.02,34414.870000000003,{"$f":"SUM(F19:K19)-0.02","v":1719073.53}]
[]
[null,"OBSERVAÇÕES:"]