{"text_format":"2","workbook":"xlsx","n_sheets":5,"sheets":["ORÇAMENTO","CPU","BDI SERV","BDI FORN","CRONOGRAMA"],"not_rendered":{"charts":0,"images":3,"macros":0,"external_links":0,"defined_names":5,"comments":1,"pivot_tables":0},"unopened":[],"bounds":{"document_bytes":16777216,"sheet_cells":100000,"run_cost":"one","rows_first":2000,"rows_last":500,"rows_between":2000,"halvings":0,"cell_chars":16384,"cell_head_chars":4096},"cells_cut":0,"cells_raw":0,"read":"whole","date_system":"1900"}

{"sheet":"ORÇAMENTO","index":0,"n_rows":37,"n_cols":9,"rows_kept":37,"cut":false,"hidden":false,"merged":[[6,1,6,2],[6,6,6,7],[36,1,36,2],[0,0,7,0],[0,2,0,8],[1,2,1,8],[2,2,2,8],[4,2,4,8],[5,6,5,7]]}
["<---- NUMERAR SERVIÇOS PARA CPU",null,"Ministério do Desenvolvimento Regional"]
[null,null,"Companhia de Desenvolvimento dos Vales do São Francisco e do Parnaíba"]
[null,null,"1ª Superintendência Regional"]
[]
[null,"OBRA: "," PAVIMENTAÇÃO ASFÁLTICA EM CBUQ - AV. PAREDÃO DE MINAS (BURITIZEIRO / MG)"]
[null,"DATA:"," AGOSTO / 2023   ",null,null,null,"BDI Serviços:",null,{"$f":"'BDI SERV'!D31/100","v":0.21350000000000002}]
[null,"PRAZO DE EXECUÇÃO:     180 DIAS",{"$nulls":4},"BDI Serviços:",null,{"$f":"'BDI FORN'!D31/100","v":0.15}]
[null,"ITEM","DISCRIMINAÇÃO","REFER.","UNID.","QUANT.","P. UNITÁRIO","P.UNIT.C/ BDI","P. TOTAL"]
["A",1,"SERVIÇOS PRELIMINARES ",{"$nulls":5},{"$f":"SUM(I10:I14)","v":216753.99}]
[1,"1.1","MOBILIZAÇÃO E DESMOBILIZAÇÃO","CPU.1","GL",1,{"$f":"VLOOKUP(A10,CPU!$A$1:$N$4667,9)","v":17031.18},{"$f":"VLOOKUP(A10,CPU!$A$1:$N$4667,10)","v":20667.34},{"$f":"ROUND(F10*H10,2)","v":20667.34}]
[2,"1.2","ADMINISTRAÇÃO LOCAL","CPU.2","GL",1,{"$f":"VLOOKUP(A11,CPU!$A$1:$N$4667,9)","v":140379.6},{"$f":"VLOOKUP(A11,CPU!$A$1:$N$4667,10)","v":170350.64},{"$f":"ROUND(F11*H11,2)","v":170350.64}]
[3,"1.3","CANTEIRO DE OBRAS","CPU.3","GL",1,{"$f":"VLOOKUP(A12,CPU!$A$1:$N$4667,9)","v":18107.399999999998},{"$f":"VLOOKUP(A12,CPU!$A$1:$N$4667,10)","v":21973.33},{"$f":"ROUND(F12*H12,2)","v":21973.33}]
[4,"1.4","PLACA DE OBRA EM CHAPA DE AÇO GALVANIZADO",103689,"M2",6,{"$f":"VLOOKUP(A13,CPU!$A$1:$N$4667,9)","v":340.97999999999996},{"$f":"VLOOKUP(A13,CPU!$A$1:$N$4667,10)","v":413.78},{"$f":"ROUND(F13*H13,2)","v":2482.6799999999998}]
[5,"1.5","LOCAÇÃO DE PAVIMENTAÇÃO",99064,"M",1600,{"$f":"VLOOKUP(A14,CPU!$A$1:$N$4667,9)","v":0.66},{"$f":"VLOOKUP(A14,CPU!$A$1:$N$4667,10)","v":0.8},{"$f":"ROUND(F14*H14,2)","v":1280}]
["B",2,"TERRAPLANAGEM E PAVIMENTAÇÃO",{"$nulls":5},{"$f":"SUM(I16:I22)","v":266397.2}]
[6,"2.1","ESCAVAÇÃO HORIZONTAL EM SOLO DE 1A CATEGORIA ",101116,"M3",6700.0000000000009,{"$f":"VLOOKUP(A16,CPU!$A$1:$N$4667,9)","v":1.87},{"$f":"VLOOKUP(A16,CPU!$A$1:$N$4667,10)","v":2.27},{"$f":"ROUND(F16*H16,2)","v":15209}]
[7,"2.2","CARGA, MANOBRA E DESCARGA DE SOLOS E MATERIAIS GRANULARES EM CAMINHÃO BASCULANTE",100976,"M3",6700.0000000000009,{"$f":"VLOOKUP(A17,CPU!$A$1:$N$4667,9)","v":6.49},{"$f":"VLOOKUP(A17,CPU!$A$1:$N$4667,10)","v":7.88},{"$f":"ROUND(F17*H17,2)","v":52796}]
[8,"2.3","REGULARIZAÇÃO E COMPACTAÇÃO DO SUBLEITO ",100577,"M2",16699.999999999996,{"$f":"VLOOKUP(A18,CPU!$A$1:$N$4667,9)","v":1.08},{"$f":"VLOOKUP(A18,CPU!$A$1:$N$4667,10)","v":1.31},21877]
[9,"2.4","EXECUÇÃO E COMPACTAÇÃO DE BASE E OU SUB BASE PARA PAVIMENTAÇÃO DE SOLOS DE COMPORTAMENTO LATERÍTICO - EXCLUSIVE SOLO, ESCAVAÇÃO, CARGA E TRANSPORTE (CASCALHO FORNECIDO PELA PREFEITURA)",96388,"M3",3350,{"$f":"VLOOKUP(A19,CPU!$A$1:$N$4667,9)","v":11.09},{"$f":"VLOOKUP(A19,CPU!$A$1:$N$4667,10)","v":13.46},45091]
[10,"2.5","IMPRIMAÇÃO COM EMULSÃO ASFÁLTICA (EAI)",96401,"M2",16699.999999999996,{"$f":"VLOOKUP(A20,CPU!$A$1:$N$4667,9)","v":1.1100000000000001},{"$f":"VLOOKUP(A20,CPU!$A$1:$N$4667,10)","v":1.35},22545]
[11,"2.6","PINTURA DE LIGAÇÃO COM EMULSÃO ASFÁLTICA RR-2C",96402,"M2",15100,{"$f":"VLOOKUP(A21,CPU!$A$1:$N$4667,9)","v":0.91000000000000014},{"$f":"VLOOKUP(A21,CPU!$A$1:$N$4667,10)","v":1.1000000000000001},16610]
[12,"2.7","EXECUÇÃO DE PAVIMENTO COM APLICAÇÃO DE CONCRETO ASFÁLTICO USINADO A QUENTE (CBUQ), CAMADA DE ROLAMENTO - EXCLUSIVE TRANSPORTE",95995,"M3",679.99999999999989,{"$f":"VLOOKUP(A22,CPU!$A$1:$N$4667,9)","v":111.82000000000001},{"$f":"VLOOKUP(A22,CPU!$A$1:$N$4667,10)","v":135.69},92269.2]
["C",3,"TRANSPORTE DE MATERIAIS",{"$nulls":5},{"$f":"SUM(I24:I27)","v":389504.02}]
[13,"3.1","TRANSPORTE COM CAMINHÃO BASCULANTE, EM VIA URBANA PAVIMENTADA",95877,"M3XKM",150000.00325000001,{"$f":"VLOOKUP(A24,CPU!$A$1:$N$4667,9)","v":1.6199999999999999},{"$f":"VLOOKUP(A24,CPU!$A$1:$N$4667,10)","v":1.97},{"$f":"ROUND(F24*H24,2)","v":295500.01}]
[13.5,"3.2","TRANSPORTE COM CAMINHÃO BASCULANTE, EM VIA URBANA PAVIMENTADA - ADICIONAL PARA DMT EXCEDENTE A 30KM",95427,"M3XKM",109000,{"$f":"VLOOKUP(A25,CPU!$A$1:$N$4667,9)","v":0.65999999999999992},{"$f":"VLOOKUP(A25,CPU!$A$1:$N$4667,10)","v":0.8},{"$f":"ROUND(F25*H25,2)","v":87200}]
[14,"3.3","TRANSPORTE COM CAMINHÃO CARROCERIA 9T, EM VIA URBANA PAVIMENTADA",100947,"TXKM",600.00388080000016,{"$f":"VLOOKUP(A26,CPU!$A$1:$N$4667,9)","v":1.93},{"$f":"VLOOKUP(A26,CPU!$A$1:$N$4667,10)","v":2.34},{"$f":"ROUND(F26*H26,2)","v":1404.01}]
[15,"3.4","TRANSPORTE COM CAMINHÃO TANQUE DE TRANSPORTE DE MATERIAL ASFÁLTICO DE 30000 L, EM VIA URBANA PAVIMENTADA (BDI DIFERENCIADO)",102331,"TXKM",10000,{"$f":"VLOOKUP(A27,CPU!$A$1:$N$4667,9)","v":0.47},{"$f":"VLOOKUP(A27,CPU!$A$1:$N$4667,10)","v":0.54},{"$f":"ROUND(F27*H27,2)","v":5400}]
["D",4,"OBRAS COMPLEMENTARES",{"$nulls":5},{"$f":"SUM(I29:I32)","v":328128.55}]
[16,"4.1","GUIA (MEIO-FIO) E SARJETA CONJUGADOS DE CONCRETO, MOLDADA IN LOCO COM EXTRUSORA, 45 CM BASE (15 CM BASE DA GUIA + 30 CM BASE DA SARJETA) X 22 CM ALTURA",94267,"M",2900.0000000000005,{"$f":"VLOOKUP(A29,CPU!$A$1:$N$4667,9)","v":57.379999999999988},{"$f":"VLOOKUP(A29,CPU!$A$1:$N$4667,10)","v":69.63},{"$f":"ROUND(F29*H29,2)","v":201927}]
[17,"4.2","FORNECIMENTO E INSTALAÇÃO DE PLACA DE SINALIZAÇÃO VIÁRIA - REGULAMENTAÇÃO OCTOGONAL (PARE) 0,60MX0,60M","CPU.4","UN.",28,{"$f":"VLOOKUP(A30,CPU!$A$1:$N$4667,9)","v":444.46000000000004},{"$f":"VLOOKUP(A30,CPU!$A$1:$N$4667,10)","v":539.35},{"$f":"ROUND(F30*H30,2)","v":15101.8}]
[18,"4.3","FORNECIMENTO E INSTALAÇÃO DE PLACA DE IDENTIFICACAO DE RUA EM CHAPA DE AÇO PINTADA COM PELÍCULA DE ALTA INTENSIDADE, 45 CM X 20 CM - INCLUSIVE SUPORTE DE MADEIRA, CONFORME PROJETO (02 PLACAS POR SUPORTE)                                  ","CPU.5","UN.",25,{"$f":"VLOOKUP(A31,CPU!$A$1:$N$4667,9)","v":234.21999999999997},{"$f":"VLOOKUP(A31,CPU!$A$1:$N$4667,10)","v":284.23},{"$f":"ROUND(F31*H31,2)","v":7105.75}]
[19,"4.4","PINTURA DE FAIXA COM TINTA ACRÍLICA - ESPESSURA DE 0,10 MM",5213401,"M2",2200,{"$f":"VLOOKUP(A32,CPU!$A$1:$N$4667,9)","v":38.950000000000003},{"$f":"VLOOKUP(A32,CPU!$A$1:$N$4667,10)","v":47.27},{"$f":"ROUND(F32*H32,2)","v":103994}]
["E",5,"FORNECIMENTOS - MATERIAL ASFÁLTICO (BDI DIFERENCIADO)",{"$nulls":5},{"$f":"SUM(I34:I36)","v":1293822.57}]
[20,"5.1","AQUISIÇÃO DE EMULSÃO ASFÁLTICA PARA IMPRIMAÇÃO (EAI) - EXCLUSIVE TRANSPORTE","CPU.6","T",23.994999999999997,{"$f":"VLOOKUP(A34,CPU!$A$1:$N$4667,9)","v":2272.33},{"$f":"VLOOKUP(A34,CPU!$A$1:$N$4667,10)","v":2613.1799999999998},{"$f":"ROUND(F34*H34,2)","v":62703.25}]
[21,"5.2","AQUISIÇÃO DE EMULSAO ASFALTICA CATIONICA RR-2C - EXCLUSIVE TRANSPORTE","CPU.7","T",7.4950000000000001,{"$f":"VLOOKUP(A35,CPU!$A$1:$N$4667,9)","v":3322.69},{"$f":"VLOOKUP(A35,CPU!$A$1:$N$4667,10)","v":3821.09},{"$f":"ROUND(F35*H35,2)","v":28639.07}]
[22,"5.3","AQUISIÇÃO DE CONCRETO BETUMINOSO USINADO A QUENTE (CBUQ) PARA PAVIMENTACAO ASFALTICA, PADRAO DNIT, FAIXA C, COM CAP 50/70 - EXCLUSIVE TRANSPORTE","CPU.8","T",1750.0039999999999,{"$f":"VLOOKUP(A36,CPU!$A$1:$N$4667,9)","v":597.5},{"$f":"VLOOKUP(A36,CPU!$A$1:$N$4667,10)","v":687.13},1202480.25]
[null,"TOTAL GERAL DA OBRA COM BDI ",{"$nulls":6},{"$f":"SUM(I9,I15,I23,I28,I33)","v":2494606.33}]

{"sheet":"CPU","index":1,"n_rows":364,"n_cols":13,"rows_kept":364,"cut":false,"hidden":false,"merged":[[218,0,229,0],[218,1,218,3],[218,4,218,7],[218,10,218,11],[219,2,219,5],[220,2,220,3],[221,1,221,7],[226,1,226,3],[226,5,226,6],[227,1,227,6],[228,1,228,6],[229,1,229,6],[341,0,351,0],[353,0,363,0],[15,8,16,9],[34,8,35,9],[275,0,291,0],[275,1,275,3],[275,4,275,7],[276,2,276,5],[277,2,277,3],[278,1,278,7],[288,1,288,3],[288,5,288,6],[289,1,289,6],[290,1,290,6],[291,1,291,6],[361,1,361,6],[362,1,362,6],[363,1,363,6],[145,0,163,0],[164,0,182,0],[183,0,204,0],[205,0,216,0],[231,0,242,0],[244,0,255,0],[0,0,13,0],[14,0,32,0],[33,0,48,0],[49,0,66,0],[67,0,78,0],[79,0,91,0],[92,0,104,0],[106,0,123,0],[124,0,143,0],[256,0,273,0],[293,0,309,0],[311,0,327,0],[329,0,339,0],[349,1,349,6],[350,1,350,6],[351,1,351,6],[325,1,325,6],[326,1,326,6],[327,1,327,6],[329,1,329,3],[329,4,329,7],[330,2,330,5],[331,2,331,3],[332,1,332,7],[336,1,336,3],[336,5,336,6],[307,1,307,6],[308,1,308,6],[309,1,309,6],[311,1,311,3],[311,4,311,7],[312,2,312,5],[313,2,313,3],[353,1,353,3],[353,4,353,7],[354,2,354,5],[355,2,355,3],[356,1,356,7],[360,1,360,3],[360,5,360,6],[337,1,337,6],[338,1,338,6],[339,1,339,6],[341,1,341,3],[341,4,341,7],[342,2,342,5],[343,2,343,3],[344,1,344,7],[348,1,348,3],[348,5,348,6],[314,1,314,7],[324,1,324,3],[324,5,324,6],[293,1,293,3],[293,4,293,7],[294,2,294,5],[295,2,295,3],[296,1,296,7],[306,1,306,3],[306,5,306,6],[256,10,256,11],[257,2,257,5],[258,2,258,3],[259,1,259,7],[270,1,270,3],[270,5,270,6],[271,1,271,6],[272,1,272,6],[273,1,273,6],[245,2,245,5],[246,2,246,3],[247,1,247,7],[251,1,251,3],[251,5,251,6],[252,1,252,6],[253,1,253,6],[254,1,254,6],[256,1,256,3],[256,4,256,7],[234,1,234,7],[239,1,239,3],[239,5,239,6],[240,1,240,6],[241,1,241,6],[242,1,242,6],[244,1,244,3],[244,4,244,7],[244,10,244,11],[213,1,213,3],[213,5,213,6],[214,1,214,6],[215,1,215,6],[216,1,216,6],[231,1,231,3],[231,4,231,7],[232,2,232,5],[233,2,233,3],[201,1,201,6],[202,1,202,6],[203,1,203,6],[205,1,205,3],[205,4,205,7],[205,10,205,11],[206,2,206,5],[207,2,207,3],[208,1,208,7],[183,1,183,3],[183,4,183,7],[183,10,183,11],[184,2,184,5],[185,2,185,3],[186,1,186,7],[188,8,188,9],[200,1,200,3],[200,5,200,6],[164,10,164,11],[165,2,165,5],[166,2,166,3],[167,1,167,7],[178,1,178,3],[178,5,178,6],[179,1,179,6],[180,1,180,6],[181,1,181,6],[146,2,146,5],[147,2,147,3],[148,1,148,7],[159,1,159,3],[159,5,159,6],[160,1,160,6],[161,1,161,6],[162,1,162,6],[164,1,164,3],[164,4,164,7],[127,1,127,7],[140,1,140,3],[140,5,140,6],[141,1,141,6],[142,1,142,6],[143,1,143,6],[145,1,145,3],[145,4,145,7],[145,10,145,11],[119,1,119,3],[119,5,119,6],[120,1,120,6],[121,1,121,6],[122,1,122,6],[124,1,124,3],[124,4,124,7],[125,2,125,5],[126,2,126,3],[102,1,102,6],[103,1,103,6],[104,1,104,6],[106,1,106,3],[106,4,106,7],[106,10,106,11],[107,2,107,5],[108,2,108,3],[109,1,109,7],[88,1,88,6],[89,1,89,6],[90,1,90,6],[92,1,92,3],[92,4,92,7],[93,2,93,5],[94,2,94,3],[95,1,95,7],[101,1,101,3],[101,5,101,6],[76,1,76,6],[77,1,77,6],[79,1,79,3],[79,4,79,7],[79,10,79,11],[80,2,80,5],[81,2,81,3],[82,1,82,7],[87,1,87,3],[87,5,87,6],[67,1,67,3],[67,4,67,7],[67,10,67,11],[68,2,68,5],[69,2,69,3],[70,1,70,7],[74,1,74,3],[74,5,74,6],[75,1,75,6],[49,10,49,11],[50,2,50,5],[51,2,51,3],[52,1,52,7],[62,1,62,3],[62,5,62,6],[63,1,63,6],[64,1,64,6],[65,1,65,6],[35,2,35,3],[36,1,36,7],[44,1,44,3],[44,5,44,6],[45,1,45,6],[46,1,46,6],[47,1,47,6],[49,1,49,3],[49,4,49,7],[28,1,28,3],[28,5,28,6],[29,1,29,6],[30,1,30,6],[31,1,31,6],[33,1,33,3],[33,4,33,7],[33,10,33,11],[34,2,34,5],[10,1,10,6],[11,1,11,6],[12,1,12,6],[14,1,14,3],[14,4,14,7],[14,10,14,11],[15,2,15,5],[16,2,16,3],[17,1,17,7],[0,1,0,3],[0,4,0,7],[0,10,0,11],[1,2,1,5],[1,10,1,11],[2,2,2,3],[3,1,3,7],[9,1,9,3],[9,5,9,6]]}
[1,"CODEVASF",null,null," COMPOSIÇÃO DE PREÇO UNITÁRIO",null,null,null,{"$f":"H11","v":17031.18},{"$f":"H13","v":20667.34},"BDI CALCULADO:",null,{"$f":"ORÇAMENTO!I6","v":0.21350000000000002}]
[null,"OBRA:  ",{"$f":"ORÇAMENTO!C5","v":" PAVIMENTAÇÃO ASFÁLTICA EM CBUQ - AV. PAREDÃO DE MINAS (BURITIZEIRO / MG)"},null,null,null,"DATA: ",{"$f":"ORÇAMENTO!C6","v":" AGOSTO / 2023   "},null,null,"BDI DIFERENCIADO:",null,{"$f":"'BDI FORN'!D31/100","v":0.15}]
[null,"SERVIÇO:  ",{"$f":"VLOOKUP(A1,ORÇAMENTO!A10:I29,3)","v":"MOBILIZAÇÃO E DESMOBILIZAÇÃO"},null,"Referência:","CPU.1","UNIDADE: ",{"$f":"VLOOKUP(A1,ORÇAMENTO!A10:I29,5)","v":"GL"}]
[]
[null,"TIPO ITEM","CODIGO ITEM","DESCRIÇÃO ITEM","UNIDADE ITEM","COEFICIENTE","PRECO UNITARIO","CUSTO TOTAL"]
[null,"COMPOSICAO",89876,"CAMINHÃO BASCULANTE 14 M3, COM CAVALO MECÂNICO DE CAPACIDADE MÁXIMA DE TRAÇÃO COMBINADO DE 36000 KG, POTÊNCIA 286 CV, INCLUSIVE SEMIREBOQUE COM CAÇAMBA METÁLICA ","CHP DIURNO.",8,287.48,{"$f":"ROUNDDOWN(F6*G6,2)","v":2299.84}]
[null,"COMPOSICAO",89877,"CAMINHÃO BASCULANTE 14 M3, COM CAVALO MECÂNICO DE CAPACIDADE MÁXIMA DE TRAÇÃO COMBINADO DE 36000 KG, POTÊNCIA 286 CV, INCLUSIVE SEMIREBOQUE TRAÇÃO ","CHI DIURNO.",8,82.59,{"$f":"ROUNDDOWN(F7*G7,2)","v":660.72}]
[null,"COMPOSICAO",5914640,"TRANSPORTE COM CAVALO MECÂNICO COM SEMIRREBOQUE COM CAPACIDADE DE 30 T - RODOVIA PAVIMENTADA","T.KM",9191,0.56999999999999995,5238.87]
[null,"COMPOSIÇÃO",88316,"SERVENTE COM ENCARGOS COMPLEMENTARES","H",16,19.760000000000002,316.16000000000003]
[null,"PRODUÇÃO DA EQUIPE",null,null,0.5,"CUSTO ",null,{"$f":"SUM(H6:H9)","v":8515.59}]
[null,"TOTAL",{"$nulls":5},{"$f":"H10/E10","v":17031.18},"OK"]
[null,"BDI                %",{"$nulls":5},{"$f":"1+$M$1","v":1.2135}]
[null,"TOTAL DO SERVIÇO - R$",{"$nulls":5},{"$f":"ROUND(H11*H12,2)","v":20667.34}]
[]
[{"$f":"A1+1","v":2},"CODEVASF",null,null," COMPOSIÇÃO DE PREÇO UNITÁRIO",null,null,null,{"$f":"H30","v":140379.6},{"$f":"H32","v":170350.64}]
[null,"OBRA:  ",{"$f":"$C$2","v":" PAVIMENTAÇÃO ASFÁLTICA EM CBUQ - AV. PAREDÃO DE MINAS (BURITIZEIRO / MG)"},null,null,null,"DATA: ",{"$f":"$H$2","v":" AGOSTO / 2023   "}]
[null,"SERVIÇO:  ",{"$f":"VLOOKUP(A15,ORÇAMENTO!$A$10:$I$29,3)","v":"ADMINISTRAÇÃO LOCAL"},null,"SINAPI","CPU.2","UNIDADE: ",{"$f":"VLOOKUP(A15,ORÇAMENTO!$A$10:$I$29,5)","v":"GL"}]
[]
[null,"TIPO ITEM","CODIGO ITEM","DESCRIÇÃO ITEM","UNIDADE ITEM","COEFICIENTE","PRECO UNITARIO","CUSTO TOTAL"]
[null,"INSUMO",14250,"ENERGIA ELÉTRICA","kwh",60,0.86,{"$f":"ROUNDDOWN(F20*G20,2)","v":51.6}]
[null,"INSUMO",44480,"TARIFA FORNECIMENTO DE ÁGUA/ESGOTO ","M3",6,16.27,97.62]
[null,"COTAÇÃO","MERC.","TELEFONE (PLANO CONTROLE)","UNID",2,59.99,119.98]
[null,"INSUMO","ED-50155 SEINFRA","BANHEIRO QUÍMICO 110 X 120 X 230 CM COM MANUTENÇÃO (CONSIDERANDO OBRAS SIMULTÂNEAS)","MÊS",2,820,1640]
[null,"COMPOSICAO",90777,"Engenheiro Civil Júnior com encargos complementares","H",55,114.12,6276.6]
[null,"COMPOSICAO",90776,"Encarregado Geral com encargos complementares","H",110,57.73,6350.3]
[null,"COMPOSICAO",88321,"Tecnico de Laboratório com encargos complementares","H",110,45.67,5023.7]
[null,"COMPOSICAO",100309,"Tecnico em Segurança do Trabalho com encargos complementares","H",55,45.93,2526.15]
[null,"COMPOSICAO",90772,"Auxiliar de escritório com encargos complementares","H",55,23.83,1310.6500000000001]
[null,"PRODUÇÃO DA EQUIPE",null,null,{"$f":"1/6","v":0.16666666666666666},"CUSTO ",null,{"$f":"SUM(H20:H28)","v":23396.600000000002}]
[null,"TOTAL",{"$nulls":5},{"$f":"ROUND(H29/E29,2)","v":140379.6},"OK"]
[null,"BDI                %",{"$nulls":5},{"$f":"1+$M$1","v":1.2135}]
[null,"TOTAL DO SERVIÇO - R$",{"$nulls":5},{"$f":"ROUND(H30*H31,2)","v":170350.64}]
[]
[{"$f":"A15+1","v":3},"CODEVASF",null,null," COMPOSIÇÃO DE PREÇO UNITÁRIO",null,null,null,{"$f":"H46","v":18107.399999999998},{"$f":"H48","v":21973.33}]
[null,"OBRA:  ",{"$f":"$C$2","v":" PAVIMENTAÇÃO ASFÁLTICA EM CBUQ - AV. PAREDÃO DE MINAS (BURITIZEIRO / MG)"},null,null,null,"DATA: ",{"$f":"$H$2","v":" AGOSTO / 2023   "}]
[null,"SERVIÇO:  ",{"$f":"VLOOKUP(A34,ORÇAMENTO!$A$10:$I$29,3)","v":"CANTEIRO DE OBRAS"},null,"SINAPI",{"$f":"VLOOKUP(A34,ORÇAMENTO!$A$10:$I$29,4)","v":"CPU.3"},"UNIDADE: ",{"$f":"VLOOKUP(A34,ORÇAMENTO!$A$10:$I$29,5)","v":"GL"}]
[]
[null,"TIPO ITEM","CODIGO ITEM","DESCRIÇÃO ITEM","UNIDADE ITEM","COEFICIENTE","PRECO UNITARIO","CUSTO TOTAL"]
[null,"INSUMO",10775,"LOCACAO DE CONTAINER COM 1 SANITARIO, PARA ESCRITORIO,COMPLETO, SEM DIVISORIAS INTERNAS","MÊS",6,1040,{"$f":"ROUNDDOWN(F39*G39,2)","v":6240}]
[null,"INSUMO",10779,"LOCACAO DE CONTAINER P/ SANITARIO, C/ 5 BACIAS, 1 LAVATORIO E 4 MICTORIOS","MÊS",6,1300,7800]
[null,"COMPOSIÇÃO",100382,"FABRICAÇÃO E INSTALAÇÃO DE PONTALETES DE MADEIRA NÃO APARELHADA PARA TELHADOS COM TELHA ONDULADA DE FIBROCIMENTO","M2",48,34.39,1650.72]
[null,"COMPOSIÇÃO",94207,"TELHAMENTO COM TELHA ONDULADA DE FIBROCIMENTO E = 6 MM","M2",48,42.66,2047.68]
[null,"INSUMO","37525","TELA PLASTICA TECIDA LISTRADA BRANCA E LARANJA, TIPO GUARDA CORPO, EM POLIETILENO MONOFILADO, ROLO 1,20 X 50 M (L X C)","M",100,3.69,369]
[{"$nulls":7},0]
[null,"PRODUÇÃO DA EQUIPE",null,null,1,"CUSTO ",null,{"$f":"SUM(H39:H44)","v":18107.399999999998}]
[null,"TOTAL",{"$nulls":5},{"$f":"H45/E45","v":18107.399999999998},"OK"]
[null,"BDI                %",{"$nulls":5},{"$f":"1+$M$1","v":1.2135}]
[null,"TOTAL DO SERVIÇO - R$",{"$nulls":5},{"$f":"ROUND(H46*H47,2)","v":21973.33}]
[]
[{"$f":"A34+1","v":4},"CODEVASF",null,null," COMPOSIÇÃO DE PREÇO UNITÁRIO",null,null,null,{"$f":"H64","v":340.97999999999996},{"$f":"H66","v":413.78}]
[null,"OBRA:  ",{"$f":"$C$2","v":" PAVIMENTAÇÃO ASFÁLTICA EM CBUQ - AV. PAREDÃO DE MINAS (BURITIZEIRO / MG)"},null,null,null,"DATA: ",{"$f":"$H$2","v":" AGOSTO / 2023   "}]
[null,"SERVIÇO:  ",{"$f":"VLOOKUP(A50,ORÇAMENTO!$A$10:$I$29,3)","v":"PLACA DE OBRA EM CHAPA DE AÇO GALVANIZADO"},null,"SINAPI",{"$f":"VLOOKUP(A50,ORÇAMENTO!$A$10:$I$29,4)","v":103689},"UNIDADE: ",{"$f":"VLOOKUP(A50,ORÇAMENTO!$A$10:$I$29,5)","v":"M2"}]
[]
[null,"TIPO ITEM","CODIGO ITEM","DESCRIÇÃO ITEM","UNIDADE ITEM","COEFICIENTE","PRECO UNITARIO","CUSTO TOTAL"]
[null,"INSUMO","4509","SARRAFO *2,5 X 10* CM EM PINUS, MISTA OU EQUIVALENTE DA REGIAO - BRUTA","M","3,2083000","4,39",{"$f":"ROUNDDOWN(F55*G55,2)","v":14.08}]
[null,"INSUMO","4813","PLACA DE OBRA (PARA CONSTRUCAO CIVIL) EM CHAPA GALVANIZADA *N. 22*, ADESIVADA, DE *2,4 X 1,2* M (SEM POSTES PARA FIXACAO)","M2","1,0000000","250,00",250]
[null,"INSUMO","5065","PREGO DE ACO POLIDO COM CABECA 10 X 10 ","KG","0,0113000","38,80",0.43]
[null,"INSUMO","5069","PREGO DE ACO POLIDO COM CABECA 17 X 27 ","KG","0,0132000","20,79",0.27]
[null,"COMPOSICAO","88262","CARPINTEIRO DE FORMAS COM ENCARGOS COMPLEMENTARES","H","0,3729000","27,05",10.08]
[null,"COMPOSICAO","88316","SERVENTE COM ENCARGOS COMPLEMENTARES","H","1,1186000","19,76",22.1]
{"$rows_left_out":305}
{"sheet":"BDI SERV","index":2,"n_rows":37,"n_cols":5,"rows_kept":37,"cut":false,"hidden":false,"merged":[[36,0,36,5],[3,1,4,1],[3,2,4,2],[0,1,2,4],[32,0,34,5],[28,0,28,5],[30,1,30,2],[31,1,31,2]]}
[null,"DETALHAMENTO DO BDI - SERVIÇOS"]
[]
[]
[null,"Item","Descrição dos Serviços","%","%"]
[null,null,null,"PV","CD"]
[]
[null,1,"ADMINISTRAÇÃO CENTRAL"," ",4.01]
[null,"1.1","ESCRITÓRIO CENTRAL"," "," "]
[null,"1.2","VIAGENS"," "," "]
[null,"1.3","OUTROS"," "," "]
[null," "," "," "," "]
[null,2,"IMPOSTOS E TAXAS",{"$f":"SUM(D13:D16)","v":6.15},{"$f":"SUM(E13:E16)","v":7.6899999999999995}]
[null,"2.1","ISS (*)",{"$f":"5*0.5","v":2.5},{"$f":"ROUND(D13*1.2515,2)","v":3.13}]
[null,"2.2","PIS",0.65,0.81]
[null,"2.3","Cofins",3,3.75]
[null,"2.4","CONTRIBUIÇÃO PREVIDENCIÁRIA SOBRE A RENDA BRUTA",0,0]
[]
[null,3,"TAXA DE RISCO"," ",{"$f":"SUM(E19:E22)","v":0.96}]
[null,"3.1","SEGURO",null,0.2]
[null,"3.2","RISCO",null,0.56000000000000005]
[null,"3.3","GARANTIA",null,0.2]
[]
[null,4,"DESPESAS FINANCEIRAS"," ",1.1100000000000001]
[]
[null,5,"LUCRO",null,7.3]
[]
[null," ","BDI - CALCULADO"," ",{"$f":"ROUND((((1+(E7+E18)/100)*(1+E23/100)*(1+E25/100)/(1-D12/100)-1)*100),2)","v":21.35}]
[]
["BDI = ((1+((AC+S+R+G)/100))x(1+DF/100)x(1+L/100)/(1-I/100)-1)*100"]
[]
[null,"BDI (CALCULADO):",null,{"$f":"ROUND((((1+((E7+E18)/100))*(1+E23/100)*(1+E25/100))/(1-D12/100)-1)*100,2)","v":21.35},"%"]
[null," "]
["(*) ISS CONFORME LEI MUNICIPAL Nº 1.152 / 2007 - Considerando as deduções previstas no Art. 108 - § 5º (Dedução de 50% sem necessidade de comprovação)"]
[]
[]
[]
["BDI EM CONFORMIDADE COM OS ACÓRDÃOS Nº 2369/2011 e ACÓRDÃO Nº 2.622/2013 - TCU - PLENÁRIO"]

{"sheet":"BDI FORN","index":3,"n_rows":37,"n_cols":5,"rows_kept":37,"cut":false,"hidden":false,"merged":[[0,1,2,4],[28,0,28,5],[30,1,30,2],[31,1,31,2],[36,0,36,5],[3,1,4,1],[3,2,4,2],[32,0,34,5]]}
[null,"DETALHAMENTO DO BDI - FORNECIMENTO \n(MATERIAL ASFÁLTICO)"]
[]
[]
[null,"Item","Descrição dos Serviços","%","%"]
[null,null,null,"PV","CD"]
[]
[null,1,"ADMINISTRAÇÃO CENTRAL"," ",3.72]
[null,"1.1","ESCRITÓRIO CENTRAL"," "," "]
[null,"1.2","VIAGENS"," "," "]
[null,"1.3","OUTROS"," "," "]
[null," "," "," "," "]
[null,2,"IMPOSTOS E TAXAS",{"$f":"SUM(D13:D16)","v":3.65},{"$f":"SUM(E13:E16)","v":4.5600000000000005}]
[null,"2.1","ISS (*)",null,{"$f":"ROUND(D13*1.2515,2)","v":0}]
[null,"2.2","PIS",0.65,0.81]
[null,"2.3","Cofins",3,3.75]
[null,"2.4","CONTRIBUIÇÃO PREVIDENCIÁRIA SOBRE A RENDA BRUTA",0,0]
[]
[null,3,"TAXA DE RISCO"," ",{"$f":"SUM(E19:E22)","v":0.82000000000000006}]
[null,"3.1","SEGURO",null,0.16]
[null,"3.2","RISCO",null,0.5]
[null,"3.3","GARANTIA",null,0.16]
[]
[null,4,"DESPESAS FINANCEIRAS"," ",0.94]
[]
[null,5,"LUCRO",null,5]
[]
[null," ","BDI - CALCULADO"," ",{"$f":"ROUND((((1+(E7+E18)/100)*(1+E23/100)*(1+E25/100)/(1-D12/100)-1)*100),2)","v":15}]
[]
["BDI = ((1+((AC+S+R+G)/100))x(1+DF/100)x(1+L/100)/(1-I/100)-1)*100"]
[]
[null,"BDI (CALCULADO):",null,{"$f":"ROUND((((1+((E7+E18)/100))*(1+E23/100)*(1+E25/100))/(1-D12/100)-1)*100,2)","v":15},"%"]
[null," "]
[]
[]
[]
[]
["BDI EM CONFORMIDADE COM OS ACÓRDÃOS Nº 2369/2011 e ACÓRDÃO Nº 2.622/2013 - TCU - PLENÁRIO"]

{"sheet":"CRONOGRAMA","index":4,"n_rows":19,"n_cols":12,"rows_kept":19,"cut":false,"hidden":false,"merged":[[15,1,16,2],[18,1,22,11],[7,2,8,2],[9,2,10,2],[11,2,12,2],[13,2,14,2],[7,0,8,0],[9,0,10,0],[11,0,12,0],[13,0,14,0],[1,1,2,1],[5,1,6,1],[7,1,8,1],[9,1,10,1],[11,1,12,1],[13,1,14,1],[0,1,0,11],[3,1,3,9],[5,0,6,0],[5,2,6,2],[1,2,2,4],[1,6,1,11],[2,6,2,11]]}
[null,"CRONOGRAMA FÍSICO-FINANCEIRO"]
[null,"OBRA: ",{"$f":"ORÇAMENTO!C5","v":" PAVIMENTAÇÃO ASFÁLTICA EM CBUQ - AV. PAREDÃO DE MINAS (BURITIZEIRO / MG)"},null,null,"VALOR:",{"$f":"ORÇAMENTO!I37","v":2494606.33}]
[{"$nulls":5},"PRAZO: ","180 DIAS "]
[]
[null,"ITEM","ETAPAS/DESCRIÇAO","FISICO/  FINANCEIRO","TOTAL    ETAPAS","MÊS 1","MÊS 2","MÊS 3","MÊS 4","MÊS 5","MÊS 6","TOTAL"]
["A",{"$f":"VLOOKUP(A6,ORÇAMENTO!$A$9:$I$37,2)","v":1},{"$f":"VLOOKUP(A6,ORÇAMENTO!$A$9:$I$37,3)","v":"SERVIÇOS PRELIMINARES "},"FISICO ",{"$f":"ROUND(E7/$G$2,4)","v":8.6900000000000005E-2},0.1,0.2,0.2,0.2,0.2,0.1,{"$f":"SUM(F6:K6)","v":0.99999999999999989}]
[null,null,null,"FINANCEIRO",{"$f":"ORÇAMENTO!I9","v":216753.99},{"$f":"ROUND($E$7*F6,2)","v":21675.4},43350.8,43350.8,43350.8,43350.8,21675.4,{"$f":"SUM(F7:K7)","v":216753.99999999997}]
["B",{"$f":"VLOOKUP(A8,ORÇAMENTO!$A$9:$I$37,2)","v":2},{"$f":"VLOOKUP(A8,ORÇAMENTO!$A$9:$I$37,3)","v":"TERRAPLANAGEM E PAVIMENTAÇÃO"},"FISICO ",{"$f":"ROUND(E9/$G$2,4)","v":0.10680000000000001},0.1,0.2,0.2,0.2,0.2,0.1,{"$f":"SUM(F8:K8)","v":0.99999999999999989}]
[null,null,null,"FINANCEIRO",{"$f":"ORÇAMENTO!I15","v":266397.2},{"$f":"ROUND($E$9*F8,2)","v":26639.72},53279.44,53279.44,53279.44,53279.44,26639.72,{"$f":"SUM(F9:K9)","v":266397.2}]
["C",{"$f":"VLOOKUP(A10,ORÇAMENTO!$A$9:$I$37,2)","v":3},{"$f":"VLOOKUP(A10,ORÇAMENTO!$A$9:$I$37,3)","v":"TRANSPORTE DE MATERIAIS"},"FISICO ",{"$f":"ROUND(E11/$G$2,4)","v":0.15609999999999999},0.1,0.2,0.2,0.2,0.2,0.1,{"$f":"SUM(F10:K10)","v":0.99999999999999989}]
[null,null,null,"FINANCEIRO",{"$f":"ORÇAMENTO!I23","v":389504.02},{"$f":"ROUND($E$11*F10,2)","v":38950.400000000001},77900.800000000003,77900.800000000003,77900.800000000003,77900.800000000003,38950.400000000001,{"$f":"SUM(F11:K11)-0.04","v":389503.96}]
["D",{"$f":"VLOOKUP(A12,ORÇAMENTO!$A$9:$I$37,2)","v":4},{"$f":"VLOOKUP(A12,ORÇAMENTO!$A$9:$I$37,3)","v":"OBRAS COMPLEMENTARES"},"FISICO ",{"$f":"ROUND(E13/$G$2,4)","v":0.13150000000000001},0,0.2,0.2,0.2,0.2,0.2,{"$f":"SUM(F12:K12)","v":1}]
[null,null,null,"FINANCEIRO",{"$f":"ORÇAMENTO!I28","v":328128.55},{"$f":"ROUND($E$13*F12,2)","v":0},65625.710000000006,65625.710000000006,65625.710000000006,65625.710000000006,65625.710000000006,{"$f":"SUM(F13:K13)-0.02","v":328128.53000000003}]
["E",{"$f":"VLOOKUP(A14,ORÇAMENTO!$A$9:$I$37,2)","v":5},{"$f":"VLOOKUP(A14,ORÇAMENTO!$A$9:$I$37,3)","v":"FORNECIMENTOS - MATERIAL ASFÁLTICO (BDI DIFERENCIADO)"},"FISICO ",{"$f":"ROUND(E15/$G$2,4)","v":0.51859999999999995},0.1,0.2,0.2,0.2,0.2,0.1,{"$f":"SUM(F14:K14)","v":0.99999999999999989}]
[null,null,null,"FINANCEIRO",{"$f":"ORÇAMENTO!I33","v":1293822.57},{"$f":"ROUND($E$15*F14,2)","v":129382.26},{"$f":"ROUND($E$15*G14,2)","v":258764.51},258764.51,258764.51,258764.51,129382.26,{"$f":"SUM(F15:K15)-0.02","v":1293822.54}]
[null,"TOTAL",null,"FISICO ",{"$f":"SUM(F16:K16)","v":0.99999999198270295},{"$f":"F17/$E$17","v":8.6846480502596968E-2},{"$f":"G17/$E$17","v":0.19999999759481088},0.19999999759481088,0.19999999759481088,0.19999999759481088,0.11315352110086242,{"$f":"SUM(F16:K16)","v":0.99999999198270295}]
[null,null,null,"FINANCEIRO",{"$f":"E11+E9+E7+E13+E15","v":2494606.33},{"$f":"F11+F9+F7+F13+F15","v":216647.77999999997},{"$f":"G11+G9+G7+G13+G15","v":498921.26},498921.26,498921.26,498921.26,282273.49,{"$f":"SUM(F17:K17)+0.02","v":2494606.3300000005}]
[]
[null,"OBSERVAÇÕES:"]