{"text_format":"2","workbook":"xlsx","n_sheets":5,"sheets":["ORÇAMENTO","CPU","BDI SERV","BDI FORN","CRONOGRAMA"],"not_rendered":{"charts":0,"images":2,"macros":0,"external_links":0,"defined_names":5,"comments":1,"pivot_tables":0},"unopened":[],"bounds":{"document_bytes":16777216,"sheet_cells":100000,"run_cost":"one","rows_first":2000,"rows_last":500,"rows_between":2000,"halvings":0,"cell_chars":16384,"cell_head_chars":4096},"cells_cut":0,"cells_raw":0,"read":"whole","date_system":"1900"}

{"sheet":"ORÇAMENTO","index":0,"n_rows":40,"n_cols":9,"rows_kept":40,"cut":false,"hidden":false,"merged":[[6,1,6,2],[6,6,6,7],[39,1,39,2],[0,0,7,0],[0,2,0,8],[1,2,1,8],[2,2,2,8],[4,2,4,8],[5,6,5,7]]}
["<---- NUMERAR SERVIÇOS PARA CPU",null,"Ministério do Desenvolvimento Regional"]
[null,null,"Companhia de Desenvolvimento dos Vales do São Francisco e do Parnaíba"]
[null,null,"1ª Superintendência Regional"]
[]
[null,"OBRA: "," PAVIMENTAÇÃO ASFÁLTICA EM CBUQ - AV. CENTRAL (BAIRRO: VILA SION - MONTES CLAROS / MG)"]
[null,"DATA:"," AGOSTO / 2023   ",null,null,null,"BDI Serviços:",null,{"$f":"'BDI SERV'!D31/100","v":0.22140000000000001}]
[null,"PRAZO DE EXECUÇÃO:     150 DIAS",{"$nulls":4},"BDI Serviços:",null,{"$f":"'BDI FORN'!D31/100","v":0.15}]
[null,"ITEM","DISCRIMINAÇÃO","REFER.","UNID.","QUANT.","P. UNITÁRIO","P.UNIT.C/ BDI","P. TOTAL"]
["A",1,"SERVIÇOS PRELIMINARES ",{"$nulls":5},{"$f":"SUM(I10:I14)","v":147410.91}]
[1,"1.1","MOBILIZAÇÃO E DESMOBILIZAÇÃO","CPU.1","GL",1,{"$f":"VLOOKUP(A10,CPU!$A$1:$N$4696,9)","v":3552.6000000000004},{"$f":"VLOOKUP(A10,CPU!$A$1:$N$4696,10)","v":4339.1499999999996},{"$f":"ROUND(F10*H10,2)","v":4339.1499999999996}]
[2,"1.2","ADMINISTRAÇÃO LOCAL","CPU.2","GL",1,{"$f":"VLOOKUP(A11,CPU!$A$1:$N$4696,9)","v":101600.85},{"$f":"VLOOKUP(A11,CPU!$A$1:$N$4696,10)","v":124095.28},{"$f":"ROUND(F11*H11,2)","v":124095.28}]
[3,"1.3","CANTEIRO DE OBRAS","CPU.3","GL",1,{"$f":"VLOOKUP(A12,CPU!$A$1:$N$4696,9)","v":11009},{"$f":"VLOOKUP(A12,CPU!$A$1:$N$4696,10)","v":13446.39},{"$f":"ROUND(F12*H12,2)","v":13446.39}]
[4,"1.4","PLACA DE OBRA EM CHAPA DE AÇO GALVANIZADO",103689,"M2",3,{"$f":"VLOOKUP(A13,CPU!$A$1:$N$4696,9)","v":352.08},{"$f":"VLOOKUP(A13,CPU!$A$1:$N$4696,10)","v":430.03},{"$f":"ROUND(F13*H13,2)","v":1290.0899999999999}]
[5,"1.5","SERVIÇOS TOPOGRÁFICOS PARA PAVIMENTAÇÃO, INCLUSIVE NOTA DE SERVIÇO, ACOMPANHAMENTO E GREIDE",78472,"M2",10600.003000000001,{"$f":"VLOOKUP(A14,CPU!$A$1:$N$4696,9)","v":0.32999999999999996},{"$f":"VLOOKUP(A14,CPU!$A$1:$N$4696,10)","v":0.4},{"$f":"ROUND(F14*H14,2)","v":4240}]
["B",2,"TERRAPLANAGEM E PAVIMENTAÇÃO",{"$nulls":5},{"$f":"SUM(I16:I22)","v":363259.2}]
[6,"2.1","ESCAVAÇÃO HORIZONTAL EM SOLO DE 1A CATEGORIA ",101116,"M3",3200,{"$f":"VLOOKUP(A16,CPU!$A$1:$N$4696,9)","v":1.87},{"$f":"VLOOKUP(A16,CPU!$A$1:$N$4696,10)","v":2.2799999999999998},{"$f":"ROUND(F16*H16,2)","v":7296}]
[7,"2.2","CARGA, MANOBRA E DESCARGA DE SOLOS E MATERIAIS GRANULARES EM CAMINHÃO BASCULANTE",100976,"M3",3200,{"$f":"VLOOKUP(A17,CPU!$A$1:$N$4696,9)","v":6.4500000000000011},{"$f":"VLOOKUP(A17,CPU!$A$1:$N$4696,10)","v":7.88},{"$f":"ROUND(F17*H17,2)","v":25216}]
[8,"2.3","REGULARIZAÇÃO E COMPACTAÇÃO DO SUBLEITO ",100576,"M2",10600,{"$f":"VLOOKUP(A18,CPU!$A$1:$N$4696,9)","v":2.3699999999999997},{"$f":"VLOOKUP(A18,CPU!$A$1:$N$4696,10)","v":2.89},30634]
[9,"2.4","EXECUÇÃO E COMPACTAÇÃO DE BASE E OU SUB BASE PARA PAVIMENTAÇÃO DE BICA CORRIDA - EXCLUSIVE TRANSPORTE",96396,"M3",1600,{"$f":"VLOOKUP(A19,CPU!$A$1:$N$4696,9)","v":113.43},{"$f":"VLOOKUP(A19,CPU!$A$1:$N$4696,10)","v":138.54},221664]
[10,"2.5","IMPRIMAÇÃO COM EMULSÃO ASFÁLTICA (EAI)",96401,"M2",10600,{"$f":"VLOOKUP(A20,CPU!$A$1:$N$4696,9)","v":1.1100000000000001},{"$f":"VLOOKUP(A20,CPU!$A$1:$N$4696,10)","v":1.36},14416]
[11,"2.6","PINTURA DE LIGAÇÃO COM EMULSÃO ASFÁLTICA RR-1C",96402,"M2",9700,{"$f":"VLOOKUP(A21,CPU!$A$1:$N$4696,9)","v":0.91000000000000014},{"$f":"VLOOKUP(A21,CPU!$A$1:$N$4696,10)","v":1.1100000000000001},10767]
[12,"2.7","EXECUÇÃO DE PAVIMENTO COM APLICAÇÃO DE CONCRETO ASFÁLTICO USINADO A QUENTE (CBUQ), CAMADA DE ROLAMENTO - EXCLUSIVE TRANSPORTE",95995,"M3",390,{"$f":"VLOOKUP(A22,CPU!$A$1:$N$4696,9)","v":111.82000000000001},{"$f":"VLOOKUP(A22,CPU!$A$1:$N$4696,10)","v":136.58000000000001},53266.2]
["C",3,"TRANSPORTE DE MATERIAIS",{"$nulls":5},{"$f":"SUM(I24:I25)","v":120504.01}]
[13,"3.1","TRANSPORTE COM CAMINHÃO BASCULANTE, EM VIA URBANA PAVIMENTADA",95877,"M3XKM",58000.003680000002,{"$f":"VLOOKUP(A24,CPU!$A$1:$N$4696,9)","v":1.6199999999999999},{"$f":"VLOOKUP(A24,CPU!$A$1:$N$4696,10)","v":1.98},{"$f":"ROUND(F24*H24,2)","v":114840.01}]
[14,"3.2","TRANSPORTE COM CAMINHÃO CARROCERIA 9T, EM VIA URBANA PAVIMENTADA",100947,"TXKM",2400,{"$f":"VLOOKUP(A25,CPU!$A$1:$N$4696,9)","v":1.93},{"$f":"VLOOKUP(A25,CPU!$A$1:$N$4696,10)","v":2.36},{"$f":"ROUND(F25*H25,2)","v":5664}]
["D",4,"TRANSPORTE DE MATERIAL ASFÁLTICO (BDI DIFERENCIADO)",{"$nulls":5},{"$f":"SUM(I27:I28)","v":23244}]
[15,"4.1","TRANSPORTE DE MASSA ASFÁLTICA COM CAMINHÃO BASCULANTE, EM VIA URBANA PAVIMENTADA (BDI DIFERENCIADO)",95880,"TXKM",15000,{"$f":"VLOOKUP(A27,CPU!$A$1:$N$4696,9)","v":1.08},{"$f":"VLOOKUP(A27,CPU!$A$1:$N$4696,10)","v":1.24},{"$f":"ROUND(F27*H27,2)","v":18600}]
[16,"4.2","TRANSPORTE COM CAMINHÃO TANQUE DE TRANSPORTE DE MATERIAL ASFÁLTICO DE 30000 L, EM VIA URBANA PAVIMENTADA (BDI DIFERENCIADO)",102331,"TXKM",8600,{"$f":"VLOOKUP(A28,CPU!$A$1:$N$4696,9)","v":0.47},{"$f":"VLOOKUP(A28,CPU!$A$1:$N$4696,10)","v":0.54},{"$f":"ROUND(F28*H28,2)","v":4644}]
["E",5,"OBRAS COMPLEMENTARES",{"$nulls":5},{"$f":"SUM(I30:I35)","v":268101.64}]
[17,"5.1","ASSENTAMENTO DE GUIA (MEIO-FIO) EM TRECHO RETO, CONFECCIONADA EM CONCRETO PRÉ-FABRICADO, DIMENSÕES 100X12X10X30 CM (COMPRIMENTO X BASE INFERIOR X BASE SUPERIOR X ALTURA), PARA VIAS URBANAS (USO VIÁRIO)","94273a","M",2000,{"$f":"VLOOKUP(A30,CPU!$A$1:$N$4696,9)","v":53.39},{"$f":"VLOOKUP(A30,CPU!$A$1:$N$4696,10)","v":65.209999999999994},{"$f":"ROUND(F30*H30,2)","v":130420}]
[18,"5.2","EXECUÇÃO DE SARJETA DE CONCRETO USINADO, MOLDADA  IN LOCO  EM TRECHO RETO, 30 CM BASE X 5 CM ALTURA","94281a","M",2000,{"$f":"VLOOKUP(A31,CPU!$A$1:$N$4696,9)","v":39},{"$f":"VLOOKUP(A31,CPU!$A$1:$N$4696,10)","v":47.63},{"$f":"ROUND(F31*H31,2)","v":95260}]
[19,"5.3","FORNECIMENTO E INSTALAÇÃO DE PLACA DE SINALIZAÇÃO VIÁRIA - REGULAMENTAÇÃO CIRCULAR ","CPU.4","UN.",3,{"$f":"VLOOKUP(A32,CPU!$A$1:$N$4696,9)","v":422.53},{"$f":"VLOOKUP(A32,CPU!$A$1:$N$4696,10)","v":516.08000000000004},{"$f":"ROUND(F32*H32,2)","v":1548.24}]
[20,"5.4","FORNECIMENTO E INSTALAÇÃO DE PLACA DE SINALIZAÇÃO VIÁRIA - REGULAMENTAÇÃO (PARE)","CPU.5","UN.",16,{"$f":"VLOOKUP(A33,CPU!$A$1:$N$4696,9)","v":482.45000000000005},{"$f":"VLOOKUP(A33,CPU!$A$1:$N$4696,10)","v":589.26},{"$f":"ROUND(F33*H33,2)","v":9428.16}]
[21,"5.5","FORNECIMENTO E INSTALAÇÃO DE PLACA DE AÇO PARA IDENTIFICACAO DE RUA, *45 CM X 20* CM, INCLUSIVE SUPORTE EM TUBO DE AÇO GALVANIZADO                                   ","CPU.6","UN.",16,{"$f":"VLOOKUP(A34,CPU!$A$1:$N$4696,9)","v":321.88},{"$f":"VLOOKUP(A34,CPU!$A$1:$N$4696,10)","v":393.14},{"$f":"ROUND(F34*H34,2)","v":6290.24}]
[22,"5.6","PINTURA DE EIXO VIÁRIO SOBRE ASFALTO COM TINTA RETRORREFLETIVA A BASE DE RESINA ACRÍLICA COM MICROESFERAS DE VIDRO, APLICAÇÃO MECÂNICA COM DEMARCADORA AUTOPROPELIDA (ESP.=10CM)",102512,"M",3900,{"$f":"VLOOKUP(A35,CPU!$A$1:$N$4696,9)","v":5.28},{"$f":"VLOOKUP(A35,CPU!$A$1:$N$4696,10)","v":6.45},{"$f":"ROUND(F35*H35,2)","v":25155}]
["F",6,"FORNECIMENTOS - MATERIAL ASFÁLTICO (BDI DIFERENCIADO)",{"$nulls":5},{"$f":"SUM(I37:I39)","v":746391.03}]
[23,"6.1","AQUISIÇÃO DE EMULSÃO ASFÁLTICA PARA IMPRIMAÇÃO (EAI) - EXCLUSIVE TRANSPORTE","CPU.7","T",14.000000000000002,{"$f":"VLOOKUP(A37,CPU!$A$1:$N$4696,9)","v":2769.65},{"$f":"VLOOKUP(A37,CPU!$A$1:$N$4696,10)","v":3185.1},{"$f":"ROUND(F37*H37,2)","v":44591.4}]
[24,"6.2","AQUISIÇÃO DE EMULSAO ASFALTICA CATIONICA RR-1C - EXCLUSIVE TRANSPORTE","CPU.8","T",4.4950000000000001,{"$f":"VLOOKUP(A38,CPU!$A$1:$N$4696,9)","v":2837.6},{"$f":"VLOOKUP(A38,CPU!$A$1:$N$4696,10)","v":3263.24},{"$f":"ROUND(F38*H38,2)","v":14668.26}]
[25,"6.3","AQUISIÇÃO DE CONCRETO BETUMINOSO USINADO A QUENTE (CBUQ) PARA PAVIMENTACAO ASFALTICA, PADRAO DNIT, FAIXA C, COM CAP 50/70 - EXCLUSIVE TRANSPORTE","CPU.9","T",1000.0020000000001,{"$f":"VLOOKUP(A39,CPU!$A$1:$N$4696,9)","v":597.5},{"$f":"VLOOKUP(A39,CPU!$A$1:$N$4696,10)","v":687.13},687131.37]
[null,"TOTAL GERAL DA OBRA COM BDI ",{"$nulls":6},{"$f":"SUM(I9,I15,I23,I29,I36,I26)","v":1668910.79}]
{"$rows_left_out":1}
{"sheet":"CPU","index":1,"n_rows":393,"n_cols":13,"rows_kept":393,"cut":false,"hidden":false,"merged":[[261,12,263,15],[372,0,381,0],[383,0,392,0],[15,8,16,9],[33,8,34,9],[307,0,323,0],[307,1,307,3],[307,4,307,7],[308,2,308,5],[309,2,309,3],[310,1,310,7],[320,1,320,3],[320,5,320,6],[321,1,321,6],[322,1,322,6],[323,1,323,6],[390,1,390,6],[391,1,391,6],[392,1,392,6],[145,0,163,0],[164,0,182,0],[183,0,204,0],[205,0,216,0],[218,0,229,0],[244,0,255,0],[0,0,13,0],[14,0,31,0],[32,0,45,0],[46,0,63,0],[64,0,79,0],[80,0,92,0],[93,0,105,0],[107,0,124,0],[125,0,143,0],[231,0,242,0],[256,0,270,0],[272,0,287,0],[289,0,305,0],[325,0,341,0],[343,0,359,0],[361,0,370,0],[379,1,379,6],[380,1,380,6],[381,1,381,6],[357,1,357,6],[358,1,358,6],[359,1,359,6],[361,1,361,3],[361,4,361,7],[362,2,362,5],[363,2,363,3],[364,1,364,7],[367,1,367,3],[367,5,367,6],[339,1,339,6],[340,1,340,6],[341,1,341,6],[343,1,343,3],[343,4,343,7],[383,1,383,3],[383,4,383,7],[384,2,384,5],[385,2,385,3],[386,1,386,7],[389,1,389,3],[389,5,389,6],[368,1,368,6],[369,1,369,6],[370,1,370,6],[372,1,372,3],[372,4,372,7],[373,2,373,5],[374,2,374,3],[375,1,375,7],[378,1,378,3],[378,5,378,6],[344,2,344,5],[345,2,345,3],[346,1,346,7],[356,1,356,3],[356,5,356,6],[304,1,304,6],[305,1,305,6],[325,1,325,3],[325,4,325,7],[326,2,326,5],[327,2,327,3],[328,1,328,7],[338,1,338,3],[338,5,338,6],[287,1,287,6],[289,1,289,3],[289,4,289,7],[290,2,290,5],[291,2,291,3],[292,1,292,7],[302,1,302,3],[302,5,302,6],[303,1,303,6],[272,1,272,3],[272,4,272,7],[273,2,273,5],[274,2,274,3],[275,1,275,7],[284,1,284,3],[284,5,284,6],[285,1,285,6],[286,1,286,6],[256,10,256,11],[257,2,257,5],[258,2,258,3],[259,1,259,7],[267,1,267,3],[267,5,267,6],[268,1,268,6],[269,1,269,6],[270,1,270,6],[245,2,245,5],[246,2,246,3],[247,1,247,7],[251,1,251,3],[251,5,251,6],[252,1,252,6],[253,1,253,6],[254,1,254,6],[256,1,256,3],[256,4,256,7],[221,1,221,7],[226,1,226,3],[226,5,226,6],[227,1,227,6],[228,1,228,6],[229,1,229,6],[244,1,244,3],[244,4,244,7],[244,10,244,11],[231,1,231,3],[231,4,231,7],[232,2,232,5],[233,2,233,3],[234,1,234,7],[239,1,239,3],[239,5,239,6],[240,1,240,6],[241,1,241,6],[242,1,242,6],[213,1,213,3],[213,5,213,6],[214,1,214,6],[215,1,215,6],[216,1,216,6],[218,1,218,3],[218,4,218,7],[219,2,219,5],[220,2,220,3],[201,1,201,6],[202,1,202,6],[203,1,203,6],[205,1,205,3],[205,4,205,7],[205,10,205,11],[206,2,206,5],[207,2,207,3],[208,1,208,7],[183,1,183,3],[183,4,183,7],[183,10,183,11],[184,2,184,5],[185,2,185,3],[186,1,186,7],[188,8,188,9],[200,1,200,3],[200,5,200,6],[164,10,164,11],[165,2,165,5],[166,2,166,3],[167,1,167,7],[178,1,178,3],[178,5,178,6],[179,1,179,6],[180,1,180,6],[181,1,181,6],[146,2,146,5],[147,2,147,3],[148,1,148,7],[159,1,159,3],[159,5,159,6],[160,1,160,6],[161,1,161,6],[162,1,162,6],[164,1,164,3],[164,4,164,7],[128,1,128,7],[140,1,140,3],[140,5,140,6],[141,1,141,6],[142,1,142,6],[143,1,143,6],[145,1,145,3],[145,4,145,7],[145,10,145,11],[120,1,120,3],[120,5,120,6],[121,1,121,6],[122,1,122,6],[123,1,123,6],[125,1,125,3],[125,4,125,7],[126,2,126,5],[127,2,127,3],[103,1,103,6],[104,1,104,6],[105,1,105,6],[107,1,107,3],[107,4,107,7],[107,10,107,11],[108,2,108,5],[109,2,109,3],[110,1,110,7],[89,1,89,6],[90,1,90,6],[91,1,91,6],[93,1,93,3],[93,4,93,7],[94,2,94,5],[95,2,95,3],[96,1,96,7],[102,1,102,3],[102,5,102,6],[77,1,77,6],[78,1,78,6],[80,1,80,3],[80,4,80,7],[80,10,80,11],[81,2,81,5],[82,2,82,3],[83,1,83,7],[88,1,88,3],[88,5,88,6],[64,1,64,3],[64,4,64,7],[64,10,64,11],[65,2,65,5],[66,2,66,3],[67,1,67,7],[75,1,75,3],[75,5,75,6],[76,1,76,6],[46,10,46,11],[47,2,47,5],[48,2,48,3],[49,1,49,7],[59,1,59,3],[59,5,59,6],[60,1,60,6],[61,1,61,6],[62,1,62,6],[34,2,34,3],[35,1,35,7],[41,1,41,3],[41,5,41,6],[42,1,42,6],[43,1,43,6],[44,1,44,6],[46,1,46,3],[46,4,46,7],[27,1,27,3],[27,5,27,6],[28,1,28,6],[29,1,29,6],[30,1,30,6],[32,1,32,3],[32,4,32,7],[32,10,32,11],[33,2,33,5],[10,1,10,6],[11,1,11,6],[12,1,12,6],[14,1,14,3],[14,4,14,7],[14,10,14,11],[15,2,15,5],[16,2,16,3],[17,1,17,7],[0,1,0,3],[0,4,0,7],[0,10,0,11],[1,2,1,5],[1,10,1,11],[2,2,2,3],[3,1,3,7],[9,1,9,3],[9,5,9,6]]}
[1,"CODEVASF",null,null," COMPOSIÇÃO DE PREÇO UNITÁRIO",null,null,null,{"$f":"H11","v":3552.6000000000004},{"$f":"H13","v":4339.1499999999996},"BDI CALCULADO:",null,{"$f":"ORÇAMENTO!I6","v":0.22140000000000001}]
[null,"OBRA:  ",{"$f":"ORÇAMENTO!C5","v":" PAVIMENTAÇÃO ASFÁLTICA EM CBUQ - AV. CENTRAL (BAIRRO: VILA SION - MONTES CLAROS / MG)"},null,null,null,"DATA: ",{"$f":"ORÇAMENTO!C6","v":" AGOSTO / 2023   "},null,null,"BDI DIFERENCIADO:",null,{"$f":"'BDI FORN'!D31/100","v":0.15}]
[null,"SERVIÇO:  ",{"$f":"VLOOKUP(A1,ORÇAMENTO!A10:I30,3)","v":"MOBILIZAÇÃO E DESMOBILIZAÇÃO"},null,"Referência:",{"$f":"VLOOKUP(A1,ORÇAMENTO!$A$10:$I$30,4)","v":"CPU.1"},"UNIDADE: ",{"$f":"VLOOKUP(A1,ORÇAMENTO!A10:I30,5)","v":"GL"}]
[]
[null,"TIPO ITEM","CODIGO ITEM","DESCRIÇÃO ITEM","UNIDADE ITEM","COEFICIENTE","PRECO UNITARIO","CUSTO TOTAL"]
[null,"COMPOSICAO",89876,"CAMINHÃO BASCULANTE 14 M3, COM CAVALO MECÂNICO DE CAPACIDADE MÁXIMA DE TRAÇÃO COMBINADO DE 36000 KG, POTÊNCIA 286 CV, INCLUSIVE SEMIREBOQUE COM CAÇAMBA METÁLICA","CHP DIURNO.",8,287.48,{"$f":"ROUNDDOWN(F6*G6,2)","v":2299.84}]
[null,"COMPOSICAO",89877,"CAMINHÃO BASCULANTE 14 M3, COM CAVALO MECÂNICO DE CAPACIDADE MÁXIMA DE TRAÇÃO COMBINADO DE 36000 KG, POTÊNCIA 286 CV, INCLUSIVE SEMIREBOQUE COM CAÇAMBA METÁLICA","CHI DIURNO.",8,82.59,{"$f":"ROUNDDOWN(F7*G7,2)","v":660.72}]
[null,"COMPOSICAO",5914640,"TRANSPORTE COM CAVALO MECÂNICO COM SEMIRREBOQUE COM CAPACIDADE DE 30 T - RODOVIA PAVIMENTADA","T.KM",484,0.56999999999999995,275.88]
[null,"COMPOSIÇÃO",88316,"SERVENTE COM ENCARGOS COMPLEMENTARES","H",16,19.760000000000002,316.16000000000003]
[null,"PRODUÇÃO DA EQUIPE",null,null,1,"CUSTO ",null,{"$f":"SUM(H6:H9)","v":3552.6000000000004}]
[null,"TOTAL",{"$nulls":5},{"$f":"H10/E10","v":3552.6000000000004},"OK"]
[null,"BDI                %",{"$nulls":5},{"$f":"1+$M$1","v":1.2214}]
[null,"TOTAL DO SERVIÇO - R$",{"$nulls":5},{"$f":"ROUND(H11*H12,2)","v":4339.1499999999996}]
[]
[{"$f":"A1+1","v":2},"CODEVASF",null,null," COMPOSIÇÃO DE PREÇO UNITÁRIO",null,null,null,{"$f":"H29","v":101600.85},{"$f":"H31","v":124095.28}]
[null,"OBRA:  ",{"$f":"$C$2","v":" PAVIMENTAÇÃO ASFÁLTICA EM CBUQ - AV. CENTRAL (BAIRRO: VILA SION - MONTES CLAROS / MG)"},null,null,null,"DATA: ",{"$f":"$H$2","v":" AGOSTO / 2023   "}]
[null,"SERVIÇO:  ",{"$f":"VLOOKUP(A15,ORÇAMENTO!$A$10:$I$30,3)","v":"ADMINISTRAÇÃO LOCAL"},null,"SINAPI",{"$f":"VLOOKUP(A15,ORÇAMENTO!$A$10:$I$30,4)","v":"CPU.2"},"UNIDADE: ",{"$f":"VLOOKUP(A15,ORÇAMENTO!$A$10:$I$30,5)","v":"GL"}]
[]
[null,"TIPO ITEM","CODIGO ITEM","DESCRIÇÃO ITEM","UNIDADE ITEM","COEFICIENTE","PRECO UNITARIO","CUSTO TOTAL"]
[null,"INSUMO",14250,"ENERGIA ELÉTRICA","kwh",60,0.86,{"$f":"ROUNDDOWN(F20*G20,2)","v":51.6}]
[null,"INSUMO",44480,"TARIFA \"A\" - ÁGUA/ESGOTO ","m³",6,16.27,97.62]
[null,"COTAÇÃO","MERC.","TELEFONE (PLANO CONTROLE)","UNID",3,59.9,179.7]
[null,"INSUMO","ED-50155 SEINFRA","BANHEIRO QUÍMICO 110 X 120 X 230 CM COM MANUTENÇÃO (CONSIDERANDO OBRAS SIMULTÂNEAS)","MÊS",2,515,1030]
[null,"COMPOSICAO",90777,"Engenheiro Civil Júnior com encargos complementares","H",55,114.12,6276.6]
[null,"COMPOSICAO",90776,"Encarregado Geral com encargos complementares","H",110,57.73,6350.3]
[null,"COMPOSICAO",88321,"Tecnico de Laboratório com encargos complementares","H",110,45.67,5023.7]
[null,"COMPOSICAO",90772,"Auxiliar de escritório com encargos complementares","H",55,23.83,1310.6500000000001]
[null,"PRODUÇÃO DA EQUIPE",null,null,0.2,"CUSTO ",null,{"$f":"SUM(H20:H27)","v":20320.170000000002}]
[null,"TOTAL",{"$nulls":5},{"$f":"ROUND(H28/E28,2)","v":101600.85},"OK"]
[null,"BDI                %",{"$nulls":5},{"$f":"1+$M$1","v":1.2214}]
[null,"TOTAL DO SERVIÇO - R$",{"$nulls":5},{"$f":"ROUND(H29*H30,2)","v":124095.28}]
[]
[{"$f":"A15+1","v":3},"CODEVASF",null,null," COMPOSIÇÃO DE PREÇO UNITÁRIO",null,null,null,{"$f":"H43","v":11009},{"$f":"H45","v":13446.39}]
[null,"OBRA:  ",{"$f":"$C$2","v":" PAVIMENTAÇÃO ASFÁLTICA EM CBUQ - AV. CENTRAL (BAIRRO: VILA SION - MONTES CLAROS / MG)"},null,null,null,"DATA: ",{"$f":"$H$2","v":" AGOSTO / 2023   "}]
[null,"SERVIÇO:  ",{"$f":"VLOOKUP(A33,ORÇAMENTO!$A$10:$I$30,3)","v":"CANTEIRO DE OBRAS"},null,"SINAPI",{"$f":"VLOOKUP(A33,ORÇAMENTO!$A$10:$I$30,4)","v":"CPU.3"},"UNIDADE: ",{"$f":"VLOOKUP(A33,ORÇAMENTO!$A$10:$I$30,5)","v":"GL"}]
[]
[null,"TIPO ITEM","CODIGO ITEM","DESCRIÇÃO ITEM","UNIDADE ITEM","COEFICIENTE","PRECO UNITARIO","CUSTO TOTAL"]
[null,"INSUMO",10775,"LOCACAO DE CONTAINER 2,30 X 6,00 M, ALT. 2,50 M, COM 1 SANITARIO, PARA ESCRITORIO,COMPLETO, SEM DIVISORIAS INTERNAS","MÊS",5,1040,{"$f":"ROUNDDOWN(F38*G38,2)","v":5200}]
[null,"INSUMO",10779,"LOCACAO DE CONTAINER 2,30 X 4,30 M, ALT. 2,50 M, P/ SANITARIO, C/ 5 BACIAS, 1 LAVATORIO E 4 MICTORIOS","MÊS",5,1040,{"$f":"ROUNDDOWN(F39*G39,2)","v":5200}]
[null,"INSUMO","37525","TELA PLASTICA TECIDA LISTRADA BRANCA E LARANJA, TIPO GUARDA CORPO, EM POLIETILENO MONOFILADO, ROLO 1,20 X 50 M (L X C)","M",100,3.69,369]
{"$rows_left_out":354}
{"sheet":"BDI SERV","index":2,"n_rows":37,"n_cols":20,"rows_kept":37,"cut":false,"hidden":false,"merged":[[36,0,36,5],[3,1,4,1],[3,2,4,2],[0,1,2,4],[32,0,34,5],[28,0,28,5],[30,1,30,2],[31,1,31,2]]}
[null,"DETALHAMENTO DO BDI - SERVIÇOS"]
[]
[]
[null,"Item","Descrição dos Serviços","%","%"]
[null,null,null,"PV","CD"]
[]
[null,1,"ADMINISTRAÇÃO CENTRAL"," ",4.01]
[null,"1.1","ESCRITÓRIO CENTRAL"," "," "]
[null,"1.2","VIAGENS"," "," "]
[null,"1.3","OUTROS"," "," "]
[null," "," "," "," "]
[null,2,"IMPOSTOS E TAXAS",{"$f":"SUM(D13:D16)","v":6.15},{"$f":"SUM(E13:E16)","v":7.6899999999999995}]
[null,"2.1","ISS (*)",2.5,{"$f":"ROUND(D13*1.2515,2)","v":3.13}]
[null,"2.2","PIS",0.65,0.81]
[null,"2.3","Cofins",3,3.75]
[null,"2.4","CONTRIBUIÇÃO PREVIDENCIÁRIA SOBRE A RENDA BRUTA",0,0]
[]
[null,3,"TAXA DE RISCO"," ",{"$f":"SUM(E19:E22)","v":0.96}]
[null,"3.1","SEGURO",null,0.2]
[null,"3.2","RISCO",null,0.56000000000000005]
[null,"3.3","GARANTIA",null,0.2]
[{"$nulls":19},{"$f":"1/0.82","v":1.2195121951219512}]
[null,4,"DESPESAS FINANCEIRAS"," ",1.1100000000000001]
[]
[null,5,"LUCRO",null,8]
[]
[null," ","BDI - CALCULADO"," ",{"$f":"ROUND((((1+(E7+E18)/100)*(1+E23/100)*(1+E25/100)/(1-D12/100)-1)*100),2)","v":22.14}]
[]
["BDI = ((1+((AC+S+R+G)/100))x(1+DF/100)x(1+L/100)/(1-I/100)-1)*100"]
[]
[null,"BDI (CALCULADO):",null,{"$f":"ROUND((((1+((E7+E18)/100))*(1+E23/100)*(1+E25/100))/(1-D12/100)-1)*100,2)","v":22.14},"%"]
[null," "]
["(*) ISS CONFORME LEI COMPLEMENTAR Nº 04 / 2005 - Atualizado até a LC nº 64, de 27/12/2017 - \nConsiderando as deduções previstas no Art. 62 - § 4º (Alíquota sobre 50% do preço da obra)"]
[]
[]
[]
["BDI EM CONFORMIDADE COM OS ACÓRDÃOS Nº 2369/2011 e ACÓRDÃO Nº 2.622/2013 - TCU - PLENÁRIO"]

{"sheet":"BDI FORN","index":3,"n_rows":37,"n_cols":5,"rows_kept":37,"cut":false,"hidden":false,"merged":[[0,1,2,4],[28,0,28,5],[30,1,30,2],[31,1,31,2],[36,0,36,5],[3,1,4,1],[3,2,4,2],[32,0,34,5]]}
[null,"DETALHAMENTO DO BDI - FORNECIMENTO \n(MATERIAL ASFÁLTICO)"]
[]
[]
[null,"Item","Descrição dos Serviços","%","%"]
[null,null,null,"PV","CD"]
[]
[null,1,"ADMINISTRAÇÃO CENTRAL"," ",3.72]
[null,"1.1","ESCRITÓRIO CENTRAL"," "," "]
[null,"1.2","VIAGENS"," "," "]
[null,"1.3","OUTROS"," "," "]
[null," "," "," "," "]
[null,2,"IMPOSTOS E TAXAS",{"$f":"SUM(D13:D16)","v":3.65},{"$f":"SUM(E13:E16)","v":4.5600000000000005}]
[null,"2.1","ISS (*)",null,{"$f":"ROUND(D13*1.2515,2)","v":0}]
[null,"2.2","PIS",0.65,0.81]
[null,"2.3","Cofins",3,3.75]
[null,"2.4","CONTRIBUIÇÃO PREVIDENCIÁRIA SOBRE A RENDA BRUTA",0,0]
[]
[null,3,"TAXA DE RISCO"," ",{"$f":"SUM(E19:E22)","v":0.82000000000000006}]
[null,"3.1","SEGURO",null,0.16]
[null,"3.2","RISCO",null,0.5]
[null,"3.3","GARANTIA",null,0.16]
[]
[null,4,"DESPESAS FINANCEIRAS"," ",0.94]
[]
[null,5,"LUCRO",null,5]
[]
[null," ","BDI - CALCULADO"," ",{"$f":"ROUND((((1+(E7+E18)/100)*(1+E23/100)*(1+E25/100)/(1-D12/100)-1)*100),2)","v":15}]
[]
["BDI = ((1+((AC+S+R+G)/100))x(1+DF/100)x(1+L/100)/(1-I/100)-1)*100"]
[]
[null,"BDI (CALCULADO):",null,{"$f":"ROUND((((1+((E7+E18)/100))*(1+E23/100)*(1+E25/100))/(1-D12/100)-1)*100,2)","v":15},"%"]
[null," "]
[]
[]
[]
[]
["BDI EM CONFORMIDADE COM OS ACÓRDÃOS Nº 2369/2011 e ACÓRDÃO Nº 2.622/2013 - TCU - PLENÁRIO"]

{"sheet":"CRONOGRAMA","index":4,"n_rows":21,"n_cols":11,"rows_kept":21,"cut":false,"hidden":false,"merged":[[17,1,18,2],[20,1,24,10],[7,2,8,2],[9,2,10,2],[11,2,12,2],[15,2,16,2],[13,1,14,1],[13,2,14,2],[7,0,8,0],[9,0,10,0],[11,0,12,0],[15,0,16,0],[1,1,2,1],[5,1,6,1],[7,1,8,1],[9,1,10,1],[11,1,12,1],[15,1,16,1],[13,0,14,0],[0,1,0,10],[3,1,3,9],[5,0,6,0],[5,2,6,2],[1,2,2,4],[1,6,1,10],[2,6,2,10]]}
[null,"CRONOGRAMA FÍSICO-FINANCEIRO"]
[null,"OBRA: ",{"$f":"ORÇAMENTO!C5","v":" PAVIMENTAÇÃO ASFÁLTICA EM CBUQ - AV. CENTRAL (BAIRRO: VILA SION - MONTES CLAROS / MG)"},null,null,"VALOR:",{"$f":"ORÇAMENTO!I40","v":1668910.79}]
[{"$nulls":5},"PRAZO: ","240 DIAS "]
[]
[null,"ITEM","ETAPAS/DESCRIÇAO","FISICO/  FINANCEIRO","TOTAL    ETAPAS","MÊS 1","MÊS 2","MÊS 3","MÊS 4","MÊS 5","TOTAL"]
["A",{"$f":"VLOOKUP(A6,ORÇAMENTO!$A$9:$I$40,2)","v":1},{"$f":"VLOOKUP(A6,ORÇAMENTO!$A$9:$I$40,3)","v":"SERVIÇOS PRELIMINARES "},"FISICO ",{"$f":"ROUND(E7/$G$2,4)","v":8.8300000000000003E-2},0.2,0.2,0.2,0.2,0.2,{"$f":"SUM(F6:J6)","v":1}]
[null,null,null,"FINANCEIRO",{"$f":"ORÇAMENTO!I9","v":147410.91},{"$f":"ROUND($E$7*F6,2)","v":29482.18},{"$f":"ROUND($E$7*G6,2)","v":29482.18},{"$f":"ROUND($E$7*H6,2)","v":29482.18},{"$f":"ROUND($E$7*I6,2)","v":29482.18},29482.18,{"$f":"SUM(F7:J7)","v":147410.9}]
["B",{"$f":"VLOOKUP(A8,ORÇAMENTO!$A$9:$I$40,2)","v":2},{"$f":"VLOOKUP(A8,ORÇAMENTO!$A$9:$I$40,3)","v":"TERRAPLANAGEM E PAVIMENTAÇÃO"},"FISICO ",{"$f":"ROUND(E9/$G$2,4)","v":0.2177},0.1,0.25,0.25,0.25,0.15,{"$f":"SUM(F8:J8)","v":1}]
[null,null,null,"FINANCEIRO",{"$f":"ORÇAMENTO!I15","v":363259.2},{"$f":"ROUND($E$9*F8,2)","v":36325.919999999998},{"$f":"ROUND($E$9*G8,2)","v":90814.8},{"$f":"ROUND($E$9*H8,2)","v":90814.8},{"$f":"ROUND($E$9*I8,2)","v":90814.8},54488.88,{"$f":"SUM(F9:J9)","v":363259.2}]
["C",{"$f":"VLOOKUP(A10,ORÇAMENTO!$A$9:$I$40,2)","v":3},{"$f":"VLOOKUP(A10,ORÇAMENTO!$A$9:$I$40,3)","v":"TRANSPORTE DE MATERIAIS"},"FISICO ",{"$f":"ROUND(E11/$G$2,4)","v":7.22E-2},0.25,0.25,0.2,0.2,0.1,{"$f":"SUM(F10:J10)","v":0.99999999999999989}]
[null,null,null,"FINANCEIRO",{"$f":"ORÇAMENTO!I23","v":120504.01},{"$f":"ROUND($E$11*F10,2)","v":30126},{"$f":"ROUND($E$11*G10,2)","v":30126},{"$f":"ROUND($E$11*H10,2)","v":24100.799999999999},{"$f":"ROUND($E$11*I10,2)","v":24100.799999999999},12050.4,{"$f":"SUM(F11:J11)-0.04","v":120503.96}]
["D",{"$f":"VLOOKUP(A12,ORÇAMENTO!$A$9:$I$40,2)","v":4},{"$f":"VLOOKUP(A12,ORÇAMENTO!$A$9:$I$40,3)","v":"TRANSPORTE DE MATERIAL ASFÁLTICO (BDI DIFERENCIADO)"},"FISICO ",{"$f":"ROUND(E13/$G$2,4)","v":1.3899999999999999E-2},0.1,0.25,0.25,0.25,0.15,{"$f":"SUM(F12:J12)","v":1}]
[null,null,null,"FINANCEIRO",{"$f":"ORÇAMENTO!I26","v":23244},{"$f":"ROUND($E$13*F12,2)","v":2324.4},{"$f":"ROUND($E$13*G12,2)","v":5811},{"$f":"ROUND($E$13*H12,2)","v":5811},{"$f":"ROUND($E$13*I12,2)","v":5811},3486.6,{"$f":"SUM(F13:J13)-0.02","v":23243.98}]
["E",{"$f":"VLOOKUP(A14,ORÇAMENTO!$A$9:$I$40,2)","v":5},{"$f":"VLOOKUP(A14,ORÇAMENTO!$A$9:$I$40,3)","v":"OBRAS COMPLEMENTARES"},"FISICO ",{"$f":"ROUND(E15/$G$2,4)","v":0.16059999999999999},0.15,0.25,0.25,0.2,0.15,{"$f":"SUM(F14:J14)","v":1}]
[null,null,null,"FINANCEIRO",{"$f":"ORÇAMENTO!I29","v":268101.64},{"$f":"ROUND($E$15*F14,2)","v":40215.25},67025.41,67025.41,{"$f":"ROUND($E$15*I14,2)","v":53620.33},40215.25,{"$f":"SUM(F15:J15)-0.02","v":268101.63}]
["F",{"$f":"VLOOKUP(A16,ORÇAMENTO!$A$9:$I$40,2)","v":6},{"$f":"VLOOKUP(A16,ORÇAMENTO!$A$9:$I$40,3)","v":"FORNECIMENTOS - MATERIAL ASFÁLTICO (BDI DIFERENCIADO)"},"FISICO ",{"$f":"ROUND(E17/$G$2,4)","v":0.44719999999999999},0.1,0.25,0.25,0.25,0.15,{"$f":"SUM(F16:J16)","v":1}]
[null,null,null,"FINANCEIRO",{"$f":"ORÇAMENTO!I36","v":746391.03},{"$f":"ROUND($E$17*F16,2)","v":74639.100000000006},{"$f":"ROUND($E$17*G16,2)","v":186597.76000000001},{"$f":"ROUND($E$17*H16,2)","v":186597.76000000001},{"$f":"ROUND($E$17*I16,2)","v":186597.76000000001},111958.65,{"$f":"SUM(F17:J17)-0.02","v":746391.01}]
[null,"TOTAL",null,"FISICO ",{"$f":"SUM(F18:J18)","v":0.99999999400806794},{"$f":"F19/$E$19","v":0.12769577096448637},{"$f":"G19/$E$19","v":0.24558361804347853},{"$f":"H19/$E$19","v":0.24197335916319412},0.2339411263558312,0.15080611948107783,{"$f":"SUM(F18:J18)","v":0.99999999400806794}]
[null,null,null,"FINANCEIRO",{"$f":"E11+E9+E7+E13+E17+E15","v":1668910.79},{"$f":"F11+F9+F7+F13+F17+F15","v":213112.85},{"$f":"G11+G9+G7+G13+G17+G15","v":409857.15},403831.95000000007,{"$f":"I11+I9+I7+I13+I17+I15","v":390426.87000000005},251681.96,{"$f":"SUM(F19:J19)+0.01","v":1668910.79}]
[]
[null,"OBSERVAÇÕES:"]