{"text_format":"2","workbook":"xlsx","n_sheets":5,"sheets":["ORÇAMENTO","CPU","BDI SERV","BDI FORN","CRONOGRAMA"],"not_rendered":{"charts":0,"images":2,"macros":0,"external_links":0,"defined_names":6,"comments":1,"pivot_tables":0},"unopened":[],"bounds":{"document_bytes":16777216,"sheet_cells":100000,"run_cost":"one","rows_first":2000,"rows_last":500,"rows_between":2000,"halvings":0,"cell_chars":16384,"cell_head_chars":4096},"cells_cut":0,"cells_raw":0,"read":"whole","date_system":"1900"}

{"sheet":"ORÇAMENTO","index":0,"n_rows":39,"n_cols":9,"rows_kept":39,"cut":false,"hidden":false,"merged":[[38,1,38,2],[0,0,7,0],[0,2,0,8],[1,2,1,8],[2,2,2,8],[4,2,4,8],[5,6,5,7],[6,1,6,2],[6,6,6,7],[20,6,20,7]]}
["<---- NUMERAR SERVIÇOS PARA CPU",null,"Ministério do Desenvolvimento Regional"]
[null,null,"Companhia de Desenvolvimento dos Vales do São Francisco e do Parnaíba"]
[null,null,"1ª Superintendência Regional"]
[]
[null,"OBRA: "," PAVIMENTAÇÃO ASFÁLTICA EM CBUQ –  SAÍDA PARA COMUNIDADE DE SUCURIU DE BAIXO  - ITEM 03 - (MORADA NOVA DE MINAS / MG)"]
[null,"DATA:"," AGOSTO / 2023   ",null,null,null,"BDI Serviços:",null,{"$f":"'BDI SERV'!D31/100","v":0.22219999999999998}]
[null,"PRAZO DE EXECUÇÃO:     120 DIAS",{"$nulls":4},"BDI Serviços:",null,{"$f":"'BDI FORN'!D31/100","v":0.15}]
[null,"ITEM","DISCRIMINAÇÃO","REFER.","UNID.","QUANT.","P. UNITÁRIO","P.UNIT.C/ BDI","P. TOTAL"]
["A",1,"SERVIÇOS PRELIMINARES ",{"$nulls":5},{"$f":"SUM(I10:I16)","v":91125.810000000012}]
[1,"1.1","MOBILIZAÇÃO E DESMOBILIZAÇÃO","CPU.1","GL",1,{"$f":"VLOOKUP(A10,CPU!$A$1:$N$4656,9)","v":11856.48},{"$f":"VLOOKUP(A10,CPU!$A$1:$N$4656,10)","v":14490.99},{"$f":"ROUND(F10*H10,2)","v":14490.99}]
[2,"1.2","ADMINISTRAÇÃO LOCAL","CPU.2","GL",1,{"$f":"VLOOKUP(A11,CPU!$A$1:$N$4656,9)","v":46517.68},{"$f":"VLOOKUP(A11,CPU!$A$1:$N$4656,10)","v":56853.91},{"$f":"ROUND(F11*H11,2)","v":56853.91}]
[3,"1.3","CANTEIRO DE OBRAS","CPU.3","GL",1,{"$f":"VLOOKUP(A12,CPU!$A$1:$N$4656,9)","v":9957},{"$f":"VLOOKUP(A12,CPU!$A$1:$N$4656,10)","v":12169.45},{"$f":"ROUND(F12*H12,2)","v":12169.45}]
[4,"1.4","PLACA DE OBRA EM CHAPA DE AÇO GALVANIZADO",103689,"M2",3,{"$f":"VLOOKUP(A13,CPU!$A$1:$N$4656,9)","v":339.72},{"$f":"VLOOKUP(A13,CPU!$A$1:$N$4656,10)","v":415.21},{"$f":"ROUND(F13*H13,2)","v":1245.6300000000001}]
[5,"1.5","SERVIÇOS TOPOGRÁFICOS PARA PAVIMENTAÇÃO, INCLUSIVE NOTA DE SERVIÇO, ACOMPANHAMENTO E GREIDE",78472,"M2",7099.9970000000003,{"$f":"VLOOKUP(A14,CPU!$A$1:$N$4656,9)","v":0.32999999999999996},{"$f":"VLOOKUP(A14,CPU!$A$1:$N$4656,10)","v":0.4},{"$f":"ROUND(F14*H14,2)","v":2840}]
["5.1","1.6","DESMATAMENTO, DESTOCAMENTO, LIMPEZA DE ÁREA E ESTOCAGEM DO MATERIAL DE LIMPEZA COM ARVORES DE DIÂMETRO ATÉ 0,15M",5501700,"M2",3000,{"$f":"VLOOKUP(A15,CPU!$A$1:$N$4656,9)","v":0.17700973964551081},{"$f":"VLOOKUP(A15,CPU!$A$1:$N$4656,10)","v":0.21634130379474331},{"$f":"ROUND(F15*H15,2)","v":649.02}]
["5.2","1.7","DESTOCAMENTO DE ÁRVORES COM DIAMETRO DE 0,15M a 0,30M",5501701,"UNID",180,{"$f":"VLOOKUP(A16,CPU!$A$1:$N$4656,9)","v":13.076626506024095},{"$f":"VLOOKUP(A16,CPU!$A$1:$N$4656,10)","v":15.982252915662649},2876.81]
["B",2,"PAVIMENTAÇÃO",{"$nulls":5},{"$f":"SUM(I18:I25)","v":133600.79999999999}]
[6,"2.1","ESCAVAÇÃO HORIZONTAL EM SOLO DE 1A CATEGORIA ",101116,"M3",3000.0008000000003,{"$f":"VLOOKUP(A18,CPU!$A$1:$N$4656,9)","v":2.0300000000000002},{"$f":"VLOOKUP(A18,CPU!$A$1:$N$4656,10)","v":2.48},{"$f":"ROUND(F18*H18,2)","v":7440}]
[7,"2.2","CARGA, MANOBRA E DESCARGA DE SOLOS E MATERIAIS GRANULARES EM CAMINHÃO BASCULANTE",100976,"M3",3000.0008000000003,{"$f":"VLOOKUP(A19,CPU!$A$1:$N$4656,9)","v":7.99},{"$f":"VLOOKUP(A19,CPU!$A$1:$N$4656,10)","v":9.77},29310.01]
[8,"2.3","REGULARIZAÇÃO E COMPACTAÇÃO DO SUBLEITO ",100577,"M2",7000,{"$f":"VLOOKUP(A20,CPU!$A$1:$N$4656,9)","v":1.1299999999999999},{"$f":"VLOOKUP(A20,CPU!$A$1:$N$4656,10)","v":1.38},9660]
[null,"2.4","CASCALHO DE CAVA - EXCLUSIVE TRANSPORTE","-","M3",1450,"FORNECIDO PELA PREFEITURA",null,"-"]
[9,"2.5","EXECUÇÃO E COMPACTAÇÃO DE BASE E OU SUB BASE PARA PAVIMENTAÇÃO EM CASCALHO - EXCLUSIVE SOLO, ESCAVAÇÃO, CARGA E TRANSPORTE.",96388,"M3",1449.998,{"$f":"VLOOKUP(A22,CPU!$A$1:$N$4656,9)","v":12.99},{"$f":"VLOOKUP(A22,CPU!$A$1:$N$4656,10)","v":15.88},23025.97]
[10,"2.6","IMPRIMAÇÃO COM EMULSÃO ASFÁLTICA (EAI)",96401,"M2",7000,{"$f":"VLOOKUP(A23,CPU!$A$1:$N$4656,9)","v":1.1200000000000001},{"$f":"VLOOKUP(A23,CPU!$A$1:$N$4656,10)","v":1.37},9590]
[11,"2.7","PINTURA DE LIGAÇÃO COM EMULSÃO ASFÁLTICA RR-1C",96402,"M2",6250,{"$f":"VLOOKUP(A24,CPU!$A$1:$N$4656,9)","v":0.93000000000000016},{"$f":"VLOOKUP(A24,CPU!$A$1:$N$4656,10)","v":1.1399999999999999},7125]
[12,"2.8","EXECUÇÃO DE PAVIMENTO COM APLICAÇÃO DE CONCRETO ASFÁLTICO USINADO A QUENTE (CBUQ), CAMADA DE ROLAMENTO - EXCLUSIVE TRANSPORTE",95995,"M3",320.00150000000002,{"$f":"VLOOKUP(A25,CPU!$A$1:$N$4656,9)","v":121.32},{"$f":"VLOOKUP(A25,CPU!$A$1:$N$4656,10)","v":148.28},47449.82]
["C",3,"TRANSPORTE DE MATERIAIS",{"$nulls":5},{"$f":"SUM(I27:I28)","v":87103.01999999999}]
[13,"3.1","TRANSPORTE COM CAMINHÃO BASCULANTE, EM VIA URBANA PAVIMENTADA",95877,"M3XKM",44000.004350000003,{"$f":"VLOOKUP(A27,CPU!$A$1:$N$4656,9)","v":1.6099999999999999},{"$f":"VLOOKUP(A27,CPU!$A$1:$N$4656,10)","v":1.97},{"$f":"ROUND(F27*H27,2)","v":86680.01}]
[14,"3.2","TRANSPORTE COM CAMINHÃO CARROCERIA 9T, EM VIA URBANA PAVIMENTADA",100947,"TXKM",180.00353296000003,{"$f":"VLOOKUP(A28,CPU!$A$1:$N$4656,9)","v":1.92},{"$f":"VLOOKUP(A28,CPU!$A$1:$N$4656,10)","v":2.35},{"$f":"ROUND(F28*H28,2)","v":423.01}]
["D",4,"TRANSPORTE DE MATERIAL ASFÁLTICO (BDI DIFERENCIADO)",{"$nulls":5},{"$f":"SUM(I30:I31)","v":109890}]
[15,"4.1","TRANSPORTE DE MASSA ASFÁLTICA COM CAMINHÃO BASCULANTE, EM VIA URBANA PAVIMENTADA (BDI DIFERENCIADO)",95427,"TXKM",144000,{"$f":"VLOOKUP(A30,CPU!$A$1:$N$4656,9)","v":0.64999999999999991},{"$f":"VLOOKUP(A30,CPU!$A$1:$N$4656,10)","v":0.75},{"$f":"ROUND(F30*H30,2)","v":108000}]
[16,"4.2","TRANSPORTE COM CAMINHÃO TANQUE DE TRANSPORTE DE MATERIAL ASFÁLTICO DE 30000 L, EM VIA URBANA PAVIMENTADA (BDI DIFERENCIADO)",102331,"TXKM",3500.0000000000005,{"$f":"VLOOKUP(A31,CPU!$A$1:$N$4656,9)","v":0.47},{"$f":"VLOOKUP(A31,CPU!$A$1:$N$4656,10)","v":0.54},{"$f":"ROUND(F31*H31,2)","v":1890}]
["E",5,"OBRAS COMPLEMENTARES",{"$nulls":5},{"$f":"SUM(I33:I34)","v":106608}]
[17,"5.1","GUIA (MEIO-FIO) E SARJETA CONJUGADOS DE CONCRETO, MOLDADA  IN LOCO  EM TRECHO RETO COM EXTRUSORA, 45 CM BASE (15 CM BASE DA GUIA + SARJETA (30 X 0,05))X 22 CM ALTURA","94267a","M",1450,{"$f":"VLOOKUP(A33,CPU!$A$1:$N$4656,9)","v":47.91},{"$f":"VLOOKUP(A33,CPU!$A$1:$N$4656,10)","v":58.56},{"$f":"ROUND(F33*H33,2)","v":84912}]
[18,"5.2","PINTURA DE EIXO VIÁRIO SOBRE ASFALTO COM TINTA RETRORREFLETIVA A BASE DE RESINA ACRÍLICA COM MICROESFERAS DE VIDRO, APLICAÇÃO MECÂNICA COM DEMARCADORA AUTOPROPELIDA - ESPESSURA DE 0,10 MM",102512,"M",3200,{"$f":"VLOOKUP(A34,CPU!$A$1:$N$4656,9)","v":5.5500000000000007},{"$f":"VLOOKUP(A34,CPU!$A$1:$N$4656,10)","v":6.78},21696]
["F",6,"FORNECIMENTOS - MATERIAL ASFÁLTICO (BDI DIFERENCIADO)",{"$nulls":5},{"$f":"SUM(I36:I38)","v":595258.77}]
[19,"6.1","AQUISIÇÃO DE EMULSÃO ASFÁLTICA PARA IMPRIMAÇÃO (EAI) - EXCLUSIVE TRANSPORTE","CPU.4","T",10,{"$f":"VLOOKUP(A36,CPU!$A$1:$N$4656,9)","v":2769.65},{"$f":"VLOOKUP(A36,CPU!$A$1:$N$4656,10)","v":3185.1},{"$f":"ROUND(F36*H36,2)","v":31851}]
[20,"6.2","AQUISIÇÃO DE EMULSAO ASFALTICA CATIONICA RR-1C - EXCLUSIVE TRANSPORTE","CPU.5","T",3.0024999999999999,{"$f":"VLOOKUP(A37,CPU!$A$1:$N$4656,9)","v":2837.6},{"$f":"VLOOKUP(A37,CPU!$A$1:$N$4656,10)","v":3263.24},{"$f":"ROUND(F37*H37,2)","v":9797.8799999999992}]
[21,"6.3","AQUISIÇÃO DE CONCRETO BETUMINOSO USINADO A QUENTE (CBUQ) PARA PAVIMENTACAO ASFALTICA, PADRAO DNIT, FAIXA C, COM CAP 50/70 - EXCLUSIVE TRANSPORTE","CPU.6","T",829.99983220000013,{"$f":"VLOOKUP(A38,CPU!$A$1:$N$4656,9)","v":580},{"$f":"VLOOKUP(A38,CPU!$A$1:$N$4656,10)","v":667},{"$f":"ROUND(F38*H38,2)","v":553609.89}]
[null,"TOTAL GERAL DA OBRA COM BDI ",{"$nulls":6},{"$f":"SUM(I9,I17,I26,I32,I35,I29)","v":1123586.3999999999}]

{"sheet":"CPU","index":1,"n_rows":353,"n_cols":13,"rows_kept":353,"cut":false,"hidden":false,"merged":[[93,1,93,6],[81,0,94,0],[95,0,108,0],[95,1,95,3],[95,4,95,7],[96,2,96,5],[97,2,97,3],[98,1,98,7],[104,1,104,3],[104,5,104,6],[105,1,105,6],[106,1,106,6],[107,1,107,6],[81,1,81,3],[81,4,81,7],[82,2,82,5],[83,2,83,3],[84,1,84,7],[90,1,90,3],[90,5,90,6],[91,1,91,6],[92,1,92,6],[0,0,13,0],[0,1,0,3],[0,4,0,7],[0,10,0,11],[1,2,1,5],[1,10,1,11],[2,2,2,3],[3,1,3,7],[9,1,9,3],[9,5,9,6],[10,1,10,6],[11,1,11,6],[12,1,12,6],[4,11,4,12],[14,0,32,0],[14,1,14,3],[14,4,14,7],[14,10,14,11],[15,2,15,5],[15,8,16,9],[16,2,16,3],[17,1,17,7],[28,1,28,3],[28,5,28,6],[29,1,29,6],[30,1,30,6],[31,1,31,6],[33,0,46,0],[33,1,33,3],[33,4,33,7],[33,10,33,11],[34,2,34,5],[34,8,35,9],[35,2,35,3],[36,1,36,7],[42,1,42,3],[42,5,42,6],[43,1,43,6],[44,1,44,6],[45,1,45,6],[47,0,64,0],[47,1,47,3],[47,4,47,7],[47,10,47,11],[48,2,48,5],[49,2,49,3],[50,1,50,7],[60,1,60,3],[60,5,60,6],[61,1,61,6],[62,1,62,6],[63,1,63,6],[65,0,80,0],[65,1,65,3],[65,4,65,7],[65,10,65,11],[66,2,66,5],[67,2,67,3],[68,1,68,7],[76,1,76,3],[76,5,76,6],[77,1,77,6],[78,1,78,6],[79,1,79,6],[109,0,121,0],[109,1,109,3],[109,4,109,7],[109,10,109,11],[110,2,110,5],[111,2,111,3],[112,1,112,7],[117,1,117,3],[117,5,117,6],[118,1,118,6],[119,1,119,6],[120,1,120,6],[122,0,134,0],[122,1,122,3],[122,4,122,7],[123,2,123,5],[124,2,124,3],[125,1,125,7],[131,1,131,3],[131,5,131,6],[132,1,132,6],[133,1,133,6],[134,1,134,6],[136,0,153,0],[136,1,136,3],[136,4,136,7],[136,10,136,11],[137,2,137,5],[138,2,138,3],[139,1,139,7],[149,1,149,3],[149,5,149,6],[150,1,150,6],[151,1,151,6],[152,1,152,6],[154,0,171,0],[154,1,154,3],[154,4,154,7],[155,2,155,5],[156,2,156,3],[157,1,157,7],[168,1,168,3],[168,5,168,6],[169,1,169,6],[170,1,170,6],[171,1,171,6],[173,0,191,0],[173,1,173,3],[173,4,173,7],[173,10,173,11],[174,2,174,5],[175,2,175,3],[176,1,176,7],[187,1,187,3],[187,5,187,6],[188,1,188,6],[189,1,189,6],[190,1,190,6],[192,0,210,0],[192,1,192,3],[192,4,192,7],[192,10,192,11],[193,2,193,5],[194,2,194,3],[195,1,195,7],[206,1,206,3],[206,5,206,6],[207,1,207,6],[208,1,208,6],[209,1,209,6],[211,0,232,0],[211,1,211,3],[211,4,211,7],[211,10,211,11],[212,2,212,5],[213,2,213,3],[214,1,214,7],[228,1,228,3],[228,5,228,6],[229,1,229,6],[230,1,230,6],[231,1,231,6],[233,0,244,0],[233,1,233,3],[233,4,233,7],[233,10,233,11],[234,2,234,5],[235,2,235,3],[236,1,236,7],[241,1,241,3],[241,5,241,6],[242,1,242,6],[243,1,243,6],[244,1,244,6],[246,0,257,0],[246,1,246,3],[246,4,246,7],[247,2,247,5],[248,2,248,3],[249,1,249,7],[254,1,254,3],[254,5,254,6],[255,1,255,6],[256,1,256,6],[257,1,257,6],[259,0,270,0],[259,1,259,3],[259,4,259,7],[260,2,260,5],[261,2,261,3],[262,1,262,7],[267,1,267,3],[267,5,267,6],[268,1,268,6],[269,1,269,6],[270,1,270,6],[272,0,283,0],[272,1,272,3],[272,4,272,7],[272,10,272,11],[273,2,273,5],[274,2,274,3],[275,1,275,7],[279,1,279,3],[279,5,279,6],[280,1,280,6],[281,1,281,6],[282,1,282,6],[284,0,301,0],[284,1,284,3],[284,4,284,7],[284,10,284,11],[285,2,285,5],[286,2,286,3],[287,1,287,7],[289,12,297,15],[298,1,298,3],[298,5,298,6],[299,1,299,6],[300,1,300,6],[301,1,301,6],[289,9,289,10],[303,0,319,0],[303,1,303,3],[303,4,303,7],[304,2,304,5],[305,2,305,3],[306,1,306,7],[316,1,316,3],[316,5,316,6],[317,1,317,6],[318,1,318,6],[319,1,319,6],[321,0,330,0],[321,1,321,3],[321,4,321,7],[322,2,322,5],[323,2,323,3],[324,1,324,7],[327,1,327,3],[327,5,327,6],[328,1,328,6],[329,1,329,6],[330,1,330,6],[332,0,341,0],[332,1,332,3],[332,4,332,7],[333,2,333,5],[334,2,334,3],[335,1,335,7],[338,1,338,3],[338,5,338,6],[339,1,339,6],[340,1,340,6],[341,1,341,6],[343,0,352,0],[343,1,343,3],[343,4,343,7],[344,2,344,5],[345,2,345,3],[346,1,346,7],[349,1,349,3],[349,5,349,6],[350,1,350,6],[351,1,351,6],[352,1,352,6]]}
[1,"CODEVASF",null,null," COMPOSIÇÃO DE PREÇO UNITÁRIO",null,null,null,{"$f":"H11","v":11856.48},{"$f":"H13","v":14490.99},"BDI CALCULADO:",null,{"$f":"ORÇAMENTO!I6","v":0.22219999999999998}]
[null,"OBRA:  ",{"$f":"ORÇAMENTO!C5","v":" PAVIMENTAÇÃO ASFÁLTICA EM CBUQ –  SAÍDA PARA COMUNIDADE DE SUCURIU DE BAIXO  - ITEM 03 - (MORADA NOVA DE MINAS / MG)"},null,null,null,"DATA: ",{"$f":"ORÇAMENTO!C6","v":" AGOSTO / 2023   "},null,null,"BDI DIFERENCIADO:",null,{"$f":"'BDI FORN'!D31/100","v":0.15}]
[null,"SERVIÇO:  ",{"$f":"VLOOKUP(A1,ORÇAMENTO!A10:I33,3)","v":"MOBILIZAÇÃO E DESMOBILIZAÇÃO"},null,"Referência:",{"$f":"VLOOKUP(A1,ORÇAMENTO!$A$10:$I$33,4)","v":"CPU.1"},"UNIDADE: ",{"$f":"VLOOKUP(A1,ORÇAMENTO!A10:I33,5)","v":"GL"}]
[]
[null,"TIPO ITEM","CODIGO ITEM","DESCRIÇÃO ITEM","UNIDADE ITEM","COEFICIENTE","PRECO UNITARIO","CUSTO TOTAL"]
[null,"COMPOSICAO",89876,"CAMINHÃO BASCULANTE 14 M3, COM CAVALO MECÂNICO DE CAPACIDADE MÁXIMA DE TRAÇÃO COMBINADO DE 36000 KG, POTÊNCIA 286 CV, INCLUSIVE SEMIREBOQUE COM CAÇAMBA METÁLICA","CHP DIURNO.",8,286.2,{"$f":"ROUNDDOWN(F6*G6,2)","v":2289.6}]
[null,"COMPOSICAO",89877,"CAMINHÃO BASCULANTE 14 M3, COM CAVALO MECÂNICO DE CAPACIDADE MÁXIMA DE TRAÇÃO COMBINADO DE 36000 KG, POTÊNCIA 286 CV, INCLUSIVE SEMIREBOQUE COM CAÇAMBA METÁLICA","CHI DIURNO.",8,82.81,{"$f":"ROUNDDOWN(F7*G7,2)","v":662.48}]
[null,"COMPOSICAO",5914640,"TRANSPORTE COM CAVALO MECÂNICO COM SEMIRREBOQUE COM CAPACIDADE DE 30 T - RODOVIA PAVIMENTADA","T.KM",4112,0.56999999999999995,{"$f":"ROUNDDOWN(F8*G8,2)","v":2343.84}]
[null,"COMPOSIÇÃO",88316,"SERVENTE COM ENCARGOS COMPLEMENTARES","H",32,19.760000000000002,{"$f":"ROUNDDOWN(F9*G9,2)","v":632.32000000000005}]
[null,"PRODUÇÃO DA EQUIPE",null,null,0.5,"CUSTO ",null,{"$f":"SUM(H6:H9)","v":5928.24}]
[null,"TOTAL",{"$nulls":5},{"$f":"H10/E10","v":11856.48},"OK"]
[null,"BDI                %",{"$nulls":5},{"$f":"1+$M$1","v":1.2222}]
[null,"TOTAL DO SERVIÇO - R$",{"$nulls":5},{"$f":"ROUND(H11*H12,2)","v":14490.99}]
[]
[2,"CODEVASF",null,null," COMPOSIÇÃO DE PREÇO UNITÁRIO",null,null,null,{"$f":"H30","v":46517.68},{"$f":"H32","v":56853.91}]
[null,"OBRA:  ",{"$f":"$C$2","v":" PAVIMENTAÇÃO ASFÁLTICA EM CBUQ –  SAÍDA PARA COMUNIDADE DE SUCURIU DE BAIXO  - ITEM 03 - (MORADA NOVA DE MINAS / MG)"},null,null,null,"DATA: ",{"$f":"$H$2","v":" AGOSTO / 2023   "}]
[null,"SERVIÇO:  ",{"$f":"VLOOKUP(A15,ORÇAMENTO!$A$10:$I$33,3)","v":"ADMINISTRAÇÃO LOCAL"},null,"SINAPI",{"$f":"VLOOKUP(A15,ORÇAMENTO!$A$10:$I$33,4)","v":"CPU.2"},"UNIDADE: ",{"$f":"VLOOKUP(A15,ORÇAMENTO!$A$10:$I$33,5)","v":"GL"}]
[]
[null,"TIPO ITEM","CODIGO ITEM","DESCRIÇÃO ITEM","UNIDADE ITEM","COEFICIENTE","PRECO UNITARIO","CUSTO TOTAL"]
[null,"INSUMO",14250,"ENERGIA ELÉTRICA","kwh",40,0.95,{"$f":"ROUNDDOWN(F20*G20,2)","v":38}]
[null,"INSUMO",44480,"TARIFA \"A\" - ÁGUA/ESGOTO ","m³",{"$f":"6","v":6},17.97,107.82]
[null,"COTAÇÃO","MERC.","TELEFONE (PLANO CONTROLE)","UNID",2,59.9,119.8]
[null,"INSUMO","ED-50155 SEINFRA","BANHEIRO QUÍMICO 110 X 120 X 230 CM COM MANUTENÇÃO (CONSIDERANDO OBRAS SIMULTÂNEAS)","MÊS",2,515,1030]
[null,"COMPOSICAO",90777,"Engenheiro Civil Júnior com encargos complementares","H",30,114.12,3423.6]
[null,"COMPOSICAO",90776,"Encarregado Geral com encargos complementares","H",60,57.73,3463.8]
[null,"COMPOSICAO",88321,"Tecnico de Laboratório com encargos complementares","H",30,45.45,1363.5]
[null,"COMPOSICAO",100309,"Tecnico em Segurança do Trabalho com encargos complementares","H",30,45.71,{"$f":"ROUNDDOWN(F27*G27,2)","v":1371.3}]
[null,"COMPOSICAO",90772,"Auxiliar de escritório com encargos complementares","H",30,23.72,711.6]
[null,"PRODUÇÃO DA EQUIPE",null,null,{"$f":"1/4","v":0.25},"CUSTO ",null,{"$f":"SUM(H20:H28)","v":11629.42}]
[null,"TOTAL",{"$nulls":5},{"$f":"ROUND(H29/E29,2)","v":46517.68},"OK"]
[null,"BDI                %",{"$nulls":5},{"$f":"1+$M$1","v":1.2222}]
[null,"TOTAL DO SERVIÇO - R$",{"$nulls":5},{"$f":"ROUND(H30*H31,2)","v":56853.91}]
[]
[{"$f":"A15+1","v":3},"CODEVASF",null,null," COMPOSIÇÃO DE PREÇO UNITÁRIO",null,null,null,{"$f":"H44","v":9957},{"$f":"H46","v":12169.45}]
[null,"OBRA:  ",{"$f":"$C$2","v":" PAVIMENTAÇÃO ASFÁLTICA EM CBUQ –  SAÍDA PARA COMUNIDADE DE SUCURIU DE BAIXO  - ITEM 03 - (MORADA NOVA DE MINAS / MG)"},null,null,null,"DATA: ",{"$f":"$H$2","v":" AGOSTO / 2023   "}]
[null,"SERVIÇO:  ",{"$f":"VLOOKUP(A34,ORÇAMENTO!$A$10:$I$33,3)","v":"CANTEIRO DE OBRAS"},null,"SINAPI",{"$f":"VLOOKUP(A34,ORÇAMENTO!$A$10:$I$33,4)","v":"CPU.3"},"UNIDADE: ",{"$f":"VLOOKUP(A34,ORÇAMENTO!$A$10:$I$33,5)","v":"GL"}]
[]
[null,"TIPO ITEM","CODIGO ITEM","DESCRIÇÃO ITEM","UNIDADE ITEM","COEFICIENTE","PRECO UNITARIO","CUSTO TOTAL"]
[null,"INSUMO",10775,"ALUGUEL DE IMÓVEL OU CONTEINER QUE ATENDA AOS REQUISITOS MÍNIMOS PARA INSTALAÇÃO DO CANTEIRO DE OBRAS","MÊS",4,"995,00",{"$f":"ROUNDDOWN(F39*G39,2)","v":3980}]
[null,"INSUMO",10779,"LOCACAO DE CONTAINER 2,30 X 4,30 M, ALT. 2,50 M, P/ SANITARIO, C/ 5 BACIAS, 1 LAVATORIO E 4 MICTORIOS","MÊS",4,1234.75,{"$f":"ROUNDDOWN(F40*G40,2)","v":4939}]
[null,"INSUMO","37525","TELA PLASTICA TECIDA LISTRADA BRANCA E LARANJA, TIPO GUARDA CORPO, EM POLIETILENO MONOFILADO, ROLO 1,20 X 50 M (L X C)","M",200,3.69,{"$f":"ROUNDDOWN(F41*G41,2)","v":738}]
[null,"COMPOSICAO"," - ","PLACA DE SINALIZAÇÃO - \"PERIGO - OBRAS A FRENTE\" - FORNECIMENTO E MOVIMENTAÇÃO","UNID.",15,20,{"$f":"ROUNDDOWN(F42*G42,2)","v":300}]
[null,"PRODUÇÃO DA EQUIPE",null,null,1,"CUSTO ",null,{"$f":"SUM(H39:H42)","v":9957}]
[null,"TOTAL",{"$nulls":5},{"$f":"H43/E43","v":9957},"OK"]
[null,"BDI                %",{"$nulls":5},{"$f":"1+$M$1","v":1.2222}]
[null,"TOTAL DO SERVIÇO - R$",{"$nulls":5},{"$f":"ROUND(H44*H45,2)","v":12169.45}]
[]
[{"$f":"A34+1","v":4},"CODEVASF",null,null," COMPOSIÇÃO DE PREÇO UNITÁRIO",null,null,null,{"$f":"H62","v":339.72},{"$f":"H64","v":415.21}]
[null,"OBRA:  ",{"$f":"$C$2","v":" PAVIMENTAÇÃO ASFÁLTICA EM CBUQ –  SAÍDA PARA COMUNIDADE DE SUCURIU DE BAIXO  - ITEM 03 - (MORADA NOVA DE MINAS / MG)"},null,null,null,"DATA: ",{"$f":"$H$2","v":" AGOSTO / 2023   "}]
[null,"SERVIÇO:  ",{"$f":"VLOOKUP(A48,ORÇAMENTO!$A$10:$I$33,3)","v":"PLACA DE OBRA EM CHAPA DE AÇO GALVANIZADO"},null,"SINAPI",{"$f":"VLOOKUP(A48,ORÇAMENTO!$A$10:$I$33,4)","v":103689},"UNIDADE: ",{"$f":"VLOOKUP(A48,ORÇAMENTO!$A$10:$I$33,5)","v":"M2"}]
[]
[null,"TIPO ITEM","CODIGO ITEM","DESCRIÇÃO ITEM","UNIDADE ITEM","COEFICIENTE","PRECO UNITARIO","CUSTO TOTAL"]
[null,"INSUMO","4509","SARRAFO *2,5 X 10* CM EM PINUS, MISTA OU EQUIVALENTE DA REGIAO - BRUTA","M","3,2083000","4,41",{"$f":"ROUNDDOWN(F53*G53,2)","v":14.14}]
[null,"INSUMO","4813","PLACA DE OBRA (PARA CONSTRUCAO CIVIL) EM CHAPA GALVANIZADA *N. 22*, ADESIVADA, DE *2,4 X 1,2* M ","M2","1,0000000","250,00",250]
[null,"INSUMO",4115,"MADEIRA ROLICA TRATADA, D = 12 A 15 CM, EM EUCALIPTO OU EQUIVALENTE DA REGIAO","M",2,21.37,42.74]
[null,"INSUMO","5065","PREGO DE ACO POLIDO COM CABECA 10 X 10 (7/8 X 17)","KG","0,0113000","36,57",0.41]
[null,"INSUMO","5069","PREGO DE ACO POLIDO COM CABECA 17 X 27 (2 1/2 X 11)","KG","0,0132000",19.59,0.25]
[null,"COMPOSICAO","88262","CARPINTEIRO DE FORMAS COM ENCARGOS COMPLEMENTARES","H","0,3729000","27,05",10.08]
[null,"COMPOSICAO","88316","SERVENTE COM ENCARGOS COMPLEMENTARES","H","1,1186000","19,76",22.1]
[{"$nulls":7},0]
[null,"PRODUÇÃO DA EQUIPE",null,null,1,"CUSTO ",null,{"$f":"SUM(H53:H60)","v":339.72}]
[null,"TOTAL",{"$nulls":5},{"$f":"H61/E61","v":339.72},"OK"]
[null,"BDI                %",{"$nulls":5},{"$f":"1+$M$1","v":1.2222}]
[null,"TOTAL DO SERVIÇO - R$",{"$nulls":5},{"$f":"ROUND(H62*H63,2)","v":415.21}]
[]
[{"$f":"A48+1","v":5},"CODEVASF",null,null," COMPOSIÇÃO DE PREÇO UNITÁRIO",null,null,null,{"$f":"H78","v":0.32999999999999996},{"$f":"H80","v":0.4}]
[null,"OBRA:  ",{"$f":"$C$2","v":" PAVIMENTAÇÃO ASFÁLTICA EM CBUQ –  SAÍDA PARA COMUNIDADE DE SUCURIU DE BAIXO  - ITEM 03 - (MORADA NOVA DE MINAS / MG)"},null,null,null,"DATA: ",{"$f":"$H$2","v":" AGOSTO / 2023   "}]
[null,"SERVIÇO:  ",{"$f":"VLOOKUP(A66,ORÇAMENTO!$A$10:$I$33,3)","v":"SERVIÇOS TOPOGRÁFICOS PARA PAVIMENTAÇÃO, INCLUSIVE NOTA DE SERVIÇO, ACOMPANHAMENTO E GREIDE"},null,"SINAPI",{"$f":"VLOOKUP(A66,ORÇAMENTO!$A$10:$I$33,4)","v":78472},"UNIDADE: ",{"$f":"VLOOKUP(A66,ORÇAMENTO!$A$10:$I$33,5)","v":"M2"}]
[]
[null,"TIPO ITEM","CODIGO ITEM","DESCRIÇÃO ITEM","UNIDADE ITEM","COEFICIENTE","PRECO UNITARIO","CUSTO TOTAL"]
[null,"COMPOSICAO",88253,"AUXILIAR DE TOPÓGRAFO COM ENCARGOS COMPLEMENTARES","H",2.5000000000000001E-3,21.57,{"$f":"ROUNDDOWN(F71*G71,2)","v":0.05}]
[null,"COMPOSICAO",88288,"NIVELADOR COM ENCARGOS COMPLEMENTARES","H",2.5000000000000001E-3,26.99,0.06]
[null,"COMPOSICAO",88316,"SERVENTE COM ENCARGOS COMPLEMENTARES","H",7.4999999999999997E-3,19.760000000000002,0.14000000000000001]
[null,"COMPOSICAO",88597,"DESENHISTA DETALHISTA COM ENCARGOS COMPLEMENTARES ","H",2E-3,29.72,0.05]
[null,"COMPOSICAO",92145,"CAMINHONETE CABINE SIMPLES COM MOTOR 1.6 FLEX, CÂMBIO MANUAL, POTÊNCIA 101/104 CV, 2 PORTAS","CHP",5.0000000000000001E-4,72.790000000000006,0.03]
[{"$nulls":7},0]
[null,"PRODUÇÃO DA EQUIPE",null,null,1,"CUSTO ",null,{"$f":"SUM(H71:H76)","v":0.32999999999999996}]
[null,"TOTAL",{"$nulls":5},{"$f":"H77/E77","v":0.32999999999999996},"OK"]
[null,"BDI                %",{"$nulls":5},{"$f":"1+$M$1","v":1.2222}]
[null,"TOTAL DO SERVIÇO - R$",{"$nulls":5},{"$f":"ROUND(H78*H79,2)","v":0.4}]
[]
["5.1","CODEVASF",null,null," COMPOSIÇÃO DE PREÇO UNITÁRIO",null,null,null,{"$f":"H92","v":0.17700973964551081},{"$f":"H94","v":0.21634130379474331}]
[null,"OBRA:  ",{"$f":"$C$2","v":" PAVIMENTAÇÃO ASFÁLTICA EM CBUQ –  SAÍDA PARA COMUNIDADE DE SUCURIU DE BAIXO  - ITEM 03 - (MORADA NOVA DE MINAS / MG)"},null,null,null,"DATA: ",{"$f":"$H$2","v":" AGOSTO / 2023   "}]
[null,"SERVIÇO:  ",{"$f":"VLOOKUP(A82,ORÇAMENTO!$A$10:$I$33,3)","v":"DESMATAMENTO, DESTOCAMENTO, LIMPEZA DE ÁREA E ESTOCAGEM DO MATERIAL DE LIMPEZA COM ARVORES DE DIÂMETRO ATÉ 0,15M"},null,"SICRO",{"$f":"VLOOKUP(A82,ORÇAMENTO!$A$10:$I$33,4)","v":5501700},"UNIDADE: ",{"$f":"VLOOKUP(A82,ORÇAMENTO!$A$10:$I$33,5)","v":"M2"}]
[]
[null,"TIPO ITEM","CODIGO ITEM","DESCRIÇÃO ITEM","UNIDADE ITEM","COEFICIENTE","PRECO UNITARIO","CUSTO TOTAL"]
[null,"COMPOSICAO","5847","TRATOR DE ESTEIRAS, POTÊNCIA 170 HP, PESO OPERACIONAL 19 T, CAÇAMBA 5,2 M3","CHP",1,231.82,{"$f":"ROUNDDOWN(F87*G87,2)","v":231.82}]
[null,"COMPOSICAO","5849","TRATOR DE ESTEIRAS, POTÊNCIA 170 HP, PESO OPERACIONAL 19 T, CAÇAMBA 5,2 M3","CHI",0,82.14,0]
[null,"COMPOSICAO","88316","SERVENTE COM ENCARGOS COMPLEMENTARES","H",2,"19,76",39.520000000000003]
[{"$nulls":7},0]
[null,"PRODUÇÃO DA EQUIPE",null,null,1532.91,"CUSTO ",null,{"$f":"SUM(H87:H90)","v":271.33999999999997}]
[null,"TOTAL",{"$nulls":5},{"$f":"H91/E91","v":0.17700973964551081}]
[null,"BDI                %",{"$nulls":5},{"$f":"1+$M$1","v":1.2222}]
[null,"TOTAL DO SERVIÇO - R$",{"$nulls":5},{"$f":"H92*H93","v":0.21634130379474331}]
[]
["5.2","CODEVASF",null,null," COMPOSIÇÃO DE PREÇO UNITÁRIO",null,null,null,{"$f":"H106","v":13.076626506024095},{"$f":"H108","v":15.982252915662649}]
[null,"OBRA:  ",{"$f":"$C$2","v":" PAVIMENTAÇÃO ASFÁLTICA EM CBUQ –  SAÍDA PARA COMUNIDADE DE SUCURIU DE BAIXO  - ITEM 03 - (MORADA NOVA DE MINAS / MG)"},null,null,null,"DATA: ",{"$f":"$H$2","v":" AGOSTO / 2023   "}]
[null,"SERVIÇO:  ",{"$f":"VLOOKUP(A96,ORÇAMENTO!$A$10:$I$33,3)","v":"DESTOCAMENTO DE ÁRVORES COM DIAMETRO DE 0,15M a 0,30M"},null,"SICRO",{"$f":"VLOOKUP(A96,ORÇAMENTO!$A$10:$I$33,4)","v":5501701},"UNIDADE: ",{"$f":"VLOOKUP(A96,ORÇAMENTO!$A$10:$I$33,5)","v":"UNID"}]
[]
[null,"TIPO ITEM","CODIGO ITEM","DESCRIÇÃO ITEM","UNIDADE ITEM","COEFICIENTE","PRECO UNITARIO","CUSTO TOTAL"]
[null,"COMPOSICAO","5847","TRATOR DE ESTEIRAS, POTÊNCIA 170 HP, PESO OPERACIONAL 19 T, CAÇAMBA 5,2 M3","CHP",1,231.82,{"$f":"ROUNDDOWN(F101*G101,2)","v":231.82}]
[null,"COMPOSICAO","5849","TRATOR DE ESTEIRAS, POTÊNCIA 170 HP, PESO OPERACIONAL 19 T, CAÇAMBA 5,2 M3","CHI",0,82.14,0]
[null,"COMPOSICAO","88316","SERVENTE COM ENCARGOS COMPLEMENTARES","H",2,"19,76",39.520000000000003]
[{"$nulls":7},0]
[null,"PRODUÇÃO DA EQUIPE",null,null,20.75,"CUSTO ",null,{"$f":"SUM(H101:H104)","v":271.33999999999997}]
[null,"TOTAL",{"$nulls":5},{"$f":"H105/E105","v":13.076626506024095}]
[null,"BDI                %",{"$nulls":5},{"$f":"1+$M$1","v":1.2222}]
[null,"TOTAL DO SERVIÇO - R$",{"$nulls":5},{"$f":"H106*H107","v":15.982252915662649}]
[]
[{"$f":"A66+1","v":6},"CODEVASF",null,null," COMPOSIÇÃO DE PREÇO UNITÁRIO",null,null,null,{"$f":"H119","v":2.0300000000000002},{"$f":"H121","v":2.48}]
[null,"OBRA:  ",{"$f":"$C$2","v":" PAVIMENTAÇÃO ASFÁLTICA EM CBUQ –  SAÍDA PARA COMUNIDADE DE SUCURIU DE BAIXO  - ITEM 03 - (MORADA NOVA DE MINAS / MG)"},null,null,null,"DATA: ",{"$f":"$H$2","v":" AGOSTO / 2023   "}]
[null,"SERVIÇO:  ",{"$f":"VLOOKUP(A110,ORÇAMENTO!$A$10:$I$33,3)","v":"ESCAVAÇÃO HORIZONTAL EM SOLO DE 1A CATEGORIA "},null,"SINAPI",{"$f":"VLOOKUP(A110,ORÇAMENTO!$A$10:$I$33,4)","v":101116},"UNIDADE: ",{"$f":"VLOOKUP(A110,ORÇAMENTO!$A$10:$I$33,5)","v":"M3"}]
[]
[null,"TIPO ITEM","CODIGO ITEM","DESCRIÇÃO ITEM","UNIDADE ITEM","COEFICIENTE","PRECO UNITARIO","CUSTO TOTAL"]
[null,"COMPOSICAO","5847","TRATOR DE ESTEIRAS, POTÊNCIA 170 HP, PESO OPERACIONAL 19 T, CAÇAMBA 5,2 M3","CHP","0,0048000",231.82,{"$f":"ROUNDDOWN(F115*G115,2)","v":1.1100000000000001}]
[null,"COMPOSICAO","5849","TRATOR DE ESTEIRAS, POTÊNCIA 170 HP, PESO OPERACIONAL 19 T, CAÇAMBA 5,2 M3","CHI","0,0082000",82.14,{"$f":"ROUNDDOWN(F116*G116,2)","v":0.67}]
[null,"COMPOSICAO","88316","SERVENTE COM ENCARGOS COMPLEMENTARES","H","0,0131000","19,76",{"$f":"ROUNDDOWN(F117*G117,2)","v":0.25}]
[null,"PRODUÇÃO DA EQUIPE",null,null,1,"CUSTO ",null,{"$f":"SUM(H115:H117)","v":2.0300000000000002}]
[null,"TOTAL",{"$nulls":5},{"$f":"H118/E118","v":2.0300000000000002},"OK"]
[null,"BDI                %",{"$nulls":5},{"$f":"1+$M$1","v":1.2222}]
[null,"TOTAL DO SERVIÇO - R$",{"$nulls":5},{"$f":"ROUND(H119*H120,2)","v":2.48}]
[]
[7,"CODEVASF",null,null," COMPOSIÇÃO DE PREÇO UNITÁRIO",null,null,null,{"$f":"H133","v":7.99},{"$f":"H135","v":9.77}]
[null,"OBRA:  ",{"$f":"$C$2","v":" PAVIMENTAÇÃO ASFÁLTICA EM CBUQ –  SAÍDA PARA COMUNIDADE DE SUCURIU DE BAIXO  - ITEM 03 - (MORADA NOVA DE MINAS / MG)"},null,null,null,"DATA: ",{"$f":"$H$2","v":" AGOSTO / 2023   "}]
[null,"SERVIÇO:  ",{"$f":"VLOOKUP(A123,ORÇAMENTO!$A$10:$I$33,3)","v":"CARGA, MANOBRA E DESCARGA DE SOLOS E MATERIAIS GRANULARES EM CAMINHÃO BASCULANTE"},null,"SINAPI",{"$f":"VLOOKUP(A123,ORÇAMENTO!$A$10:$I$33,4)","v":100976},"UNIDADE: ",{"$f":"VLOOKUP(A123,ORÇAMENTO!$A$10:$I$33,5)","v":"M3"}]
[]
[null,"TIPO ITEM","CODIGO ITEM","DESCRIÇÃO ITEM","UNIDADE ITEM","COEFICIENTE","PRECO UNITARIO","CUSTO TOTAL"]
[null,"COMPOSICAO","5940","PÁ CARREGADEIRA SOBRE RODAS, POTÊNCIA LÍQUIDA 128 HP, CAPACIDADE DA CAÇAMBA 1,7 A 2,8 M3, PESO OPERACIONAL 11632 KG","CHP","0,0083000","205,93",{"$f":"ROUNDDOWN(F128*G128,2)","v":1.7}]
[null,"COMPOSICAO","5942","PÁ CARREGADEIRA SOBRE RODAS, POTÊNCIA LÍQUIDA 128 HP, CAPACIDADE DA CAÇAMBA 1,7 A 2,8 M3, PESO OPERACIONAL 11632 KG","CHI","0,0074000","90,02",{"$f":"ROUNDDOWN(F129*G129,2)","v":0.66}]
[null,"COMPOSICAO","89883","CAMINHÃO BASCULANTE 18 M3, COM CAVALO MECÂNICO DE CAPACIDADE MÁXIMA DE TRAÇÃO COMBINADO DE 45000 KG, POTÊNCIA 330 CV, INCLUSIVE SEMIREBOQUE COM CAÇAMBA METÁLICA","CHP","0,0153000","314,64",{"$f":"ROUNDDOWN(F130*G130,2)","v":4.8099999999999996}]
[null,"COMPOSICAO","89884","CAMINHÃO BASCULANTE 18 M3, COM CAVALO MECÂNICO DE CAPACIDADE MÁXIMA DE TRAÇÃO COMBINADO DE 45000 KG, POTÊNCIA 330 CV, INCLUSIVE SEMIREBOQUE COM CAÇAMBA METÁLICA","CHI","0,0095000","86,36",{"$f":"ROUNDDOWN(F131*G131,2)","v":0.82}]
[null,"PRODUÇÃO DA EQUIPE",null,null,1,"CUSTO ",null,{"$f":"SUM(H128:H131)","v":7.99}]
[null,"TOTAL",{"$nulls":5},{"$f":"H132/E132","v":7.99},"OK"]
[null,"BDI                %",{"$nulls":5},{"$f":"1+$M$1","v":1.2222}]
[null,"TOTAL DO SERVIÇO - R$",{"$nulls":5},{"$f":"ROUND(H133*H134,2)","v":9.77}]
[]
[8,"CODEVASF",null,null," COMPOSIÇÃO DE PREÇO UNITÁRIO",null,null,null,{"$f":"H151","v":1.1299999999999999},{"$f":"H153","v":1.38}]
[null,"OBRA:  ",{"$f":"$C$2","v":" PAVIMENTAÇÃO ASFÁLTICA EM CBUQ –  SAÍDA PARA COMUNIDADE DE SUCURIU DE BAIXO  - ITEM 03 - (MORADA NOVA DE MINAS / MG)"},null,null,null,"DATA: ",{"$f":"$H$2","v":" AGOSTO / 2023   "}]
[null,"SERVIÇO:  ",{"$f":"VLOOKUP(A137,ORÇAMENTO!$A$10:$I$33,3)","v":"REGULARIZAÇÃO E COMPACTAÇÃO DO SUBLEITO "},null,"SICRO",{"$f":"VLOOKUP(A137,ORÇAMENTO!$A$10:$I$33,4)","v":100577},"UNIDADE: ","M2"]
[]
[null,"TIPO ITEM","CODIGO ITEM","DESCRIÇÃO ITEM","UNIDADE ITEM","COEFICIENTE","PRECO UNITARIO","CUSTO TOTAL"]
[null,"COMPOSICAO","5901","CAMINHÃO PIPA 10.000 L TRUCADO, PESO BRUTO TOTAL 23.000 KG, CARGA ÚTIL MÁXIMA 15.935 KG, DISTÂNCIA ENTRE EIXOS 4,8 M, POTÊNCIA 230 CV, INCLUSIVE TANQUE DE AÇO PARA TRANSPORTE DE ÁGUA","CHP","0,0010000","264,71",{"$f":"ROUNDDOWN(F142*G142,2)","v":0.26}]
[null,"COMPOSICAO","5903","CAMINHÃO PIPA 10.000 L TRUCADO, PESO BRUTO TOTAL 23.000 KG, CARGA ÚTIL MÁXIMA 15.935 KG, DISTÂNCIA ENTRE EIXOS 4,8 M, POTÊNCIA 230 CV, INCLUSIVE TANQUE DE AÇO PARA TRANSPORTE DE ÁGUA","CHI","0,0020000","67,26",0.13]
[null,"COMPOSICAO","5932","MOTONIVELADORA POTÊNCIA BÁSICA LÍQUIDA (PRIMEIRA MARCHA) 125 HP, PESO BRUTO 13032 KG, LARGURA DA LÂMINA DE 3,7 M","CHP","0,0001000","244,89",0.02]
[null,"COMPOSICAO","5934","MOTONIVELADORA POTÊNCIA BÁSICA LÍQUIDA (PRIMEIRA MARCHA) 125 HP, PESO BRUTO 13032 KG, LARGURA DA LÂMINA DE 3,7 M","CHI","0,0030000","101,62",0.3]
[null,"COMPOSICAO","88316","SERVENTE COM ENCARGOS COMPLEMENTARES","H","0,0030000","19,76",0.05]
[null,"COMPOSICAO","96463","ROLO COMPACTADOR DE PNEUS, ESTATICO, PRESSAO VARIAVEL, POTENCIA 110 HP, PESO SEM/COM LASTRO 10,8/27 T, LARGURA DE ROLAGEM 2,30 M","CHP","0,0010000","203,13",0.2]
[null,"COMPOSICAO","96464","ROLO COMPACTADOR DE PNEUS, ESTATICO, PRESSAO VARIAVEL, POTENCIA 110 HP, PESO SEM/COM LASTRO 10,8/27 T, LARGURA DE ROLAGEM 2,30 M","CHI","0,0020000","89,07",0.17]
[]
[null,"PRODUÇÃO DA EQUIPE",null,null,1,"CUSTO ",null,{"$f":"SUM(H142:H149)","v":1.1299999999999999}]
[null,"TOTAL",{"$nulls":5},{"$f":"H150/E150","v":1.1299999999999999},"OK"]
[null,"BDI                %",{"$nulls":5},{"$f":"1+$M$1","v":1.2222}]
[null,"TOTAL DO SERVIÇO - R$",{"$nulls":5},{"$f":"ROUND(H151*H152,2)","v":1.38}]
[]
[9,"CODEVASF",null,null," COMPOSIÇÃO DE PREÇO UNITÁRIO",null,null,null,{"$f":"H170","v":12.99},{"$f":"H172","v":15.88}]
[null,"OBRA:  ",{"$f":"$C$2","v":" PAVIMENTAÇÃO ASFÁLTICA EM CBUQ –  SAÍDA PARA COMUNIDADE DE SUCURIU DE BAIXO  - ITEM 03 - (MORADA NOVA DE MINAS / MG)"},null,null,null,"DATA: ",{"$f":"$H$2","v":" AGOSTO / 2023   "}]
[null,"SERVIÇO:  ",{"$f":"VLOOKUP(A155,ORÇAMENTO!$A$10:$I$33,3)","v":"EXECUÇÃO E COMPACTAÇÃO DE BASE E OU SUB BASE PARA PAVIMENTAÇÃO EM CASCALHO - EXCLUSIVE SOLO, ESCAVAÇÃO, CARGA E TRANSPORTE."},null,"SINAPI",{"$f":"VLOOKUP(A155,ORÇAMENTO!$A$10:$I$33,4)","v":96388},"UNIDADE: ",{"$f":"VLOOKUP(A155,ORÇAMENTO!$A$10:$I$33,5)","v":"M3"}]
[]
[null,"TIPO ITEM","CODIGO ITEM","DESCRIÇÃO ITEM","UNIDADE ITEM","COEFICIENTE","PRECO UNITARIO","CUSTO TOTAL"]
[null,"COMPOSICAO","5684","ROLO COMPACTADOR VIBRATÓRIO DE UM CILINDRO AÇO LISO, POTÊNCIA 80 HP, PESO OPERACIONAL MÁXIMO 8,1 T, IMPACTO DINÂMICO 16,15 / 9,5 T, LARGURA DE TRABALHO 1,68 M","CHP","0,0090000","148,46",{"$f":"ROUNDDOWN(F160*G160,2)","v":1.33}]
[null,"COMPOSICAO","5685","ROLO COMPACTADOR VIBRATÓRIO DE UM CILINDRO AÇO LISO, POTÊNCIA 80 HP, PESO OPERACIONAL MÁXIMO 8,1 T, IMPACTO DINÂMICO 16,15 / 9,5 T, LARGURA DE TRABALHO 1,68 M","CHI","0,0210000","65,46",1.37]
[null,"COMPOSICAO","5901","CAMINHÃO PIPA 10.000 L TRUCADO, PESO BRUTO TOTAL 23.000 KG, CARGA ÚTIL MÁXIMA 15.935 KG, DISTÂNCIA ENTRE EIXOS 4,8 M, POTÊNCIA 230 CV, INCLUSIVE TANQUE DE AÇO PARA TRANSPORTE DE ÁGUA","CHP","0,0020000","264,71",{"$f":"ROUNDDOWN(F162*G162,2)","v":0.52}]
[null,"COMPOSICAO","5903","CAMINHÃO PIPA 10.000 L TRUCADO, PESO BRUTO TOTAL 23.000 KG, CARGA ÚTIL MÁXIMA 15.935 KG, DISTÂNCIA ENTRE EIXOS 4,8 M, POTÊNCIA 230 CV, INCLUSIVE TANQUE DE AÇO PARA TRANSPORTE DE ÁGUA","CHI","0,0280000","67,26",1.88]
[null,"COMPOSICAO","5932","MOTONIVELADORA POTÊNCIA BÁSICA LÍQUIDA (PRIMEIRA MARCHA) 125 HP, PESO BRUTO 13032 KG, LARGURA DA LÂMINA DE 3,7 M","CHP","0,0080000","244,89",1.95]
[null,"COMPOSICAO","5934","MOTONIVELADORA POTÊNCIA BÁSICA LÍQUIDA (PRIMEIRA MARCHA) 125 HP, PESO BRUTO 13032 KG, LARGURA DA LÂMINA DE 3,7 M","CHI","0,0220000","101,62",2.23]
[null,"COMPOSICAO","88316","SERVENTE COM ENCARGOS COMPLEMENTARES","H","0,0300000","19,76",0.59]
[null,"COMPOSICAO","96463","ROLO COMPACTADOR DE PNEUS, ESTATICO, PRESSAO VARIAVEL, POTENCIA 110 HP, PESO SEM/COM LASTRO 10,8/27 T, LARGURA DE ROLAGEM 2,30 M","CHP","0,0040000","203,13",0.81]
[null,"COMPOSICAO","96464","ROLO COMPACTADOR DE PNEUS, ESTATICO, PRESSAO VARIAVEL, POTENCIA 110 HP, PESO SEM/COM LASTRO 10,8/27 T, LARGURA DE ROLAGEM 2,30 M","CHI","0,0260000","89,07",2.31]
[null,"PRODUÇÃO DA EQUIPE",null,null,1,"CUSTO ",null,{"$f":"SUM(H160:H168)","v":12.99}]
[null,"TOTAL",{"$nulls":5},{"$f":"H169/E169","v":12.99},"OK"]
[null,"BDI                %",{"$nulls":5},{"$f":"1+$M$1","v":1.2222}]
[null,"TOTAL DO SERVIÇO - R$",{"$nulls":5},{"$f":"ROUND(H170*H171,2)","v":15.88}]
[]
[10,"CODEVASF",null,null," COMPOSIÇÃO DE PREÇO UNITÁRIO",null,null,null,{"$f":"H189","v":1.1200000000000001},{"$f":"H191","v":1.37}]
[null,"OBRA:  ",{"$f":"$C$2","v":" PAVIMENTAÇÃO ASFÁLTICA EM CBUQ –  SAÍDA PARA COMUNIDADE DE SUCURIU DE BAIXO  - ITEM 03 - (MORADA NOVA DE MINAS / MG)"},null,null,null,"DATA: ",{"$f":"$H$2","v":" AGOSTO / 2023   "}]
[null,"SERVIÇO:  ",{"$f":"VLOOKUP(A174,ORÇAMENTO!$A$10:$I$33,3)","v":"IMPRIMAÇÃO COM EMULSÃO ASFÁLTICA (EAI)"},null,"SINAPI",{"$f":"VLOOKUP(A174,ORÇAMENTO!$A$10:$I$33,4)","v":96401},"UNIDADE: ",{"$f":"VLOOKUP(A174,ORÇAMENTO!$A$10:$I$33,5)","v":"M2"}]
[]
[null,"TIPO ITEM","CODIGO ITEM","DESCRIÇÃO ITEM","UNIDADE ITEM","COEFICIENTE","PRECO UNITARIO","CUSTO TOTAL"]
[null,"COMPOSICAO",5839,"VASSOURA MECÂNICA REBOCÁVEL COM ESCOVA CILÍNDRICA, LARGURA ÚTIL DE VARRIMENTO DE 2,44 M ","CHP","0,0020000",9.77,{"$f":"ROUNDDOWN(F179*G179,2)","v":0.01}]
[null,"COMPOSICAO",5841,"VASSOURA MECÂNICA REBOCÁVEL COM ESCOVA CILÍNDRICA, LARGURA ÚTIL DE VARRIMENTO DE 2,44 M ","CHI","0,0040000",4.6500000000000004,0.01]
[null,"INSUMO","ANP","EMULSÃO ASFÁLTICA PARA IMPRIMAÇÃO - EAI (FORNECIMENTO COM BDI DIFERENCIADO)","T",{"$f":"1.3/1000","v":1.2999999999999999E-3},null,0]
[null,"COMPOSICAO",83362,"ESPARGIDOR DE ASFALTO PRESSURIZADO, TANQUE 6 M3 COM ISOLAÇÃO TÉRMICA, AQUECIDO COM 2 MAÇARICOS, COM BARRA ESPARGIDORA 3,60 M, MONTADO SOBRE CAMINHÃO  TOCO, PBT 14.300 KG, POTÊNCIA 185 CV","CHP","0,0010000",232.92,0.23]
[null,"COMPOSICAO",88316,"SERVENTE COM ENCARGOS COMPLEMENTARES","H","0,0060000",19.760000000000002,0.11]
[null,"COMPOSICAO",89035,"TRATOR DE PNEUS, POTÊNCIA 85 CV, TRAÇÃO 4X4, PESO COM LASTRO DE 4.675 KG ","CHP","0,0020000",119.96,0.23]
[null,"COMPOSICAO",89036,"TRATOR DE PNEUS, POTÊNCIA 85 CV, TRAÇÃO 4X4, PESO COM LASTRO DE 4.675 KG ","CHI","0,0040000",52.19,0.2]
[null,"COMPOSICAO",91486,"ESPARGIDOR DE ASFALTO PRESSURIZADO, TANQUE 6 M3 COM ISOLAÇÃO TÉRMICA, AQUECIDO COM 2 MAÇARICOS, COM BARRA ESPARGIDORA 3,60 M, MONTADO SOBRE CAMINHÃO  TOCO, PBT 14.300 KG, POTÊNCIA 185 CV","CHI","0,0050000",66.180000000000007,0.33]
[{"$nulls":7},0]
[null,"PRODUÇÃO DA EQUIPE",null,null,1,"CUSTO ",null,{"$f":"SUM(H179:H187)","v":1.1200000000000001}]
[null,"TOTAL",{"$nulls":5},{"$f":"H188/E188","v":1.1200000000000001},"OK"]
[null,"BDI                %",{"$nulls":5},{"$f":"1+$M$1","v":1.2222}]
[null,"TOTAL DO SERVIÇO - R$",{"$nulls":5},{"$f":"ROUND(H189*H190,2)","v":1.37}]
[]
[11,"CODEVASF",null,null," COMPOSIÇÃO DE PREÇO UNITÁRIO",null,null,null,{"$f":"H208","v":0.93000000000000016},{"$f":"H210","v":1.1399999999999999}]
[null,"OBRA:  ",{"$f":"$C$2","v":" PAVIMENTAÇÃO ASFÁLTICA EM CBUQ –  SAÍDA PARA COMUNIDADE DE SUCURIU DE BAIXO  - ITEM 03 - (MORADA NOVA DE MINAS / MG)"},null,null,null,"DATA: ",{"$f":"$H$2","v":" AGOSTO / 2023   "}]
[null,"SERVIÇO:  ",{"$f":"VLOOKUP(A193,ORÇAMENTO!$A$10:$I$33,3)","v":"PINTURA DE LIGAÇÃO COM EMULSÃO ASFÁLTICA RR-1C"},null,"SINAPI",{"$f":"VLOOKUP(A193,ORÇAMENTO!$A$10:$I$33,4)","v":96402},"UNIDADE: ","M2"]
[]
[null,"TIPO ITEM","CODIGO ITEM","DESCRIÇÃO ITEM","UNIDADE ITEM","COEFICIENTE","PRECO UNITARIO","CUSTO TOTAL"]
[null,"COMPOSICAO",5839,"VASSOURA MECÂNICA REBOCÁVEL COM ESCOVA CILÍNDRICA, LARGURA ÚTIL DE VARRIMENTO DE 2,44 M","CHP","0,0020000",9.77,{"$f":"ROUNDDOWN(F198*G198,2)","v":0.01}]
[null,"COMPOSICAO",5841,"VASSOURA MECÂNICA REBOCÁVEL COM ESCOVA CILÍNDRICA, LARGURA ÚTIL DE VARRIMENTO DE 2,44 M","CHI","0,0040000",4.6500000000000004,0.01]
[null,"INSUMO",41903,"EMULSAO ASFALTICA CATIONICA RR-1C PARA USO EM PAVIMENTACAO ASFALTICA (FORNECIMENTO COM BDI DIFERENCIADO)","KG","0,4500000",null,0]
[null,"COMPOSICAO",83362,"ESPARGIDOR DE ASFALTO PRESSURIZADO, TANQUE 6 M3 COM ISOLAÇÃO TÉRMICA, AQUECIDO COM 2 MAÇARICOS, COM BARRA ESPARGIDORA 3,60 M, MONTADO SOBRE CAMINHÃO  TOCO, PBT 14.300 KG, POTÊNCIA 185 CV","CHP","0,0004000",232.92,0.09]
[null,"COMPOSICAO",88316,"SERVENTE COM ENCARGOS COMPLEMENTARES","H","0,0055000",19.760000000000002,0.1]
[null,"COMPOSICAO",89035,"TRATOR DE PNEUS, POTÊNCIA 85 CV, TRAÇÃO 4X4, PESO COM LASTRO DE 4.675 KG","CHP","0,0017000",119.96,0.2]
[null,"COMPOSICAO",89036,"TRATOR DE PNEUS, POTÊNCIA 85 CV, TRAÇÃO 4X4, PESO COM LASTRO DE 4.675 KG","CHI","0,0038000",52.19,0.19]
[null,"COMPOSICAO",91486,"ESPARGIDOR DE ASFALTO PRESSURIZADO, TANQUE 6 M3 COM ISOLAÇÃO TÉRMICA, AQUECIDO COM 2 MAÇARICOS, COM BARRA ESPARGIDORA 3,60 M, MONTADO SOBRE CAMINHÃO  TOCO, PBT 14.300 KG, POTÊNCIA 185 CV","CHI","0,0051000",66.180000000000007,0.33]
[{"$nulls":7},0]
[null,"PRODUÇÃO DA EQUIPE",null,null,1,"CUSTO ",null,{"$f":"SUM(H198:H206)","v":0.93000000000000016}]
[null,"TOTAL",{"$nulls":5},{"$f":"H207/E207","v":0.93000000000000016},"OK"]
[null,"BDI                %",{"$nulls":5},{"$f":"1+$M$1","v":1.2222}]
[null,"TOTAL DO SERVIÇO - R$",{"$nulls":5},{"$f":"ROUND(H208*H209,2)","v":1.1399999999999999}]
[]
[12,"CODEVASF",null,null," COMPOSIÇÃO DE PREÇO UNITÁRIO",null,null,null,{"$f":"H230","v":121.32},{"$f":"H232","v":148.28}]
[null,"OBRA:  ",{"$f":"$C$2","v":" PAVIMENTAÇÃO ASFÁLTICA EM CBUQ –  SAÍDA PARA COMUNIDADE DE SUCURIU DE BAIXO  - ITEM 03 - (MORADA NOVA DE MINAS / MG)"},null,null,null,"DATA: ",{"$f":"$H$2","v":" AGOSTO / 2023   "}]
[null,"SERVIÇO:  ",{"$f":"VLOOKUP(A212,ORÇAMENTO!$A$10:$I$33,3)","v":"EXECUÇÃO DE PAVIMENTO COM APLICAÇÃO DE CONCRETO ASFÁLTICO USINADO A QUENTE (CBUQ), CAMADA DE ROLAMENTO - EXCLUSIVE TRANSPORTE"},null,"SINAPI",{"$f":"VLOOKUP(A212,ORÇAMENTO!$A$10:$I$33,4)","v":95995},"UNIDADE: ",{"$f":"VLOOKUP(A212,ORÇAMENTO!$A$10:$I$33,5)","v":"M3"}]
[]
[null,"TIPO ITEM","CODIGO ITEM","DESCRIÇÃO ITEM","UNIDADE ITEM","COEFICIENTE","PRECO UNITARIO","CUSTO TOTAL"]
[null,"INSUMO","1518","CONCRETO BETUMINOSO USINADO A QUENTE (CBUQ) PARA PAVIMENTACAO ASFALTICA, PADRAO DNIT, FAIXA C, COM CAP 50/70 - AQUISICAO POSTO USINA","T","2,5548000",null,{"$f":"ROUNDDOWN(F217*G217,2)","v":0}]
[null,"COMPOSICAO","5835","VIBROACABADORA DE ASFALTO SOBRE ESTEIRAS, LARGURA DE PAVIMENTAÇÃO 1,90 M A 5,30 M, POTÊNCIA 105 HP CAPACIDADE 450 T/H","CHP","0,0464000","366,49",17]
[null,"COMPOSICAO","5837","VIBROACABADORA DE ASFALTO SOBRE ESTEIRAS, LARGURA DE PAVIMENTAÇÃO 1,90 M A 5,30 M, POTÊNCIA 105 HP CAPACIDADE 450 T/H","CHI","0,0949000","147,82",14.02]
[null,"COMPOSICAO","88314","RASTELEIRO COM ENCARGOS COMPLEMENTARES","H","1,1301000","26,52",29.97]
[null,"COMPOSICAO","91386","CAMINHÃO BASCULANTE 10 M3, TRUCADO CABINE SIMPLES, PESO BRUTO TOTAL 23.000 KG, CARGA ÚTIL MÁXIMA 15.935 KG, DISTÂNCIA ENTRE EIXOS 4,80 M, POTÊNCIA 230 CV INCLUSIVE CAÇAMBA METÁLICA ","CHP","0,0464000","228,50",10.6]
[null,"COMPOSICAO","95631","ROLO COMPACTADOR VIBRATORIO TANDEM, ACO LISO, POTENCIA 125 HP, PESO SEM/COM LASTRO 10,20/11,65 T, LARGURA DE TRABALHO 1,73 M","CHP","0,0805000","210,29",16.920000000000002]
[null,"COMPOSICAO","95632","ROLO COMPACTADOR VIBRATORIO TANDEM, ACO LISO, POTENCIA 125 HP, PESO SEM/COM LASTRO 10,20/11,65 T, LARGURA DE TRABALHO 1,73 M","CHI","0,0607000","83,23",5.05]
[null,"COMPOSICAO","96155","TRATOR DE PNEUS COM POTÊNCIA DE 85 CV, TRAÇÃO 4X4, COM VASSOURA MECÂNICA ACOPLADA","CHI","0,1071000","56,63",6.06]
[null,"COMPOSICAO","96157","TRATOR DE PNEUS COM POTÊNCIA DE 85 CV, TRAÇÃO 4X4, COM VASSOURA MECÂNICA ACOPLADA","CHP","0,0341000","128,67",4.38]
[null,"COMPOSICAO","96463","ROLO COMPACTADOR DE PNEUS, ESTATICO, PRESSAO VARIAVEL, POTENCIA 110 HP, PESO SEM/COM LASTRO 10,8/27 T, LARGURA DE ROLAGEM 2,30 M","CHP","0,0419000","203,13",8.51]
[null,"COMPOSICAO","96464","ROLO COMPACTADOR DE PNEUS, ESTATICO, PRESSAO VARIAVEL, POTENCIA 110 HP, PESO SEM/COM LASTRO 10,8/27 T, LARGURA DE ROLAGEM 2,30 M","CHI","0,0990000","89,07",8.81]
[{"$nulls":7},0]
[null,"PRODUÇÃO DA EQUIPE",null,null,1,"CUSTO ",null,{"$f":"SUM(H217:H228)","v":121.32}]
[null,"TOTAL",{"$nulls":5},{"$f":"H229/E229","v":121.32},"OK"]
[null,"BDI                %",{"$nulls":5},{"$f":"1+$M$1","v":1.2222}]
[null,"TOTAL DO SERVIÇO - R$",{"$nulls":5},{"$f":"ROUND(H230*H231,2)","v":148.28}]
[]
[13,"CODEVASF",null,null," COMPOSIÇÃO DE PREÇO UNITÁRIO",null,null,null,{"$f":"H243","v":1.6099999999999999},{"$f":"H245","v":1.97}]
[null,"OBRA:  ",{"$f":"$C$2","v":" PAVIMENTAÇÃO ASFÁLTICA EM CBUQ –  SAÍDA PARA COMUNIDADE DE SUCURIU DE BAIXO  - ITEM 03 - (MORADA NOVA DE MINAS / MG)"},null,null,null,"DATA: ",{"$f":"$H$2","v":" AGOSTO / 2023   "}]
[null,"SERVIÇO:  ",{"$f":"VLOOKUP(A234,ORÇAMENTO!$A$10:$I$33,3)","v":"TRANSPORTE COM CAMINHÃO BASCULANTE, EM VIA URBANA PAVIMENTADA"},null,"SINAPI",{"$f":"VLOOKUP(A234,ORÇAMENTO!$A$10:$I$33,4)","v":95877},"UNIDADE: ",{"$f":"VLOOKUP(A234,ORÇAMENTO!$A$10:$I$33,5)","v":"M3XKM"}]
[]
[null,"TIPO ITEM","CODIGO ITEM","DESCRIÇÃO ITEM","UNIDADE ITEM","COEFICIENTE","PRECO UNITARIO","CUSTO TOTAL"]
[null,"COMPOSICAO","89883","CAMINHÃO BASCULANTE 18 M3, COM CAVALO MECÂNICO DE CAPACIDADE MÁXIMA DE TRAÇÃO COMBINADO DE 45000 KG, POTÊNCIA 330 CV, INCLUSIVE SEMIREBOQUE COM CAÇAMBA METÁLICA","CHP","0,0046000",314.64,{"$f":"ROUNDDOWN(F239*G239,2)","v":1.44}]
[null,"COMPOSICAO","89884","CAMINHÃO BASCULANTE 18 M3, COM CAVALO MECÂNICO DE CAPACIDADE MÁXIMA DE TRAÇÃO COMBINADO DE 45000 KG, POTÊNCIA 330 CV, INCLUSIVE SEMIREBOQUE COM CAÇAMBA METÁLICA","CHI","0,0020000","86,36",{"$f":"ROUNDDOWN(F240*G240,2)","v":0.17}]
[{"$nulls":7},{"$f":"ROUNDDOWN(F241*G241,2)","v":0}]
[null,"PRODUÇÃO DA EQUIPE",null,null,1,"CUSTO ",null,{"$f":"SUM(H239:H241)","v":1.6099999999999999}]
[null,"TOTAL",{"$nulls":5},{"$f":"H242/E242","v":1.6099999999999999},"OK"]
[null,"BDI                %",{"$nulls":5},{"$f":"1+$M$1","v":1.2222}]
[null,"TOTAL DO SERVIÇO - R$",{"$nulls":5},{"$f":"ROUND(H243*H244,2)","v":1.97}]
[]
[14,"CODEVASF",null,null," COMPOSIÇÃO DE PREÇO UNITÁRIO",null,null,null,{"$f":"H256","v":1.92},{"$f":"H258","v":2.35}]
[null,"OBRA:  ",{"$f":"$C$2","v":" PAVIMENTAÇÃO ASFÁLTICA EM CBUQ –  SAÍDA PARA COMUNIDADE DE SUCURIU DE BAIXO  - ITEM 03 - (MORADA NOVA DE MINAS / MG)"},null,null,null,"DATA: ",{"$f":"$H$2","v":" AGOSTO / 2023   "}]
[null,"SERVIÇO:  ",{"$f":"VLOOKUP(A247,ORÇAMENTO!$A$10:$I$33,3)","v":"TRANSPORTE COM CAMINHÃO CARROCERIA 9T, EM VIA URBANA PAVIMENTADA"},null,"SINAPI",{"$f":"VLOOKUP(A247,ORÇAMENTO!$A$10:$I$33,4)","v":100947},"UNIDADE: ",{"$f":"VLOOKUP(A247,ORÇAMENTO!$A$10:$I$33,5)","v":"TXKM"}]
[]
[null,"TIPO ITEM","CODIGO ITEM","DESCRIÇÃO ITEM","UNIDADE ITEM","COEFICIENTE","PRECO UNITARIO","CUSTO TOTAL"]
[null,"COMPOSICAO","5824","CAMINHÃO TOCO, PBT 16.000 KG, CARGA ÚTIL MÁX. 10.685 KG, DIST. ENTRE EIXOS 4,8 M, POTÊNCIA 189 CV, INCLUSIVE CARROCERIA FIXA ABERTA DE MADEIRA P/ TRANSPORTE GERAL DE CARGA SECA, DIMEN. APROX. 2,5 X 7,00 X 0,50 M ","CHP","0,0093000",183.71,{"$f":"ROUNDDOWN(F252*G252,2)","v":1.7}]
[null,"COMPOSICAO","5826","CAMINHÃO TOCO, PBT 16.000 KG, CARGA ÚTIL MÁX. 10.685 KG, DIST. ENTRE EIXOS 4,8 M, POTÊNCIA 189 CV, INCLUSIVE CARROCERIA FIXA ABERTA DE MADEIRA P/ TRANSPORTE GERAL DE CARGA SECA, DIMEN. APROX. 2,5 X 7,00 X 0,50 M ","CHI","0,0040000",57,{"$f":"ROUNDDOWN(F253*G253,2)","v":0.22}]
[{"$nulls":7},{"$f":"ROUNDDOWN(F254*G254,2)","v":0}]
[null,"PRODUÇÃO DA EQUIPE",null,null,1,"CUSTO ",null,{"$f":"SUM(H252:H254)","v":1.92}]
[null,"TOTAL",{"$nulls":5},{"$f":"H255/E255","v":1.92},"OK"]
[null,"BDI                %",{"$nulls":5},{"$f":"1+$M$1","v":1.2222}]
[null,"TOTAL DO SERVIÇO - R$",{"$nulls":5},{"$f":"ROUND(H256*H257,2)","v":2.35}]
[]
[15,"CODEVASF",null,null," COMPOSIÇÃO DE PREÇO UNITÁRIO",null,null,null,{"$f":"H269","v":0.64999999999999991},{"$f":"H271","v":0.75}]
[null,"OBRA:  ",{"$f":"$C$2","v":" PAVIMENTAÇÃO ASFÁLTICA EM CBUQ –  SAÍDA PARA COMUNIDADE DE SUCURIU DE BAIXO  - ITEM 03 - (MORADA NOVA DE MINAS / MG)"},null,null,null,"DATA: ",{"$f":"$H$2","v":" AGOSTO / 2023   "}]
[null,"SERVIÇO:  ",{"$f":"VLOOKUP(A260,ORÇAMENTO!$A$10:$I$33,3)","v":"TRANSPORTE DE MASSA ASFÁLTICA COM CAMINHÃO BASCULANTE, EM VIA URBANA PAVIMENTADA (BDI DIFERENCIADO)"},null,"SINAPI",{"$f":"VLOOKUP(A260,ORÇAMENTO!$A$10:$I$33,4)","v":95427},"UNIDADE: ",{"$f":"VLOOKUP(A260,ORÇAMENTO!$A$10:$I$33,5)","v":"TXKM"}]
[]
[null,"TIPO ITEM","CODIGO ITEM","DESCRIÇÃO ITEM","UNIDADE ITEM","COEFICIENTE","PRECO UNITARIO","CUSTO TOTAL"]
[null,"COMPOSICAO","89883","CAMINHÃO BASCULANTE 18 M3, COM CAVALO MECÂNICO DE CAPACIDADE MÁXIMA DE TRAÇÃO COMBINADO DE 45000 KG, POTÊNCIA 330 CV, INCLUSIVE SEMIREBOQUE COM CAÇAMBA METÁLICA - CHP DIURNO. AF_12/2014","CHP","0,0019000","314,64",{"$f":"ROUNDDOWN(F265*G265,2)","v":0.59}]
[null,"COMPOSICAO","89884","CAMINHÃO BASCULANTE 18 M3, COM CAVALO MECÂNICO DE CAPACIDADE MÁXIMA DE TRAÇÃO COMBINADO DE 45000 KG, POTÊNCIA 330 CV, INCLUSIVE SEMIREBOQUE COM CAÇAMBA METÁLICA - CHI DIURNO. AF_12/2014","CHI","0,0008000","86,36",{"$f":"ROUNDDOWN(F266*G266,2)","v":0.06}]
[{"$nulls":7},{"$f":"ROUNDDOWN(F267*G267,2)","v":0}]
[null,"PRODUÇÃO DA EQUIPE",null,null,1,"CUSTO ",null,{"$f":"SUM(H265:H267)","v":0.64999999999999991}]
[null,"TOTAL",{"$nulls":5},{"$f":"H268/E268","v":0.64999999999999991},"OK"]
[null,"BDI                %",{"$nulls":5},{"$f":"1+$M$2","v":1.1499999999999999}]
[null,"TOTAL DO SERVIÇO - R$",{"$nulls":5},{"$f":"ROUND(H269*H270,2)","v":0.75}]
[]
[16,"CODEVASF",null,null," COMPOSIÇÃO DE PREÇO UNITÁRIO",null,null,null,{"$f":"H281","v":0.47},{"$f":"H283","v":0.54}]
[null,"OBRA:  ",{"$f":"$C$2","v":" PAVIMENTAÇÃO ASFÁLTICA EM CBUQ –  SAÍDA PARA COMUNIDADE DE SUCURIU DE BAIXO  - ITEM 03 - (MORADA NOVA DE MINAS / MG)"},null,null,null,"DATA: ",{"$f":"$H$2","v":" AGOSTO / 2023   "}]
[null,"SERVIÇO:  ",{"$f":"VLOOKUP(A273,ORÇAMENTO!$A$10:$I$33,3)","v":"TRANSPORTE COM CAMINHÃO TANQUE DE TRANSPORTE DE MATERIAL ASFÁLTICO DE 30000 L, EM VIA URBANA PAVIMENTADA (BDI DIFERENCIADO)"},null,"SINAPI",{"$f":"VLOOKUP(A273,ORÇAMENTO!$A$10:$I$33,4)","v":102331},"UNIDADE: ",{"$f":"VLOOKUP(A273,ORÇAMENTO!$A$10:$I$33,5)","v":"TXKM"}]
[]
[null,"TIPO ITEM","CODIGO ITEM","DESCRIÇÃO ITEM","UNIDADE ITEM","COEFICIENTE","PRECO UNITARIO","CUSTO TOTAL"]
[null,"COMPOSICAO","91645","CAMINHÃO DE TRANSPORTE DE MATERIAL ASFÁLTICO 30.000 L, COM CAVALO MECÂNICO DE CAPACIDADE MÁXIMA DE TRAÇÃO COMBINADO DE 66.000 KG, POTÊNCIA 360 CV, INCLUSIVE TANQUE DE ASFALTO COM SERPENTINA ","CHP","0,0011000",394.83,{"$f":"ROUNDDOWN(F278*G278,2)","v":0.43}]
[null,"COMPOSICAO","91646","CAMINHÃO DE TRANSPORTE DE MATERIAL ASFÁLTICO 30.000 L, COM CAVALO MECÂNICO DE CAPACIDADE MÁXIMA DE TRAÇÃO COMBINADO DE 66.000 KG, POTÊNCIA 360 CV, INCLUSIVE TANQUE DE ASFALTO COM SERPENTINA","CHI","0,0005000",90.79,{"$f":"ROUNDDOWN(F279*G279,2)","v":0.04}]
[null,"PRODUÇÃO DA EQUIPE",null,null,1,"CUSTO ",null,{"$f":"SUM(H278:H279)","v":0.47}]
[null,"TOTAL",{"$nulls":5},{"$f":"H280/E280","v":0.47},"OK"]
[null,"BDI                %",{"$nulls":5},{"$f":"1+$M$2","v":1.1499999999999999}]
[null,"TOTAL DO SERVIÇO - R$",{"$nulls":5},{"$f":"ROUND(H281*H282,2)","v":0.54}]
[]
[17,"CODEVASF",null,null," COMPOSIÇÃO DE PREÇO UNITÁRIO",null,null,null,{"$f":"H300","v":47.91},{"$f":"H302","v":58.56}]
[null,"OBRA:  ",{"$f":"$C$2","v":" PAVIMENTAÇÃO ASFÁLTICA EM CBUQ –  SAÍDA PARA COMUNIDADE DE SUCURIU DE BAIXO  - ITEM 03 - (MORADA NOVA DE MINAS / MG)"},null,null,null,"DATA: ",{"$f":"$H$2","v":" AGOSTO / 2023   "}]
[null,"SERVIÇO:  ",{"$f":"VLOOKUP(A285,ORÇAMENTO!$A$10:$I$33,3)","v":"GUIA (MEIO-FIO) E SARJETA CONJUGADOS DE CONCRETO, MOLDADA  IN LOCO  EM TRECHO RETO COM EXTRUSORA, 45 CM BASE (15 CM BASE DA GUIA + SARJETA (30 X 0,05))X 22 CM ALTURA"},null,"SINAPI",{"$f":"VLOOKUP(A285,ORÇAMENTO!$A$10:$I$33,4)","v":"94267a"},"UNIDADE: ",{"$f":"VLOOKUP(A285,ORÇAMENTO!$A$10:$I$33,5)","v":"M"}]
[]
[null,"TIPO ITEM","CODIGO ITEM","DESCRIÇÃO ITEM","UNIDADE ITEM","COEFICIENTE","PRECO UNITARIO","CUSTO TOTAL"]
[null,"INSUMO","370","AREIA MEDIA - POSTO JAZIDA/FORNECEDOR (RETIRADO NA JAZIDA, SEM TRANSPORTE)","M3","0,0150000","97,50",{"$f":"ROUNDDOWN(F290*G290,2)","v":1.46}]
[null,"INSUMO","34492","CONCRETO USINADO BOMBEAVEL, CLASSE DE RESISTENCIA C20, COM BRITA 0 E 1, SLUMP = 100 +/- 20 MM, EXCLUI SERVICO DE BOMBEAMENTO (NBR 8953)","M3",{"$f":" (0.15+0.13)*0.22 /2 + (0.3 *0.05)","v":4.5800000000000007E-2},"550,00",25.19]
[null,"COMPOSICAO","88243","AJUDANTE ESPECIALIZADO COM ENCARGOS COMPLEMENTARES","H","0,1090000","21,76",2.37]
[null,"COMPOSICAO","88309","PEDREIRO COM ENCARGOS COMPLEMENTARES","H","0,2440000","27,45",6.69]
[null,"COMPOSICAO","88316","SERVENTE COM ENCARGOS COMPLEMENTARES","H","0,4870000","19,76",9.6199999999999992]
[null,"COMPOSICAO","88631","ARGAMASSA TRAÇO 1:4 (EM VOLUME DE CIMENTO E AREIA MÉDIA ÚMIDA), PREPARO MANUAL. AF_08/2019","M3","0,0030000","575,87",1.72]
[null,"COMPOSICAO","92960","MÁQUINA EXTRUSORA DE CONCRETO PARA GUIAS E SARJETAS, MOTOR A DIESEL, POTÊNCIA 14 CV - CHP DIURNO. AF_12/2015","CHP","0,0180000","18,74",0.33]
[null,"COMPOSICAO","92961","MÁQUINA EXTRUSORA DE CONCRETO PARA GUIAS E SARJETAS, MOTOR A DIESEL, POTÊNCIA 14 CV - CHI DIURNO. AF_12/2015","CHI","0,0910000","5,89",0.53]
[{"$nulls":7},0]
[null,"PRODUÇÃO DA EQUIPE",null,null,1,"CUSTO ",null,{"$f":"SUM(H290:H298)","v":47.91}]
[null,"TOTAL",{"$nulls":5},{"$f":"H299/E299","v":47.91},"OK"]
[null,"BDI                %",{"$nulls":5},{"$f":"1+$M$1","v":1.2222}]
[null,"TOTAL DO SERVIÇO - R$",{"$nulls":5},{"$f":"ROUND(H300*H301,2)","v":58.56}]
[]
[18,"CODEVASF",null,null," COMPOSIÇÃO DE PREÇO UNITÁRIO",null,null,null,{"$f":"H318","v":5.5500000000000007},{"$f":"H320","v":6.78}]
[null,"OBRA:  ",{"$f":"$C$2","v":" PAVIMENTAÇÃO ASFÁLTICA EM CBUQ –  SAÍDA PARA COMUNIDADE DE SUCURIU DE BAIXO  - ITEM 03 - (MORADA NOVA DE MINAS / MG)"},null,null,null,"DATA: ",{"$f":"$H$2","v":" AGOSTO / 2023   "}]
[null,"SERVIÇO:  ",{"$f":"VLOOKUP(A304,ORÇAMENTO!$A$10:$I$37,3)","v":"PINTURA DE EIXO VIÁRIO SOBRE ASFALTO COM TINTA RETRORREFLETIVA A BASE DE RESINA ACRÍLICA COM MICROESFERAS DE VIDRO, APLICAÇÃO MECÂNICA COM DEMARCADORA AUTOPROPELIDA - ESPESSURA DE 0,10 MM"},null,"SINAPI",{"$f":"VLOOKUP(A304,ORÇAMENTO!$A$10:$I$41,4)","v":102512},"UNIDADE: ",{"$f":"VLOOKUP(A304,ORÇAMENTO!$A$10:$I$41,5)","v":"M"}]
[]
[null,"TIPO ITEM","CODIGO ITEM","DESCRIÇÃO ITEM","UNIDADE ITEM","COEFICIENTE","PRECO UNITARIO","CUSTO TOTAL"]
[null,"INSUMO","5318","DILUENTE AGUARRAS","L","0,0020000","26,76",{"$f":"ROUNDDOWN(F309*G309,2)","v":0.05}]
[null,"INSUMO","7343","TINTA ACRILICA A BASE DE SOLVENTE, PARA SINALIZACAO HORIZONTAL VIARIA (NBR 11862)","L","0,0430000","17,71",0.76]
[null,"INSUMO","44477","MICROESFERAS DE VIDRO PARA SINALIZACAO HORIZONTAL VIARIA, TIPO II-A (DROP-ON) - NBR  16184","KG","0,0250000","10,74",0.26]
[null,"INSUMO","44478","MICROESFERAS DE VIDRO PARA SINALIZACAO HORIZONTAL VIARIA, TIPO I-B (PREMIX) - NBR  16184","KG","0,0110000","10,74",0.11]
[null,"COMPOSICAO","88310","PINTOR COM ENCARGOS COMPLEMENTARES","H","0,0340000","28,66",0.97]
[null,"COMPOSICAO","88316","SERVENTE COM ENCARGOS COMPLEMENTARES","H","0,0140000","19,76",0.27]
[null,"COMPOSICAO","95133","MÁQUINA DEMARCADORA DE FAIXA DE TRÁFEGO À FRIO, AUTOPROPELIDA, POTÊNCIA 38 HP - CHP DIURNO. AF_07/2016","CHP","0,0003000","173,43",0.05]
[null,"COMPOSICAO","96159","MÁQUINA DEMARCADORA DE FAIXA DE TRÁFEGO À FRIO, AUTOPROPELIDA, POTÊNCIA 38 HP - CHI DIURNO. AF_07/2016","CHI","0,0334000","92,42",3.08]
[null,"PRODUÇÃO DA EQUIPE",null,null,1,"CUSTO ",null,{"$f":"SUM(H309:H316)","v":5.5500000000000007}]
[null,"TOTAL",{"$nulls":5},{"$f":"H317/E317","v":5.5500000000000007},"OK"]
[null,"BDI                %",{"$nulls":5},{"$f":"1+$M$1","v":1.2222}]
[null,"TOTAL DO SERVIÇO - R$",{"$nulls":5},{"$f":"ROUND(H318*H319,2)","v":6.78}]
[]
[19,"CODEVASF",null,null," COMPOSIÇÃO DE PREÇO UNITÁRIO",null,null,null,{"$f":"H329","v":2769.65},{"$f":"H331","v":3185.1}]
[null,"OBRA:  ",{"$f":"$C$2","v":" PAVIMENTAÇÃO ASFÁLTICA EM CBUQ –  SAÍDA PARA COMUNIDADE DE SUCURIU DE BAIXO  - ITEM 03 - (MORADA NOVA DE MINAS / MG)"},null,null,null,"DATA: ",{"$f":"$H$2","v":" AGOSTO / 2023   "}]
[null,"SERVIÇO:  ",{"$f":"VLOOKUP(A322,ORÇAMENTO!$A$10:$I$46,3)","v":"AQUISIÇÃO DE EMULSÃO ASFÁLTICA PARA IMPRIMAÇÃO (EAI) - EXCLUSIVE TRANSPORTE"},null,"SEINFRA",{"$f":"VLOOKUP(A322,ORÇAMENTO!$A$10:$I$46,4)","v":"CPU.4"},"UNIDADE: ",{"$f":"VLOOKUP(A322,ORÇAMENTO!$A$10:$I$46,5)","v":"T"}]
[]
[null,"TIPO ITEM","CODIGO ITEM","DESCRIÇÃO ITEM","UNIDADE ITEM","COEFICIENTE","PRECO UNITARIO","CUSTO TOTAL"]
[null,"INSUMO","ANP","EMULSÃO ASFÁLTICA PARA SERVIÇO DE IMPRIMAÇÃO (CUSTO ANP, INCLUINDO ICMS 18%)","T",1,{"$f":"2.27112*1000*1.2195122","v":2769.6585476639998},{"$f":"ROUNDDOWN(F327*G327,2)","v":2769.65}]
[null,"PRODUÇÃO DA EQUIPE",null,null,1,"CUSTO ",null,{"$f":"SUM(H327:H327)","v":2769.65}]
[null,"TOTAL",{"$nulls":5},{"$f":"H328/E328","v":2769.65}]
[null,"BDI                %",{"$nulls":5},{"$f":"1+$M$2","v":1.1499999999999999}]
[null,"TOTAL DO SERVIÇO - R$",{"$nulls":5},{"$f":"ROUND(H329*H330,2)","v":3185.1},"OK"]
[]
[20,"CODEVASF",null,null," COMPOSIÇÃO DE PREÇO UNITÁRIO",null,null,null,{"$f":"H340","v":2837.6},{"$f":"H342","v":3263.24}]
[null,"OBRA:  ",{"$f":"$C$2","v":" PAVIMENTAÇÃO ASFÁLTICA EM CBUQ –  SAÍDA PARA COMUNIDADE DE SUCURIU DE BAIXO  - ITEM 03 - (MORADA NOVA DE MINAS / MG)"},null,null,null,"DATA: ",{"$f":"$H$2","v":" AGOSTO / 2023   "}]
[null,"SERVIÇO:  ",{"$f":"VLOOKUP(A333,ORÇAMENTO!$A$10:$I$46,3)","v":"AQUISIÇÃO DE EMULSAO ASFALTICA CATIONICA RR-1C - EXCLUSIVE TRANSPORTE"},null,"SINAPI",{"$f":"VLOOKUP(A333,ORÇAMENTO!$A$10:$I$46,4)","v":"CPU.5"},"UNIDADE: ",{"$f":"VLOOKUP(A333,ORÇAMENTO!$A$10:$I$46,5)","v":"T"}]
[]
[null,"TIPO ITEM","CODIGO ITEM","DESCRIÇÃO ITEM","UNIDADE ITEM","COEFICIENTE","PRECO UNITARIO","CUSTO TOTAL"]
[null,"INSUMO","ANP","EMULSÃO ASFÁLTICA CATIÔNICA RR-1C(CUSTO ANP, INCLUINDO ICMS 18%)","T",1,{"$f":"2.32684*1.2195122*1000","v":2837.6097674479997},{"$f":"ROUNDDOWN(F338*G338,2)","v":2837.6}]
[null,"PRODUÇÃO DA EQUIPE",null,null,1,"CUSTO ",null,{"$f":"SUM(H338:H338)","v":2837.6}]
[null,"TOTAL",{"$nulls":5},{"$f":"H339/E339","v":2837.6},"OK"]
[null,"BDI                %",{"$nulls":5},{"$f":"1+$M$2","v":1.1499999999999999}]
[null,"TOTAL DO SERVIÇO - R$",{"$nulls":5},{"$f":"ROUND(H340*H341,2)","v":3263.24}]
[]
[21,"CODEVASF",null,null," COMPOSIÇÃO DE PREÇO UNITÁRIO",null,null,null,{"$f":"H351","v":580},{"$f":"H353","v":667}]
[null,"OBRA:  ",{"$f":"$C$2","v":" PAVIMENTAÇÃO ASFÁLTICA EM CBUQ –  SAÍDA PARA COMUNIDADE DE SUCURIU DE BAIXO  - ITEM 03 - (MORADA NOVA DE MINAS / MG)"},null,null,null,"DATA: ",{"$f":"$H$2","v":" AGOSTO / 2023   "}]
[null,"SERVIÇO:  ",{"$f":"VLOOKUP(A344,ORÇAMENTO!$A$10:$I$46,3)","v":"AQUISIÇÃO DE CONCRETO BETUMINOSO USINADO A QUENTE (CBUQ) PARA PAVIMENTACAO ASFALTICA, PADRAO DNIT, FAIXA C, COM CAP 50/70 - EXCLUSIVE TRANSPORTE"},null,"SINAPI",{"$f":"VLOOKUP(A344,ORÇAMENTO!$A$10:$I$46,4)","v":"CPU.6"},"UNIDADE: ",{"$f":"VLOOKUP(A344,ORÇAMENTO!$A$10:$I$46,5)","v":"T"}]
[]
[null,"TIPO ITEM","CODIGO ITEM","DESCRIÇÃO ITEM","UNIDADE ITEM","COEFICIENTE","PRECO UNITARIO","CUSTO TOTAL"]
[null,"INSUMO",1518,"CONCRETO BETUMINOSO USINADO A QUENTE (CBUQ) PARA PAVIMENTACAO ASFALTICA, PADRAO DNIT, FAIXA C, COM CAP 50/70 - AQUISICAO POSTO USINA","T",1,580,{"$f":"ROUNDDOWN(F349*G349,2)","v":580}]
[null,"PRODUÇÃO DA EQUIPE",null,null,1,"CUSTO ",null,{"$f":"SUM(H349:H349)","v":580}]
[null,"TOTAL",{"$nulls":5},{"$f":"H350/E350","v":580}]
[null,"BDI                %",{"$nulls":5},{"$f":"1+$M$2","v":1.1499999999999999}]
[null,"TOTAL DO SERVIÇO - R$",{"$nulls":5},{"$f":"ROUND(H351*H352,2)","v":667}]

{"sheet":"BDI SERV","index":2,"n_rows":37,"n_cols":5,"rows_kept":37,"cut":false,"hidden":false,"merged":[[31,1,31,2],[32,0,34,5],[36,0,36,5],[0,1,2,4],[3,1,4,1],[3,2,4,2],[28,0,28,5],[30,1,30,2]]}
[null,"DETALHAMENTO DO BDI - SERVIÇOS"]
[]
[]
[null,"Item","Descrição dos Serviços","%","%"]
[null,null,null,"PV","CD"]
[]
[null,1,"ADMINISTRAÇÃO CENTRAL"," ",4.01]
[null,"1.1","ESCRITÓRIO CENTRAL"," "," "]
[null,"1.2","VIAGENS"," "," "]
[null,"1.3","OUTROS"," "," "]
[null," "," "," "," "]
[null,2,"IMPOSTOS E TAXAS",{"$f":"SUM(D13:D16)","v":6.65},{"$f":"SUM(E13:E16)","v":8.31}]
[null,"2.1","ISS (*)",3,{"$f":"ROUND(D13*1.2515,2)","v":3.75}]
[null,"2.2","PIS",0.65,{"$f":"ROUND(D14*1.2515,2)","v":0.81}]
[null,"2.3","Cofins",3,{"$f":"ROUND(D15*1.2515,2)","v":3.75}]
[null,"2.4","CONTRIBUIÇÃO PREVIDENCIÁRIA SOBRE A RENDA BRUTA",0,{"$f":"ROUND(D16*1.2515,2)","v":0}]
[]
[null,3,"TAXA DE RISCO"," ",{"$f":"SUM(E19:E22)","v":0.96}]
[null,"3.1","SEGURO",null,0.2]
[null,"3.2","RISCO",null,0.56000000000000005]
[null,"3.3","GARANTIA",null,0.2]
[]
[null,4,"DESPESAS FINANCEIRAS"," ",1.1100000000000001]
[]
[null,5,"LUCRO",null,7.5]
[]
[null," ","BDI - CALCULADO"," ",{"$f":"ROUND((((1+(E7+E18)/100)*(1+E23/100)*(1+E25/100)/(1-D12/100)-1)*100),2)","v":22.22}]
[]
["BDI = ((1+((AC+S+R+G)/100))x(1+DF/100)x(1+L/100)/(1-I/100)-1)*100"]
[]
[null,"BDI (CALCULADO):",null,{"$f":"ROUND((((1+((E7+E18)/100))*(1+E23/100)*(1+E25/100))/(1-D12/100)-1)*100,2)","v":22.22},"%"]
[null," "]
["(*) ISS CONFORME LEI 2.226/2017 e LEI COMPLEMENTAR Nº 116/2003 - \nConsiderando as deduções previstas no Art. 106 - § 5º (Alíquota sobre 50% do valor dos serviços)"]
[]
[]
[]
["BDI EM CONFORMIDADE COM OS ACÓRDÃOS Nº 2369/2011 e ACÓRDÃO Nº 2.622/2013 - TCU - PLENÁRIO"]

{"sheet":"BDI FORN","index":3,"n_rows":37,"n_cols":5,"rows_kept":37,"cut":false,"hidden":false,"merged":[[31,1,31,2],[32,0,34,5],[36,0,36,5],[0,1,2,4],[3,1,4,1],[3,2,4,2],[28,0,28,5],[30,1,30,2]]}
[null,"DETALHAMENTO DO BDI - FORNECIMENTO \n(MATERIAL ASFÁLTICO)"]
[]
[]
[null,"Item","Descrição dos Serviços","%","%"]
[null,null,null,"PV","CD"]
[]
[null,1,"ADMINISTRAÇÃO CENTRAL"," ",3.72]
[null,"1.1","ESCRITÓRIO CENTRAL"," "," "]
[null,"1.2","VIAGENS"," "," "]
[null,"1.3","OUTROS"," "," "]
[null," "," "," "," "]
[null,2,"IMPOSTOS E TAXAS",{"$f":"SUM(D13:D16)","v":3.65},{"$f":"SUM(E13:E16)","v":4.5600000000000005}]
[null,"2.1","ISS (*)",null,{"$f":"ROUND(D13*1.2515,2)","v":0}]
[null,"2.2","PIS",0.65,{"$f":"ROUND(D14*1.2515,2)","v":0.81}]
[null,"2.3","Cofins",3,{"$f":"ROUND(D15*1.2515,2)","v":3.75}]
[null,"2.4","CONTRIBUIÇÃO PREVIDENCIÁRIA SOBRE A RENDA BRUTA",0,{"$f":"ROUND(D16*1.2515,2)","v":0}]
[]
[null,3,"TAXA DE RISCO"," ",{"$f":"SUM(E19:E22)","v":0.82000000000000006}]
[null,"3.1","SEGURO",null,0.16]
[null,"3.2","RISCO",null,0.5]
[null,"3.3","GARANTIA",null,0.16]
[]
[null,4,"DESPESAS FINANCEIRAS"," ",0.94]
[]
[null,5,"LUCRO",null,5]
[]
[null," ","BDI - CALCULADO"," ",{"$f":"ROUND((((1+(E7+E18)/100)*(1+E23/100)*(1+E25/100)/(1-D12/100)-1)*100),2)","v":15}]
[]
["BDI = ((1+((AC+S+R+G)/100))x(1+DF/100)x(1+L/100)/(1-I/100)-1)*100"]
[]
[null,"BDI (CALCULADO):",null,{"$f":"ROUND((((1+((E7+E18)/100))*(1+E23/100)*(1+E25/100))/(1-D12/100)-1)*100,2)","v":15},"%"]
[null," "]
[]
[]
[]
[]
["BDI EM CONFORMIDADE COM OS ACÓRDÃOS Nº 2369/2011 e ACÓRDÃO Nº 2.622/2013 - TCU - PLENÁRIO"]

{"sheet":"CRONOGRAMA","index":4,"n_rows":21,"n_cols":10,"rows_kept":21,"cut":false,"hidden":false,"merged":[[0,1,0,9],[1,1,2,1],[1,2,2,4],[1,6,1,9],[2,6,2,9],[3,1,3,8],[5,0,6,0],[5,1,6,1],[5,2,6,2],[7,0,8,0],[7,1,8,1],[7,2,8,2],[9,0,10,0],[9,1,10,1],[9,2,10,2],[11,0,12,0],[11,1,12,1],[11,2,12,2],[17,1,18,2],[20,1,24,9],[13,0,14,0],[13,1,14,1],[13,2,14,2],[15,0,16,0],[15,1,16,1],[15,2,16,2]]}
[null,"CRONOGRAMA FÍSICO-FINANCEIRO"]
[null,"OBRA: ",{"$f":"ORÇAMENTO!C5","v":" PAVIMENTAÇÃO ASFÁLTICA EM CBUQ –  SAÍDA PARA COMUNIDADE DE SUCURIU DE BAIXO  - ITEM 03 - (MORADA NOVA DE MINAS / MG)"},null,null,"VALOR:",{"$f":"ORÇAMENTO!I39","v":1123586.3999999999}]
[{"$nulls":5},"PRAZO: ","120 DIAS "]
[]
[null,"ITEM","ETAPAS/DESCRIÇAO","FISICO/  FINANCEIRO","TOTAL    ETAPAS","MÊS 1","MÊS 2","MÊS 3","MÊS 4","TOTAL"]
["A",{"$f":"VLOOKUP(A6,ORÇAMENTO!$A$9:$I$39,2)","v":"1.7"},{"$f":"VLOOKUP(A6,ORÇAMENTO!$A$9:$I$39,3)","v":"DESTOCAMENTO DE ÁRVORES COM DIAMETRO DE 0,15M a 0,30M"},"FISICO ",{"$f":"ROUND(E7/$G$2,4)","v":8.1100000000000005E-2},0.35,0.2,0.2,0.25,{"$f":"SUM(F6:I6)","v":1}]
[null,null,null,"FINANCEIRO",{"$f":"ORÇAMENTO!I9","v":91125.810000000012},{"$f":"ROUND($E$7*F6,2)","v":31894.03},18225.16,18225.16,22781.45,{"$f":"SUM(F7:I7)","v":91125.8}]
["B",{"$f":"VLOOKUP(A8,ORÇAMENTO!$A$9:$I$39,2)","v":2},{"$f":"VLOOKUP(A8,ORÇAMENTO!$A$9:$I$39,3)","v":"PAVIMENTAÇÃO"},"FISICO ",{"$f":"ROUND(E9/$G$2,4)","v":0.11890000000000001},0.3,0.3,0.25,0.15,{"$f":"SUM(F8:I8)","v":1}]
[null,null,null,"FINANCEIRO",{"$f":"ORÇAMENTO!I17","v":133600.79999999999},{"$f":"ROUND($E$9*F8,2)","v":40080.239999999998},40080.239999999998,33400.199999999997,20040.12,{"$f":"SUM(F9:I9)","v":133600.79999999999}]
["C",{"$f":"VLOOKUP(A10,ORÇAMENTO!$A$9:$I$39,2)","v":3},{"$f":"VLOOKUP(A10,ORÇAMENTO!$A$9:$I$39,3)","v":"TRANSPORTE DE MATERIAIS"},"FISICO ",{"$f":"ROUND(E11/$G$2,4)","v":7.7499999999999999E-2},0.3,0.25,0.25,0.2,{"$f":"SUM(F10:I10)","v":1}]
[null,null,null,"FINANCEIRO",{"$f":"ORÇAMENTO!I26","v":87103.01999999999},{"$f":"ROUND($E$11*F10,2)","v":26130.91},21775.759999999998,21775.759999999998,17420.599999999999,{"$f":"SUM(F11:I11)-0.04","v":87102.99}]
["D",{"$f":"VLOOKUP(A12,ORÇAMENTO!$A$9:$I$39,2)","v":4},{"$f":"VLOOKUP(A12,ORÇAMENTO!$A$9:$I$39,3)","v":"TRANSPORTE DE MATERIAL ASFÁLTICO (BDI DIFERENCIADO)"},"FISICO ",{"$f":"ROUND(E13/$G$2,4)","v":9.7799999999999998E-2},null,0.15,0.55000000000000004,0.3,{"$f":"SUM(F12:I12)","v":1}]
[null,null,null,"FINANCEIRO",{"$f":"ORÇAMENTO!I29","v":109890},{"$f":"ROUND($E$13*F12,2)","v":0},16483.5,60439.5,32967,{"$f":"SUM(F13:I13)-0.02","v":109889.98}]
["E",{"$f":"VLOOKUP(A14,ORÇAMENTO!$A$9:$I$39,2)","v":5},{"$f":"VLOOKUP(A14,ORÇAMENTO!$A$9:$I$39,3)","v":"OBRAS COMPLEMENTARES"},"FISICO ",{"$f":"ROUND(E15/$G$2,4)","v":9.4899999999999998E-2},null,null,0.15,0.85,{"$f":"SUM(F14:I14)","v":1}]
[null,null,null,"FINANCEIRO",{"$f":"ORÇAMENTO!I32","v":106608},{"$f":"ROUND($E$15*F14,2)","v":0},0,15991.2,90616.8,{"$f":"SUM(F15:I15)-0.02","v":106607.98}]
["F",{"$f":"VLOOKUP(A16,ORÇAMENTO!$A$9:$I$39,2)","v":6},{"$f":"VLOOKUP(A16,ORÇAMENTO!$A$9:$I$39,3)","v":"FORNECIMENTOS - MATERIAL ASFÁLTICO (BDI DIFERENCIADO)"},"FISICO ",{"$f":"ROUND(E17/$G$2,4)","v":0.52980000000000005},null,0.15,0.55000000000000004,0.3,{"$f":"SUM(F16:I16)","v":1}]
[null,null,null,"FINANCEIRO",{"$f":"ORÇAMENTO!I35","v":595258.77},{"$f":"ROUND($E$17*F16,2)","v":0},89288.82,327392.32,178577.63,{"$f":"SUM(F17:I17)-0.02","v":595258.75}]
[null,"TOTAL",null,"FISICO ",{"$f":"SUM(F18:I18)","v":1},{"$f":"F19/$E$19","v":8.7314317795231411E-2},0.16541093769023907,0.4247329266356375,0.32254181787889208,{"$f":"SUM(F18:I18)","v":1}]
[null,null,null,"FINANCEIRO",{"$f":"E11+E9+E7+E13+E17+E15","v":1123586.3999999999},98105.18,185853.48,477224.14,362403.6,{"$f":"SUM(F19:I19)","v":1123586.3999999999}]
[]
[null,"OBSERVAÇÕES:"]