{"text_format":"2","workbook":"xlsx","n_sheets":5,"sheets":["ORÇAMENTO","CPU","BDI SERV","BDI FORN","CRONOGRAMA"],"not_rendered":{"charts":0,"images":2,"macros":0,"external_links":0,"defined_names":6,"comments":1,"pivot_tables":0},"unopened":[],"bounds":{"document_bytes":16777216,"sheet_cells":100000,"run_cost":"one","rows_first":2000,"rows_last":500,"rows_between":2000,"halvings":0,"cell_chars":16384,"cell_head_chars":4096},"cells_cut":0,"cells_raw":0,"read":"whole","date_system":"1900"}

{"sheet":"ORÇAMENTO","index":0,"n_rows":39,"n_cols":9,"rows_kept":39,"cut":false,"hidden":false,"merged":[[38,1,38,2],[0,0,7,0],[0,2,0,8],[1,2,1,8],[2,2,2,8],[4,2,4,8],[5,6,5,7],[6,1,6,2],[6,6,6,7],[20,6,20,7]]}
["<---- NUMERAR SERVIÇOS PARA CPU",null,"Ministério do Desenvolvimento Regional"]
[null,null,"Companhia de Desenvolvimento dos Vales do São Francisco e do Parnaíba"]
[null,null,"1ª Superintendência Regional"]
[]
[null,"OBRA: "," PAVIMENTAÇÃO ASFÁLTICA EM CBUQ –  SAÍDA PARA COMUNIDADE DE SUCURIU DE BAIXO  - ITEM 03 - (MORADA NOVA DE MINAS / MG)"]
[null,"DATA:"," AGOSTO / 2023   ",null,null,null,"BDI Serviços:",null,{"$f":"'BDI SERV'!D31/100","v":0.22219999999999998}]
[null,"PRAZO DE EXECUÇÃO:     120 DIAS",{"$nulls":4},"BDI Serviços:",null,{"$f":"'BDI FORN'!D31/100","v":0.15}]
[null,"ITEM","DISCRIMINAÇÃO","REFER.","UNID.","QUANT.","P. UNITÁRIO","P.UNIT.C/ BDI","P. TOTAL"]
["A",1,"SERVIÇOS PRELIMINARES ",{"$nulls":5},{"$f":"SUM(I10:I16)","v":91125.810000000012}]
[1,"1.1","MOBILIZAÇÃO E DESMOBILIZAÇÃO","CPU.1","GL",1,{"$f":"VLOOKUP(A10,CPU!$A$1:$N$4656,9)","v":11856.48},{"$f":"VLOOKUP(A10,CPU!$A$1:$N$4656,10)","v":14490.99},{"$f":"ROUND(F10*H10,2)","v":14490.99}]
[2,"1.2","ADMINISTRAÇÃO LOCAL","CPU.2","GL",1,{"$f":"VLOOKUP(A11,CPU!$A$1:$N$4656,9)","v":46517.68},{"$f":"VLOOKUP(A11,CPU!$A$1:$N$4656,10)","v":56853.91},{"$f":"ROUND(F11*H11,2)","v":56853.91}]
[3,"1.3","CANTEIRO DE OBRAS","CPU.3","GL",1,{"$f":"VLOOKUP(A12,CPU!$A$1:$N$4656,9)","v":9957},{"$f":"VLOOKUP(A12,CPU!$A$1:$N$4656,10)","v":12169.45},{"$f":"ROUND(F12*H12,2)","v":12169.45}]
[4,"1.4","PLACA DE OBRA EM CHAPA DE AÇO GALVANIZADO",103689,"M2",3,{"$f":"VLOOKUP(A13,CPU!$A$1:$N$4656,9)","v":339.72},{"$f":"VLOOKUP(A13,CPU!$A$1:$N$4656,10)","v":415.21},{"$f":"ROUND(F13*H13,2)","v":1245.6300000000001}]
[5,"1.5","SERVIÇOS TOPOGRÁFICOS PARA PAVIMENTAÇÃO, INCLUSIVE NOTA DE SERVIÇO, ACOMPANHAMENTO E GREIDE",78472,"M2",7099.9970000000003,{"$f":"VLOOKUP(A14,CPU!$A$1:$N$4656,9)","v":0.32999999999999996},{"$f":"VLOOKUP(A14,CPU!$A$1:$N$4656,10)","v":0.4},{"$f":"ROUND(F14*H14,2)","v":2840}]
["5.1","1.6","DESMATAMENTO, DESTOCAMENTO, LIMPEZA DE ÁREA E ESTOCAGEM DO MATERIAL DE LIMPEZA COM ARVORES DE DIÂMETRO ATÉ 0,15M",5501700,"M2",3000,{"$f":"VLOOKUP(A15,CPU!$A$1:$N$4656,9)","v":0.17700973964551081},{"$f":"VLOOKUP(A15,CPU!$A$1:$N$4656,10)","v":0.21634130379474331},{"$f":"ROUND(F15*H15,2)","v":649.02}]
["5.2","1.7","DESTOCAMENTO DE ÁRVORES COM DIAMETRO DE 0,15M a 0,30M",5501701,"UNID",180,{"$f":"VLOOKUP(A16,CPU!$A$1:$N$4656,9)","v":13.076626506024095},{"$f":"VLOOKUP(A16,CPU!$A$1:$N$4656,10)","v":15.982252915662649},2876.81]
["B",2,"PAVIMENTAÇÃO",{"$nulls":5},{"$f":"SUM(I18:I25)","v":133600.79999999999}]
[6,"2.1","ESCAVAÇÃO HORIZONTAL EM SOLO DE 1A CATEGORIA ",101116,"M3",3000.0008000000003,{"$f":"VLOOKUP(A18,CPU!$A$1:$N$4656,9)","v":2.0300000000000002},{"$f":"VLOOKUP(A18,CPU!$A$1:$N$4656,10)","v":2.48},{"$f":"ROUND(F18*H18,2)","v":7440}]
[7,"2.2","CARGA, MANOBRA E DESCARGA DE SOLOS E MATERIAIS GRANULARES EM CAMINHÃO BASCULANTE",100976,"M3",3000.0008000000003,{"$f":"VLOOKUP(A19,CPU!$A$1:$N$4656,9)","v":7.99},{"$f":"VLOOKUP(A19,CPU!$A$1:$N$4656,10)","v":9.77},29310.01]
[8,"2.3","REGULARIZAÇÃO E COMPACTAÇÃO DO SUBLEITO ",100577,"M2",7000,{"$f":"VLOOKUP(A20,CPU!$A$1:$N$4656,9)","v":1.1299999999999999},{"$f":"VLOOKUP(A20,CPU!$A$1:$N$4656,10)","v":1.38},9660]
[null,"2.4","CASCALHO DE CAVA - EXCLUSIVE TRANSPORTE","-","M3",1450,"FORNECIDO PELA PREFEITURA",null,"-"]
[9,"2.5","EXECUÇÃO E COMPACTAÇÃO DE BASE E OU SUB BASE PARA PAVIMENTAÇÃO EM CASCALHO - EXCLUSIVE SOLO, ESCAVAÇÃO, CARGA E TRANSPORTE.",96388,"M3",1449.998,{"$f":"VLOOKUP(A22,CPU!$A$1:$N$4656,9)","v":12.99},{"$f":"VLOOKUP(A22,CPU!$A$1:$N$4656,10)","v":15.88},23025.97]
[10,"2.6","IMPRIMAÇÃO COM EMULSÃO ASFÁLTICA (EAI)",96401,"M2",7000,{"$f":"VLOOKUP(A23,CPU!$A$1:$N$4656,9)","v":1.1200000000000001},{"$f":"VLOOKUP(A23,CPU!$A$1:$N$4656,10)","v":1.37},9590]
[11,"2.7","PINTURA DE LIGAÇÃO COM EMULSÃO ASFÁLTICA RR-1C",96402,"M2",6250,{"$f":"VLOOKUP(A24,CPU!$A$1:$N$4656,9)","v":0.93000000000000016},{"$f":"VLOOKUP(A24,CPU!$A$1:$N$4656,10)","v":1.1399999999999999},7125]
[12,"2.8","EXECUÇÃO DE PAVIMENTO COM APLICAÇÃO DE CONCRETO ASFÁLTICO USINADO A QUENTE (CBUQ), CAMADA DE ROLAMENTO - EXCLUSIVE TRANSPORTE",95995,"M3",320.00150000000002,{"$f":"VLOOKUP(A25,CPU!$A$1:$N$4656,9)","v":121.32},{"$f":"VLOOKUP(A25,CPU!$A$1:$N$4656,10)","v":148.28},47449.82]
["C",3,"TRANSPORTE DE MATERIAIS",{"$nulls":5},{"$f":"SUM(I27:I28)","v":87103.01999999999}]
[13,"3.1","TRANSPORTE COM CAMINHÃO BASCULANTE, EM VIA URBANA PAVIMENTADA",95877,"M3XKM",44000.004350000003,{"$f":"VLOOKUP(A27,CPU!$A$1:$N$4656,9)","v":1.6099999999999999},{"$f":"VLOOKUP(A27,CPU!$A$1:$N$4656,10)","v":1.97},{"$f":"ROUND(F27*H27,2)","v":86680.01}]
[14,"3.2","TRANSPORTE COM CAMINHÃO CARROCERIA 9T, EM VIA URBANA PAVIMENTADA",100947,"TXKM",180.00353296000003,{"$f":"VLOOKUP(A28,CPU!$A$1:$N$4656,9)","v":1.92},{"$f":"VLOOKUP(A28,CPU!$A$1:$N$4656,10)","v":2.35},{"$f":"ROUND(F28*H28,2)","v":423.01}]
["D",4,"TRANSPORTE DE MATERIAL ASFÁLTICO (BDI DIFERENCIADO)",{"$nulls":5},{"$f":"SUM(I30:I31)","v":109890}]
[15,"4.1","TRANSPORTE DE MASSA ASFÁLTICA COM CAMINHÃO BASCULANTE, EM VIA URBANA PAVIMENTADA (BDI DIFERENCIADO)",95427,"TXKM",144000,{"$f":"VLOOKUP(A30,CPU!$A$1:$N$4656,9)","v":0.64999999999999991},{"$f":"VLOOKUP(A30,CPU!$A$1:$N$4656,10)","v":0.75},{"$f":"ROUND(F30*H30,2)","v":108000}]
[16,"4.2","TRANSPORTE COM CAMINHÃO TANQUE DE TRANSPORTE DE MATERIAL ASFÁLTICO DE 30000 L, EM VIA URBANA PAVIMENTADA (BDI DIFERENCIADO)",102331,"TXKM",3500.0000000000005,{"$f":"VLOOKUP(A31,CPU!$A$1:$N$4656,9)","v":0.47},{"$f":"VLOOKUP(A31,CPU!$A$1:$N$4656,10)","v":0.54},{"$f":"ROUND(F31*H31,2)","v":1890}]
["E",5,"OBRAS COMPLEMENTARES",{"$nulls":5},{"$f":"SUM(I33:I34)","v":106608}]
[17,"5.1","GUIA (MEIO-FIO) E SARJETA CONJUGADOS DE CONCRETO, MOLDADA  IN LOCO  EM TRECHO RETO COM EXTRUSORA, 45 CM BASE (15 CM BASE DA GUIA + SARJETA (30 X 0,05))X 22 CM ALTURA","94267a","M",1450,{"$f":"VLOOKUP(A33,CPU!$A$1:$N$4656,9)","v":47.91},{"$f":"VLOOKUP(A33,CPU!$A$1:$N$4656,10)","v":58.56},{"$f":"ROUND(F33*H33,2)","v":84912}]
[18,"5.2","PINTURA DE EIXO VIÁRIO SOBRE ASFALTO COM TINTA RETRORREFLETIVA A BASE DE RESINA ACRÍLICA COM MICROESFERAS DE VIDRO, APLICAÇÃO MECÂNICA COM DEMARCADORA AUTOPROPELIDA - ESPESSURA DE 0,10 MM",102512,"M",3200,{"$f":"VLOOKUP(A34,CPU!$A$1:$N$4656,9)","v":5.5500000000000007},{"$f":"VLOOKUP(A34,CPU!$A$1:$N$4656,10)","v":6.78},21696]
["F",6,"FORNECIMENTOS - MATERIAL ASFÁLTICO (BDI DIFERENCIADO)",{"$nulls":5},{"$f":"SUM(I36:I38)","v":595258.77}]
[19,"6.1","AQUISIÇÃO DE EMULSÃO ASFÁLTICA PARA IMPRIMAÇÃO (EAI) - EXCLUSIVE TRANSPORTE","CPU.4","T",10,{"$f":"VLOOKUP(A36,CPU!$A$1:$N$4656,9)","v":2769.65},{"$f":"VLOOKUP(A36,CPU!$A$1:$N$4656,10)","v":3185.1},{"$f":"ROUND(F36*H36,2)","v":31851}]
[20,"6.2","AQUISIÇÃO DE EMULSAO ASFALTICA CATIONICA RR-1C - EXCLUSIVE TRANSPORTE","CPU.5","T",3.0024999999999999,{"$f":"VLOOKUP(A37,CPU!$A$1:$N$4656,9)","v":2837.6},{"$f":"VLOOKUP(A37,CPU!$A$1:$N$4656,10)","v":3263.24},{"$f":"ROUND(F37*H37,2)","v":9797.8799999999992}]
[21,"6.3","AQUISIÇÃO DE CONCRETO BETUMINOSO USINADO A QUENTE (CBUQ) PARA PAVIMENTACAO ASFALTICA, PADRAO DNIT, FAIXA C, COM CAP 50/70 - EXCLUSIVE TRANSPORTE","CPU.6","T",829.99983220000013,{"$f":"VLOOKUP(A38,CPU!$A$1:$N$4656,9)","v":580},{"$f":"VLOOKUP(A38,CPU!$A$1:$N$4656,10)","v":667},{"$f":"ROUND(F38*H38,2)","v":553609.89}]
[null,"TOTAL GERAL DA OBRA COM BDI ",{"$nulls":6},{"$f":"SUM(I9,I17,I26,I32,I35,I29)","v":1123586.3999999999}]

{"sheet":"CPU","index":1,"n_rows":353,"n_cols":13,"rows_kept":353,"cut":false,"hidden":false,"merged":[[93,1,93,6],[81,0,94,0],[95,0,108,0],[95,1,95,3],[95,4,95,7],[96,2,96,5],[97,2,97,3],[98,1,98,7],[104,1,104,3],[104,5,104,6],[105,1,105,6],[106,1,106,6],[107,1,107,6],[81,1,81,3],[81,4,81,7],[82,2,82,5],[83,2,83,3],[84,1,84,7],[90,1,90,3],[90,5,90,6],[91,1,91,6],[92,1,92,6],[0,0,13,0],[0,1,0,3],[0,4,0,7],[0,10,0,11],[1,2,1,5],[1,10,1,11],[2,2,2,3],[3,1,3,7],[9,1,9,3],[9,5,9,6],[10,1,10,6],[11,1,11,6],[12,1,12,6],[4,11,4,12],[14,0,32,0],[14,1,14,3],[14,4,14,7],[14,10,14,11],[15,2,15,5],[15,8,16,9],[16,2,16,3],[17,1,17,7],[28,1,28,3],[28,5,28,6],[29,1,29,6],[30,1,30,6],[31,1,31,6],[33,0,46,0],[33,1,33,3],[33,4,33,7],[33,10,33,11],[34,2,34,5],[34,8,35,9],[35,2,35,3],[36,1,36,7],[42,1,42,3],[42,5,42,6],[43,1,43,6],[44,1,44,6],[45,1,45,6],[47,0,64,0],[47,1,47,3],[47,4,47,7],[47,10,47,11],[48,2,48,5],[49,2,49,3],[50,1,50,7],[60,1,60,3],[60,5,60,6],[61,1,61,6],[62,1,62,6],[63,1,63,6],[65,0,80,0],[65,1,65,3],[65,4,65,7],[65,10,65,11],[66,2,66,5],[67,2,67,3],[68,1,68,7],[76,1,76,3],[76,5,76,6],[77,1,77,6],[78,1,78,6],[79,1,79,6],[109,0,121,0],[109,1,109,3],[109,4,109,7],[109,10,109,11],[110,2,110,5],[111,2,111,3],[112,1,112,7],[117,1,117,3],[117,5,117,6],[118,1,118,6],[119,1,119,6],[120,1,120,6],[122,0,134,0],[122,1,122,3],[122,4,122,7],[123,2,123,5],[124,2,124,3],[125,1,125,7],[131,1,131,3],[131,5,131,6],[132,1,132,6],[133,1,133,6],[134,1,134,6],[136,0,153,0],[136,1,136,3],[136,4,136,7],[136,10,136,11],[137,2,137,5],[138,2,138,3],[139,1,139,7],[149,1,149,3],[149,5,149,6],[150,1,150,6],[151,1,151,6],[152,1,152,6],[154,0,171,0],[154,1,154,3],[154,4,154,7],[155,2,155,5],[156,2,156,3],[157,1,157,7],[168,1,168,3],[168,5,168,6],[169,1,169,6],[170,1,170,6],[171,1,171,6],[173,0,191,0],[173,1,173,3],[173,4,173,7],[173,10,173,11],[174,2,174,5],[175,2,175,3],[176,1,176,7],[187,1,187,3],[187,5,187,6],[188,1,188,6],[189,1,189,6],[190,1,190,6],[192,0,210,0],[192,1,192,3],[192,4,192,7],[192,10,192,11],[193,2,193,5],[194,2,194,3],[195,1,195,7],[206,1,206,3],[206,5,206,6],[207,1,207,6],[208,1,208,6],[209,1,209,6],[211,0,232,0],[211,1,211,3],[211,4,211,7],[211,10,211,11],[212,2,212,5],[213,2,213,3],[214,1,214,7],[228,1,228,3],[228,5,228,6],[229,1,229,6],[230,1,230,6],[231,1,231,6],[233,0,244,0],[233,1,233,3],[233,4,233,7],[233,10,233,11],[234,2,234,5],[235,2,235,3],[236,1,236,7],[241,1,241,3],[241,5,241,6],[242,1,242,6],[243,1,243,6],[244,1,244,6],[246,0,257,0],[246,1,246,3],[246,4,246,7],[247,2,247,5],[248,2,248,3],[249,1,249,7],[254,1,254,3],[254,5,254,6],[255,1,255,6],[256,1,256,6],[257,1,257,6],[259,0,270,0],[259,1,259,3],[259,4,259,7],[260,2,260,5],[261,2,261,3],[262,1,262,7],[267,1,267,3],[267,5,267,6],[268,1,268,6],[269,1,269,6],[270,1,270,6],[272,0,283,0],[272,1,272,3],[272,4,272,7],[272,10,272,11],[273,2,273,5],[274,2,274,3],[275,1,275,7],[279,1,279,3],[279,5,279,6],[280,1,280,6],[281,1,281,6],[282,1,282,6],[284,0,301,0],[284,1,284,3],[284,4,284,7],[284,10,284,11],[285,2,285,5],[286,2,286,3],[287,1,287,7],[289,12,297,15],[298,1,298,3],[298,5,298,6],[299,1,299,6],[300,1,300,6],[301,1,301,6],[289,9,289,10],[303,0,319,0],[303,1,303,3],[303,4,303,7],[304,2,304,5],[305,2,305,3],[306,1,306,7],[316,1,316,3],[316,5,316,6],[317,1,317,6],[318,1,318,6],[319,1,319,6],[321,0,330,0],[321,1,321,3],[321,4,321,7],[322,2,322,5],[323,2,323,3],[324,1,324,7],[327,1,327,3],[327,5,327,6],[328,1,328,6],[329,1,329,6],[330,1,330,6],[332,0,341,0],[332,1,332,3],[332,4,332,7],[333,2,333,5],[334,2,334,3],[335,1,335,7],[338,1,338,3],[338,5,338,6],[339,1,339,6],[340,1,340,6],[341,1,341,6],[343,0,352,0],[343,1,343,3],[343,4,343,7],[344,2,344,5],[345,2,345,3],[346,1,346,7],[349,1,349,3],[349,5,349,6],[350,1,350,6],[351,1,351,6],[352,1,352,6]]}
[1,"CODEVASF",null,null," COMPOSIÇÃO DE PREÇO UNITÁRIO",null,null,null,{"$f":"H11","v":11856.48},{"$f":"H13","v":14490.99},"BDI CALCULADO:",null,{"$f":"ORÇAMENTO!I6","v":0.22219999999999998}]
[null,"OBRA:  ",{"$f":"ORÇAMENTO!C5","v":" PAVIMENTAÇÃO ASFÁLTICA EM CBUQ –  SAÍDA PARA COMUNIDADE DE SUCURIU DE BAIXO  - ITEM 03 - (MORADA NOVA DE MINAS / MG)"},null,null,null,"DATA: ",{"$f":"ORÇAMENTO!C6","v":" AGOSTO / 2023   "},null,null,"BDI DIFERENCIADO:",null,{"$f":"'BDI FORN'!D31/100","v":0.15}]
[null,"SERVIÇO:  ",{"$f":"VLOOKUP(A1,ORÇAMENTO!A10:I33,3)","v":"MOBILIZAÇÃO E DESMOBILIZAÇÃO"},null,"Referência:",{"$f":"VLOOKUP(A1,ORÇAMENTO!$A$10:$I$33,4)","v":"CPU.1"},"UNIDADE: ",{"$f":"VLOOKUP(A1,ORÇAMENTO!A10:I33,5)","v":"GL"}]
[]
[null,"TIPO ITEM","CODIGO ITEM","DESCRIÇÃO ITEM","UNIDADE ITEM","COEFICIENTE","PRECO UNITARIO","CUSTO TOTAL"]
[null,"COMPOSICAO",89876,"CAMINHÃO BASCULANTE 14 M3, COM CAVALO MECÂNICO DE CAPACIDADE MÁXIMA DE TRAÇÃO COMBINADO DE 36000 KG, POTÊNCIA 286 CV, INCLUSIVE SEMIREBOQUE COM CAÇAMBA METÁLICA","CHP DIURNO.",8,286.2,{"$f":"ROUNDDOWN(F6*G6,2)","v":2289.6}]
[null,"COMPOSICAO",89877,"CAMINHÃO BASCULANTE 14 M3, COM CAVALO MECÂNICO DE CAPACIDADE MÁXIMA DE TRAÇÃO COMBINADO DE 36000 KG, POTÊNCIA 286 CV, INCLUSIVE SEMIREBOQUE COM CAÇAMBA METÁLICA","CHI DIURNO.",8,82.81,{"$f":"ROUNDDOWN(F7*G7,2)","v":662.48}]
[null,"COMPOSICAO",5914640,"TRANSPORTE COM CAVALO MECÂNICO COM SEMIRREBOQUE COM CAPACIDADE DE 30 T - RODOVIA PAVIMENTADA","T.KM",4112,0.56999999999999995,{"$f":"ROUNDDOWN(F8*G8,2)","v":2343.84}]
[null,"COMPOSIÇÃO",88316,"SERVENTE COM ENCARGOS COMPLEMENTARES","H",32,19.760000000000002,{"$f":"ROUNDDOWN(F9*G9,2)","v":632.32000000000005}]
[null,"PRODUÇÃO DA EQUIPE",null,null,0.5,"CUSTO ",null,{"$f":"SUM(H6:H9)","v":5928.24}]
[null,"TOTAL",{"$nulls":5},{"$f":"H10/E10","v":11856.48},"OK"]
[null,"BDI                %",{"$nulls":5},{"$f":"1+$M$1","v":1.2222}]
[null,"TOTAL DO SERVIÇO - R$",{"$nulls":5},{"$f":"ROUND(H11*H12,2)","v":14490.99}]
[]
[2,"CODEVASF",null,null," COMPOSIÇÃO DE PREÇO UNITÁRIO",null,null,null,{"$f":"H30","v":46517.68},{"$f":"H32","v":56853.91}]
[null,"OBRA:  ",{"$f":"$C$2","v":" PAVIMENTAÇÃO ASFÁLTICA EM CBUQ –  SAÍDA PARA COMUNIDADE DE SUCURIU DE BAIXO  - ITEM 03 - (MORADA NOVA DE MINAS / MG)"},null,null,null,"DATA: ",{"$f":"$H$2","v":" AGOSTO / 2023   "}]
[null,"SERVIÇO:  ",{"$f":"VLOOKUP(A15,ORÇAMENTO!$A$10:$I$33,3)","v":"ADMINISTRAÇÃO LOCAL"},null,"SINAPI",{"$f":"VLOOKUP(A15,ORÇAMENTO!$A$10:$I$33,4)","v":"CPU.2"},"UNIDADE: ",{"$f":"VLOOKUP(A15,ORÇAMENTO!$A$10:$I$33,5)","v":"GL"}]
[]
[null,"TIPO ITEM","CODIGO ITEM","DESCRIÇÃO ITEM","UNIDADE ITEM","COEFICIENTE","PRECO UNITARIO","CUSTO TOTAL"]
[null,"INSUMO",14250,"ENERGIA ELÉTRICA","kwh",40,0.95,{"$f":"ROUNDDOWN(F20*G20,2)","v":38}]
[null,"INSUMO",44480,"TARIFA \"A\" - ÁGUA/ESGOTO ","m³",{"$f":"6","v":6},17.97,107.82]
[null,"COTAÇÃO","MERC.","TELEFONE (PLANO CONTROLE)","UNID",2,59.9,119.8]
[null,"INSUMO","ED-50155 SEINFRA","BANHEIRO QUÍMICO 110 X 120 X 230 CM COM MANUTENÇÃO (CONSIDERANDO OBRAS SIMULTÂNEAS)","MÊS",2,515,1030]
[null,"COMPOSICAO",90777,"Engenheiro Civil Júnior com encargos complementares","H",30,114.12,3423.6]
[null,"COMPOSICAO",90776,"Encarregado Geral com encargos complementares","H",60,57.73,3463.8]
[null,"COMPOSICAO",88321,"Tecnico de Laboratório com encargos complementares","H",30,45.45,1363.5]
[null,"COMPOSICAO",100309,"Tecnico em Segurança do Trabalho com encargos complementares","H",30,45.71,{"$f":"ROUNDDOWN(F27*G27,2)","v":1371.3}]
[null,"COMPOSICAO",90772,"Auxiliar de escritório com encargos complementares","H",30,23.72,711.6]
[null,"PRODUÇÃO DA EQUIPE",null,null,{"$f":"1/4","v":0.25},"CUSTO ",null,{"$f":"SUM(H20:H28)","v":11629.42}]
[null,"TOTAL",{"$nulls":5},{"$f":"ROUND(H29/E29,2)","v":46517.68},"OK"]
[null,"BDI                %",{"$nulls":5},{"$f":"1+$M$1","v":1.2222}]
[null,"TOTAL DO SERVIÇO - R$",{"$nulls":5},{"$f":"ROUND(H30*H31,2)","v":56853.91}]
[]
[{"$f":"A15+1","v":3},"CODEVASF",null,null," COMPOSIÇÃO DE PREÇO UNITÁRIO",null,null,null,{"$f":"H44","v":9957},{"$f":"H46","v":12169.45}]
[null,"OBRA:  ",{"$f":"$C$2","v":" PAVIMENTAÇÃO ASFÁLTICA EM CBUQ –  SAÍDA PARA COMUNIDADE DE SUCURIU DE BAIXO  - ITEM 03 - (MORADA NOVA DE MINAS / MG)"},null,null,null,"DATA: ",{"$f":"$H$2","v":" AGOSTO / 2023   "}]
[null,"SERVIÇO:  ",{"$f":"VLOOKUP(A34,ORÇAMENTO!$A$10:$I$33,3)","v":"CANTEIRO DE OBRAS"},null,"SINAPI",{"$f":"VLOOKUP(A34,ORÇAMENTO!$A$10:$I$33,4)","v":"CPU.3"},"UNIDADE: ",{"$f":"VLOOKUP(A34,ORÇAMENTO!$A$10:$I$33,5)","v":"GL"}]
[]
[null,"TIPO ITEM","CODIGO ITEM","DESCRIÇÃO ITEM","UNIDADE ITEM","COEFICIENTE","PRECO UNITARIO","CUSTO TOTAL"]
[null,"INSUMO",10775,"ALUGUEL DE IMÓVEL OU CONTEINER QUE ATENDA AOS REQUISITOS MÍNIMOS PARA INSTALAÇÃO DO CANTEIRO DE OBRAS","MÊS",4,"995,00",{"$f":"ROUNDDOWN(F39*G39,2)","v":3980}]
[null,"INSUMO",10779,"LOCACAO DE CONTAINER 2,30 X 4,30 M, ALT. 2,50 M, P/ SANITARIO, C/ 5 BACIAS, 1 LAVATORIO E 4 MICTORIOS","MÊS",4,1234.75,{"$f":"ROUNDDOWN(F40*G40,2)","v":4939}]
{"$rows_left_out":314}
{"sheet":"BDI SERV","index":2,"n_rows":37,"n_cols":5,"rows_kept":37,"cut":false,"hidden":false,"merged":[[31,1,31,2],[32,0,34,5],[36,0,36,5],[0,1,2,4],[3,1,4,1],[3,2,4,2],[28,0,28,5],[30,1,30,2]]}
[null,"DETALHAMENTO DO BDI - SERVIÇOS"]
[]
[]
[null,"Item","Descrição dos Serviços","%","%"]
[null,null,null,"PV","CD"]
[]
[null,1,"ADMINISTRAÇÃO CENTRAL"," ",4.01]
[null,"1.1","ESCRITÓRIO CENTRAL"," "," "]
[null,"1.2","VIAGENS"," "," "]
[null,"1.3","OUTROS"," "," "]
[null," "," "," "," "]
[null,2,"IMPOSTOS E TAXAS",{"$f":"SUM(D13:D16)","v":6.65},{"$f":"SUM(E13:E16)","v":8.31}]
[null,"2.1","ISS (*)",3,{"$f":"ROUND(D13*1.2515,2)","v":3.75}]
[null,"2.2","PIS",0.65,{"$f":"ROUND(D14*1.2515,2)","v":0.81}]
[null,"2.3","Cofins",3,{"$f":"ROUND(D15*1.2515,2)","v":3.75}]
[null,"2.4","CONTRIBUIÇÃO PREVIDENCIÁRIA SOBRE A RENDA BRUTA",0,{"$f":"ROUND(D16*1.2515,2)","v":0}]
[]
[null,3,"TAXA DE RISCO"," ",{"$f":"SUM(E19:E22)","v":0.96}]
[null,"3.1","SEGURO",null,0.2]
[null,"3.2","RISCO",null,0.56000000000000005]
[null,"3.3","GARANTIA",null,0.2]
[]
[null,4,"DESPESAS FINANCEIRAS"," ",1.1100000000000001]
[]
[null,5,"LUCRO",null,7.5]
[]
[null," ","BDI - CALCULADO"," ",{"$f":"ROUND((((1+(E7+E18)/100)*(1+E23/100)*(1+E25/100)/(1-D12/100)-1)*100),2)","v":22.22}]
[]
["BDI = ((1+((AC+S+R+G)/100))x(1+DF/100)x(1+L/100)/(1-I/100)-1)*100"]
[]
[null,"BDI (CALCULADO):",null,{"$f":"ROUND((((1+((E7+E18)/100))*(1+E23/100)*(1+E25/100))/(1-D12/100)-1)*100,2)","v":22.22},"%"]
[null," "]
["(*) ISS CONFORME LEI 2.226/2017 e LEI COMPLEMENTAR Nº 116/2003 - \nConsiderando as deduções previstas no Art. 106 - § 5º (Alíquota sobre 50% do valor dos serviços)"]
[]
[]
[]
["BDI EM CONFORMIDADE COM OS ACÓRDÃOS Nº 2369/2011 e ACÓRDÃO Nº 2.622/2013 - TCU - PLENÁRIO"]

{"sheet":"BDI FORN","index":3,"n_rows":37,"n_cols":5,"rows_kept":37,"cut":false,"hidden":false,"merged":[[31,1,31,2],[32,0,34,5],[36,0,36,5],[0,1,2,4],[3,1,4,1],[3,2,4,2],[28,0,28,5],[30,1,30,2]]}
[null,"DETALHAMENTO DO BDI - FORNECIMENTO \n(MATERIAL ASFÁLTICO)"]
[]
[]
[null,"Item","Descrição dos Serviços","%","%"]
[null,null,null,"PV","CD"]
[]
[null,1,"ADMINISTRAÇÃO CENTRAL"," ",3.72]
[null,"1.1","ESCRITÓRIO CENTRAL"," "," "]
[null,"1.2","VIAGENS"," "," "]
[null,"1.3","OUTROS"," "," "]
[null," "," "," "," "]
[null,2,"IMPOSTOS E TAXAS",{"$f":"SUM(D13:D16)","v":3.65},{"$f":"SUM(E13:E16)","v":4.5600000000000005}]
[null,"2.1","ISS (*)",null,{"$f":"ROUND(D13*1.2515,2)","v":0}]
[null,"2.2","PIS",0.65,{"$f":"ROUND(D14*1.2515,2)","v":0.81}]
[null,"2.3","Cofins",3,{"$f":"ROUND(D15*1.2515,2)","v":3.75}]
[null,"2.4","CONTRIBUIÇÃO PREVIDENCIÁRIA SOBRE A RENDA BRUTA",0,{"$f":"ROUND(D16*1.2515,2)","v":0}]
[]
[null,3,"TAXA DE RISCO"," ",{"$f":"SUM(E19:E22)","v":0.82000000000000006}]
[null,"3.1","SEGURO",null,0.16]
[null,"3.2","RISCO",null,0.5]
[null,"3.3","GARANTIA",null,0.16]
[]
[null,4,"DESPESAS FINANCEIRAS"," ",0.94]
[]
[null,5,"LUCRO",null,5]
[]
[null," ","BDI - CALCULADO"," ",{"$f":"ROUND((((1+(E7+E18)/100)*(1+E23/100)*(1+E25/100)/(1-D12/100)-1)*100),2)","v":15}]
[]
["BDI = ((1+((AC+S+R+G)/100))x(1+DF/100)x(1+L/100)/(1-I/100)-1)*100"]
[]
[null,"BDI (CALCULADO):",null,{"$f":"ROUND((((1+((E7+E18)/100))*(1+E23/100)*(1+E25/100))/(1-D12/100)-1)*100,2)","v":15},"%"]
[null," "]
[]
[]
[]
[]
["BDI EM CONFORMIDADE COM OS ACÓRDÃOS Nº 2369/2011 e ACÓRDÃO Nº 2.622/2013 - TCU - PLENÁRIO"]

{"sheet":"CRONOGRAMA","index":4,"n_rows":21,"n_cols":10,"rows_kept":21,"cut":false,"hidden":false,"merged":[[0,1,0,9],[1,1,2,1],[1,2,2,4],[1,6,1,9],[2,6,2,9],[3,1,3,8],[5,0,6,0],[5,1,6,1],[5,2,6,2],[7,0,8,0],[7,1,8,1],[7,2,8,2],[9,0,10,0],[9,1,10,1],[9,2,10,2],[11,0,12,0],[11,1,12,1],[11,2,12,2],[17,1,18,2],[20,1,24,9],[13,0,14,0],[13,1,14,1],[13,2,14,2],[15,0,16,0],[15,1,16,1],[15,2,16,2]]}
[null,"CRONOGRAMA FÍSICO-FINANCEIRO"]
[null,"OBRA: ",{"$f":"ORÇAMENTO!C5","v":" PAVIMENTAÇÃO ASFÁLTICA EM CBUQ –  SAÍDA PARA COMUNIDADE DE SUCURIU DE BAIXO  - ITEM 03 - (MORADA NOVA DE MINAS / MG)"},null,null,"VALOR:",{"$f":"ORÇAMENTO!I39","v":1123586.3999999999}]
[{"$nulls":5},"PRAZO: ","120 DIAS "]
[]
[null,"ITEM","ETAPAS/DESCRIÇAO","FISICO/  FINANCEIRO","TOTAL    ETAPAS","MÊS 1","MÊS 2","MÊS 3","MÊS 4","TOTAL"]
["A",{"$f":"VLOOKUP(A6,ORÇAMENTO!$A$9:$I$39,2)","v":"1.7"},{"$f":"VLOOKUP(A6,ORÇAMENTO!$A$9:$I$39,3)","v":"DESTOCAMENTO DE ÁRVORES COM DIAMETRO DE 0,15M a 0,30M"},"FISICO ",{"$f":"ROUND(E7/$G$2,4)","v":8.1100000000000005E-2},0.35,0.2,0.2,0.25,{"$f":"SUM(F6:I6)","v":1}]
[null,null,null,"FINANCEIRO",{"$f":"ORÇAMENTO!I9","v":91125.810000000012},{"$f":"ROUND($E$7*F6,2)","v":31894.03},18225.16,18225.16,22781.45,{"$f":"SUM(F7:I7)","v":91125.8}]
["B",{"$f":"VLOOKUP(A8,ORÇAMENTO!$A$9:$I$39,2)","v":2},{"$f":"VLOOKUP(A8,ORÇAMENTO!$A$9:$I$39,3)","v":"PAVIMENTAÇÃO"},"FISICO ",{"$f":"ROUND(E9/$G$2,4)","v":0.11890000000000001},0.3,0.3,0.25,0.15,{"$f":"SUM(F8:I8)","v":1}]
[null,null,null,"FINANCEIRO",{"$f":"ORÇAMENTO!I17","v":133600.79999999999},{"$f":"ROUND($E$9*F8,2)","v":40080.239999999998},40080.239999999998,33400.199999999997,20040.12,{"$f":"SUM(F9:I9)","v":133600.79999999999}]
["C",{"$f":"VLOOKUP(A10,ORÇAMENTO!$A$9:$I$39,2)","v":3},{"$f":"VLOOKUP(A10,ORÇAMENTO!$A$9:$I$39,3)","v":"TRANSPORTE DE MATERIAIS"},"FISICO ",{"$f":"ROUND(E11/$G$2,4)","v":7.7499999999999999E-2},0.3,0.25,0.25,0.2,{"$f":"SUM(F10:I10)","v":1}]
[null,null,null,"FINANCEIRO",{"$f":"ORÇAMENTO!I26","v":87103.01999999999},{"$f":"ROUND($E$11*F10,2)","v":26130.91},21775.759999999998,21775.759999999998,17420.599999999999,{"$f":"SUM(F11:I11)-0.04","v":87102.99}]
["D",{"$f":"VLOOKUP(A12,ORÇAMENTO!$A$9:$I$39,2)","v":4},{"$f":"VLOOKUP(A12,ORÇAMENTO!$A$9:$I$39,3)","v":"TRANSPORTE DE MATERIAL ASFÁLTICO (BDI DIFERENCIADO)"},"FISICO ",{"$f":"ROUND(E13/$G$2,4)","v":9.7799999999999998E-2},null,0.15,0.55000000000000004,0.3,{"$f":"SUM(F12:I12)","v":1}]
[null,null,null,"FINANCEIRO",{"$f":"ORÇAMENTO!I29","v":109890},{"$f":"ROUND($E$13*F12,2)","v":0},16483.5,60439.5,32967,{"$f":"SUM(F13:I13)-0.02","v":109889.98}]
["E",{"$f":"VLOOKUP(A14,ORÇAMENTO!$A$9:$I$39,2)","v":5},{"$f":"VLOOKUP(A14,ORÇAMENTO!$A$9:$I$39,3)","v":"OBRAS COMPLEMENTARES"},"FISICO ",{"$f":"ROUND(E15/$G$2,4)","v":9.4899999999999998E-2},null,null,0.15,0.85,{"$f":"SUM(F14:I14)","v":1}]
[null,null,null,"FINANCEIRO",{"$f":"ORÇAMENTO!I32","v":106608},{"$f":"ROUND($E$15*F14,2)","v":0},0,15991.2,90616.8,{"$f":"SUM(F15:I15)-0.02","v":106607.98}]
["F",{"$f":"VLOOKUP(A16,ORÇAMENTO!$A$9:$I$39,2)","v":6},{"$f":"VLOOKUP(A16,ORÇAMENTO!$A$9:$I$39,3)","v":"FORNECIMENTOS - MATERIAL ASFÁLTICO (BDI DIFERENCIADO)"},"FISICO ",{"$f":"ROUND(E17/$G$2,4)","v":0.52980000000000005},null,0.15,0.55000000000000004,0.3,{"$f":"SUM(F16:I16)","v":1}]
[null,null,null,"FINANCEIRO",{"$f":"ORÇAMENTO!I35","v":595258.77},{"$f":"ROUND($E$17*F16,2)","v":0},89288.82,327392.32,178577.63,{"$f":"SUM(F17:I17)-0.02","v":595258.75}]
[null,"TOTAL",null,"FISICO ",{"$f":"SUM(F18:I18)","v":1},{"$f":"F19/$E$19","v":8.7314317795231411E-2},0.16541093769023907,0.4247329266356375,0.32254181787889208,{"$f":"SUM(F18:I18)","v":1}]
[null,null,null,"FINANCEIRO",{"$f":"E11+E9+E7+E13+E17+E15","v":1123586.3999999999},98105.18,185853.48,477224.14,362403.6,{"$f":"SUM(F19:I19)","v":1123586.3999999999}]
[]
[null,"OBSERVAÇÕES:"]