{"text_format":"2","workbook":"xlsx","n_sheets":5,"sheets":["ORÇAMENTO","CPU","BDI SERV","BDI FORN","CRONOGRAMA"],"not_rendered":{"charts":0,"images":2,"macros":0,"external_links":0,"defined_names":5,"comments":1,"pivot_tables":0},"unopened":[],"bounds":{"document_bytes":16777216,"sheet_cells":100000,"run_cost":"one","rows_first":2000,"rows_last":500,"rows_between":2000,"halvings":0,"cell_chars":16384,"cell_head_chars":4096},"cells_cut":0,"cells_raw":0,"read":"whole","date_system":"1900"}

{"sheet":"ORÇAMENTO","index":0,"n_rows":37,"n_cols":9,"rows_kept":37,"cut":false,"hidden":false,"merged":[[6,1,6,2],[6,6,6,7],[36,1,36,2],[0,0,7,0],[0,2,0,8],[1,2,1,8],[2,2,2,8],[4,2,4,8],[5,6,5,7]]}
["<---- NUMERAR SERVIÇOS PARA CPU",null,"Ministério do Desenvolvimento Regional"]
[null,null,"Companhia de Desenvolvimento dos Vales do São Francisco e do Parnaíba"]
[null,null,"1ª Superintendência Regional"]
[]
[null,"OBRA: "," PAVIMENTAÇÃO ASFÁLTICA EM CBUQ - VIAS DIVERSAS - COMUNIDADE PERNAMBUCO (PIRAPORA / MG)"]
[null,"DATA:"," AGOSTO / 2023   ",null,null,null,"BDI Serviços:",null,{"$f":"'BDI SERV'!D31/100","v":0.21350000000000002}]
[null,"PRAZO DE EXECUÇÃO:     120 DIAS",{"$nulls":4},"BDI Serviços:",null,{"$f":"'BDI FORN'!D31/100","v":0.15}]
[null,"ITEM","DISCRIMINAÇÃO","REFER.","UNID.","QUANT.","P. UNITÁRIO","P.UNIT.C/ BDI","P. TOTAL"]
["A",1,"SERVIÇOS PRELIMINARES ",{"$nulls":5},{"$f":"SUM(I10:I14)","v":139598.29}]
[1,"1.1","MOBILIZAÇÃO E DESMOBILIZAÇÃO","CPU.1","GL",1,{"$f":"VLOOKUP(A10,CPU!$A$1:$N$4671,9)","v":15927.66},{"$f":"VLOOKUP(A10,CPU!$A$1:$N$4671,10)","v":19328.22},{"$f":"ROUND(F10*H10,2)","v":19328.22}]
[2,"1.2","ADMINISTRAÇÃO LOCAL","CPU.2","GL",1,{"$f":"VLOOKUP(A11,CPU!$A$1:$N$4671,9)","v":83539},{"$f":"VLOOKUP(A11,CPU!$A$1:$N$4671,10)","v":101374.58},{"$f":"ROUND(F11*H11,2)","v":101374.58}]
[3,"1.3","CANTEIRO DE OBRAS","CPU.3","GL",1,{"$f":"VLOOKUP(A12,CPU!$A$1:$N$4671,9)","v":13427.4},{"$f":"VLOOKUP(A12,CPU!$A$1:$N$4671,10)","v":16294.15},{"$f":"ROUND(F12*H12,2)","v":16294.15}]
[4,"1.4","PLACA DE OBRA EM CHAPA DE AÇO GALVANIZADO",103689,"M2",3,{"$f":"VLOOKUP(A13,CPU!$A$1:$N$4671,9)","v":340.97999999999996},{"$f":"VLOOKUP(A13,CPU!$A$1:$N$4671,10)","v":413.78},{"$f":"ROUND(F13*H13,2)","v":1241.3399999999999}]
[5,"1.5","LOCAÇÃO DE PAVIMENTAÇÃO",99064,"M",1700,{"$f":"VLOOKUP(A14,CPU!$A$1:$N$4671,9)","v":0.66},{"$f":"VLOOKUP(A14,CPU!$A$1:$N$4671,10)","v":0.8},{"$f":"ROUND(F14*H14,2)","v":1360}]
["B",2,"TERRAPLANAGEM E PAVIMENTAÇÃO",{"$nulls":5},{"$f":"SUM(I16:I22)","v":380771.64999999997}]
[6,"2.1","ESCAVAÇÃO HORIZONTAL EM SOLO DE 1A CATEGORIA ",101116,"M3",4200,{"$f":"VLOOKUP(A16,CPU!$A$1:$N$4671,9)","v":1.87},{"$f":"VLOOKUP(A16,CPU!$A$1:$N$4671,10)","v":2.27},{"$f":"ROUND(F16*H16,2)","v":9534}]
[7,"2.2","CARGA, MANOBRA E DESCARGA DE SOLOS E MATERIAIS GRANULARES EM CAMINHÃO BASCULANTE",100976,"M3",4200,{"$f":"VLOOKUP(A17,CPU!$A$1:$N$4671,9)","v":6.49},{"$f":"VLOOKUP(A17,CPU!$A$1:$N$4671,10)","v":7.88},{"$f":"ROUND(F17*H17,2)","v":33096}]
[8,"2.3","REGULARIZAÇÃO E COMPACTAÇÃO DO SUBLEITO ",100577,"M2",13600,{"$f":"VLOOKUP(A18,CPU!$A$1:$N$4671,9)","v":1.08},{"$f":"VLOOKUP(A18,CPU!$A$1:$N$4671,10)","v":1.31},17816]
[9,"2.4","EXECUÇÃO E COMPACTAÇÃO DE BASE E OU SUB-BASE PARA PAVIMENTAÇÃO DE SOLO BRITA - 50/50 - EXCLUSIVE SOLO, ESCAVAÇÃO, CARGA E TRANSPORTE",100565,"M3",2040,{"$f":"VLOOKUP(A19,CPU!$A$1:$N$4671,9)","v":96.6},{"$f":"VLOOKUP(A19,CPU!$A$1:$N$4671,10)","v":117.22},239128.8]
[10,"2.5","IMPRIMAÇÃO COM EMULSÃO ASFÁLTICA (EAI)",96401,"M2",13600,{"$f":"VLOOKUP(A20,CPU!$A$1:$N$4671,9)","v":1.1100000000000001},{"$f":"VLOOKUP(A20,CPU!$A$1:$N$4671,10)","v":1.35},18360]
[11,"2.6","PINTURA DE LIGAÇÃO COM EMULSÃO ASFÁLTICA RR-2C",96402,"M2",12100,{"$f":"VLOOKUP(A21,CPU!$A$1:$N$4671,9)","v":0.91000000000000014},{"$f":"VLOOKUP(A21,CPU!$A$1:$N$4671,10)","v":1.1000000000000001},13310]
[12,"2.7","EXECUÇÃO DE PAVIMENTO COM APLICAÇÃO DE CONCRETO ASFÁLTICO USINADO A QUENTE (CBUQ), CAMADA DE ROLAMENTO - EXCLUSIVE TRANSPORTE",95995,"M3",365,{"$f":"VLOOKUP(A22,CPU!$A$1:$N$4671,9)","v":111.82000000000001},{"$f":"VLOOKUP(A22,CPU!$A$1:$N$4671,10)","v":135.69},49526.85]
["C",3,"TRANSPORTE DE MATERIAIS",{"$nulls":5},{"$f":"SUM(I24:I27)","v":387492}]
[13,"3.1","TRANSPORTE COM CAMINHÃO BASCULANTE, EM VIA URBANA PAVIMENTADA",95877,"M3XKM",89999.997400000007,{"$f":"VLOOKUP(A24,CPU!$A$1:$N$4671,9)","v":1.6199999999999999},{"$f":"VLOOKUP(A24,CPU!$A$1:$N$4671,10)","v":1.97},{"$f":"ROUND(F24*H24,2)","v":177299.99}]
[13.5,"3.2","TRANSPORTE COM CAMINHÃO BASCULANTE, EM VIA URBANA PAVIMENTADA - ADICIONAL PARA DMT EXCEDENTE A 30KM",95427,"M3XKM",255000,{"$f":"VLOOKUP(A25,CPU!$A$1:$N$4671,9)","v":0.65999999999999992},{"$f":"VLOOKUP(A25,CPU!$A$1:$N$4671,10)","v":0.8},{"$f":"ROUND(F25*H25,2)","v":204000}]
[14,"3.3","TRANSPORTE COM CAMINHÃO CARROCERIA 9T, EM VIA URBANA PAVIMENTADA",100947,"TXKM",800.00490816000013,{"$f":"VLOOKUP(A26,CPU!$A$1:$N$4671,9)","v":1.93},{"$f":"VLOOKUP(A26,CPU!$A$1:$N$4671,10)","v":2.34},{"$f":"ROUND(F26*H26,2)","v":1872.01}]
[15,"3.4","TRANSPORTE COM CAMINHÃO TANQUE DE TRANSPORTE DE MATERIAL ASFÁLTICO DE 30000 L, EM VIA URBANA PAVIMENTADA (BDI DIFERENCIADO)",102331,"TXKM",8000,{"$f":"VLOOKUP(A27,CPU!$A$1:$N$4671,9)","v":0.47},{"$f":"VLOOKUP(A27,CPU!$A$1:$N$4671,10)","v":0.54},{"$f":"ROUND(F27*H27,2)","v":4320}]
["D",4,"OBRAS COMPLEMENTARES",{"$nulls":5},{"$f":"SUM(I29:I32)","v":276830.06}]
[16,"4.1","GUIA (MEIO-FIO) E SARJETA CONJUGADOS DE CONCRETO, MOLDADA IN LOCO COM EXTRUSORA, 45 CM BASE (15 CM BASE DA GUIA + 30 CM BASE DA SARJETA) X 22 CM ALTURA",94267,"M",3400,{"$f":"VLOOKUP(A29,CPU!$A$1:$N$4671,9)","v":57.379999999999988},{"$f":"VLOOKUP(A29,CPU!$A$1:$N$4671,10)","v":69.63},{"$f":"ROUND(F29*H29,2)","v":236742}]
[17,"4.2","FORNECIMENTO E INSTALAÇÃO DE PLACA DE SINALIZAÇÃO VIÁRIA - REGULAMENTAÇÃO OCTOGONAL (PARE) 0,60MX0,60M","CPU.4","UN.",7,{"$f":"VLOOKUP(A30,CPU!$A$1:$N$4671,9)","v":444.46000000000004},{"$f":"VLOOKUP(A30,CPU!$A$1:$N$4671,10)","v":539.35},{"$f":"ROUND(F30*H30,2)","v":3775.45}]
[18,"4.3","FORNECIMENTO E INSTALAÇÃO DE PLACA DE IDENTIFICACAO DE RUA EM CHAPA DE AÇO PINTADA COM PELÍCULA DE ALTA INTENSIDADE, 45 CM X 20 CM - INCLUSIVE SUPORTE DE MADEIRA, CONFORME PROJETO (02 PLACAS POR SUPORTE)                                  ","CPU.5","UN.",7,{"$f":"VLOOKUP(A31,CPU!$A$1:$N$4671,9)","v":234.21999999999997},{"$f":"VLOOKUP(A31,CPU!$A$1:$N$4671,10)","v":284.23},{"$f":"ROUND(F31*H31,2)","v":1989.61}]
[19,"4.4","PINTURA DE EIXO VIÁRIO SOBRE ASFALTO COM TINTA RETRORREFLETIVA A BASE DE RESINA ACRÍLICA COM MICROESFERAS DE VIDRO, APLICAÇÃO MECÂNICA COM DEMARCADORA AUTOPROPELIDA",102512,"M",5100,{"$f":"VLOOKUP(A32,CPU!$A$1:$N$4671,9)","v":5.5500000000000007},{"$f":"VLOOKUP(A32,CPU!$A$1:$N$4671,10)","v":6.73},{"$f":"ROUND(F32*H32,2)","v":34323}]
["E",5,"FORNECIMENTOS - MATERIAL ASFÁLTICO (BDI DIFERENCIADO)",{"$nulls":5},{"$f":"SUM(I34:I36)","v":725332.72}]
[20,"5.1","AQUISIÇÃO DE EMULSÃO ASFÁLTICA PARA IMPRIMAÇÃO (EAI) - EXCLUSIVE TRANSPORTE","CPU.6","T",19,{"$f":"VLOOKUP(A34,CPU!$A$1:$N$4671,9)","v":2272.33},{"$f":"VLOOKUP(A34,CPU!$A$1:$N$4671,10)","v":2613.1799999999998},{"$f":"ROUND(F34*H34,2)","v":49650.42}]
[21,"5.2","AQUISIÇÃO DE EMULSAO ASFALTICA CATIONICA RR-2C - EXCLUSIVE TRANSPORTE","CPU.7","T",5.9950000000000001,{"$f":"VLOOKUP(A35,CPU!$A$1:$N$4671,9)","v":3322.69},{"$f":"VLOOKUP(A35,CPU!$A$1:$N$4671,10)","v":3821.09},{"$f":"ROUND(F35*H35,2)","v":22907.43}]
[22,"5.3","AQUISIÇÃO DE CONCRETO BETUMINOSO USINADO A QUENTE (CBUQ) PARA PAVIMENTACAO ASFALTICA, PADRAO DNIT, FAIXA C, COM CAP 50/70 - EXCLUSIVE TRANSPORTE","CPU.8","T",950.00200000000007,{"$f":"VLOOKUP(A36,CPU!$A$1:$N$4671,9)","v":597.5},{"$f":"VLOOKUP(A36,CPU!$A$1:$N$4671,10)","v":687.13},652774.87]
[null,"TOTAL GERAL DA OBRA COM BDI ",{"$nulls":6},{"$f":"SUM(I9,I15,I23,I28,I33)","v":1910024.72}]

{"sheet":"CPU","index":1,"n_rows":368,"n_cols":13,"rows_kept":368,"cut":false,"hidden":false,"merged":[[222,0,233,0],[222,1,222,3],[222,4,222,7],[222,10,222,11],[223,2,223,5],[224,2,224,3],[225,1,225,7],[230,1,230,3],[230,5,230,6],[231,1,231,6],[232,1,232,6],[233,1,233,6],[0,1,0,3],[0,4,0,7],[0,10,0,11],[1,2,1,5],[1,10,1,11],[2,2,2,3],[3,1,3,7],[9,1,9,3],[9,5,9,6],[10,1,10,6],[11,1,11,6],[12,1,12,6],[14,1,14,3],[14,4,14,7],[14,10,14,11],[15,2,15,5],[16,2,16,3],[17,1,17,7],[28,1,28,3],[28,5,28,6],[29,1,29,6],[30,1,30,6],[31,1,31,6],[33,1,33,3],[33,4,33,7],[33,10,33,11],[34,2,34,5],[35,2,35,3],[36,1,36,7],[44,1,44,3],[44,5,44,6],[45,1,45,6],[46,1,46,6],[47,1,47,6],[49,1,49,3],[49,4,49,7],[49,10,49,11],[50,2,50,5],[51,2,51,3],[52,1,52,7],[62,1,62,3],[62,5,62,6],[63,1,63,6],[64,1,64,6],[65,1,65,6],[67,1,67,3],[67,4,67,7],[67,10,67,11],[68,2,68,5],[69,2,69,3],[70,1,70,7],[74,1,74,3],[74,5,74,6],[75,1,75,6],[76,1,76,6],[77,1,77,6],[79,1,79,3],[79,4,79,7],[79,10,79,11],[80,2,80,5],[81,2,81,3],[82,1,82,7],[87,1,87,3],[87,5,87,6],[88,1,88,6],[89,1,89,6],[90,1,90,6],[92,1,92,3],[92,4,92,7],[93,2,93,5],[94,2,94,3],[95,1,95,7],[101,1,101,3],[101,5,101,6],[102,1,102,6],[103,1,103,6],[104,1,104,6],[106,1,106,3],[106,4,106,7],[106,10,106,11],[107,2,107,5],[108,2,108,3],[109,1,109,7],[119,1,119,3],[119,5,119,6],[120,1,120,6],[121,1,121,6],[122,1,122,6],[124,1,124,3],[124,4,124,7],[125,2,125,5],[126,2,126,3],[127,1,127,7],[144,1,144,3],[144,5,144,6],[145,1,145,6],[146,1,146,6],[147,1,147,6],[149,1,149,3],[149,4,149,7],[149,10,149,11],[150,2,150,5],[151,2,151,3],[152,1,152,7],[163,1,163,3],[163,5,163,6],[164,1,164,6],[165,1,165,6],[166,1,166,6],[168,1,168,3],[168,4,168,7],[168,10,168,11],[169,2,169,5],[170,2,170,3],[171,1,171,7],[182,1,182,3],[182,5,182,6],[183,1,183,6],[184,1,184,6],[185,1,185,6],[187,1,187,3],[187,4,187,7],[187,10,187,11],[188,2,188,5],[189,2,189,3],[190,1,190,7],[192,8,192,9],[204,1,204,3],[204,5,204,6],[205,1,205,6],[206,1,206,6],[207,1,207,6],[209,1,209,3],[209,4,209,7],[209,10,209,11],[210,2,210,5],[211,2,211,3],[212,1,212,7],[217,1,217,3],[217,5,217,6],[218,1,218,6],[219,1,219,6],[220,1,220,6],[235,1,235,3],[235,4,235,7],[236,2,236,5],[237,2,237,3],[238,1,238,7],[243,1,243,3],[243,5,243,6],[244,1,244,6],[245,1,245,6],[246,1,246,6],[248,1,248,3],[248,4,248,7],[248,10,248,11],[249,2,249,5],[250,2,250,3],[251,1,251,7],[255,1,255,3],[255,5,255,6],[256,1,256,6],[257,1,257,6],[258,1,258,6],[260,1,260,3],[260,4,260,7],[260,10,260,11],[261,2,261,5],[262,2,262,3],[263,1,263,7],[274,1,274,3],[274,5,274,6],[275,1,275,6],[276,1,276,6],[277,1,277,6],[318,1,318,7],[328,1,328,3],[328,5,328,6],[297,1,297,3],[297,4,297,7],[298,2,298,5],[299,2,299,3],[300,1,300,7],[310,1,310,3],[310,5,310,6],[357,1,357,3],[357,4,357,7],[358,2,358,5],[359,2,359,3],[360,1,360,7],[364,1,364,3],[364,5,364,6],[341,1,341,6],[342,1,342,6],[343,1,343,6],[345,1,345,3],[345,4,345,7],[346,2,346,5],[347,2,347,3],[348,1,348,7],[352,1,352,3],[352,5,352,6],[260,0,277,0],[297,0,313,0],[315,0,331,0],[333,0,343,0],[353,1,353,6],[354,1,354,6],[355,1,355,6],[329,1,329,6],[330,1,330,6],[331,1,331,6],[333,1,333,3],[333,4,333,7],[334,2,334,5],[335,2,335,3],[336,1,336,7],[340,1,340,3],[340,5,340,6],[311,1,311,6],[312,1,312,6],[313,1,313,6],[315,1,315,3],[315,4,315,7],[316,2,316,5],[317,2,317,3],[0,0,13,0],[14,0,32,0],[33,0,48,0],[49,0,66,0],[67,0,78,0],[79,0,91,0],[92,0,104,0],[106,0,123,0],[124,0,147,0],[345,0,355,0],[357,0,367,0],[15,8,16,9],[34,8,35,9],[279,0,295,0],[279,1,279,3],[279,4,279,7],[280,2,280,5],[281,2,281,3],[282,1,282,7],[292,1,292,3],[292,5,292,6],[293,1,293,6],[294,1,294,6],[295,1,295,6],[365,1,365,6],[366,1,366,6],[367,1,367,6],[149,0,167,0],[168,0,186,0],[187,0,208,0],[209,0,220,0],[235,0,246,0],[248,0,259,0]]}
[1,"CODEVASF",null,null," COMPOSIÇÃO DE PREÇO UNITÁRIO",null,null,null,{"$f":"H11","v":15927.66},{"$f":"H13","v":19328.22},"BDI CALCULADO:",null,{"$f":"ORÇAMENTO!I6","v":0.21350000000000002}]
[null,"OBRA:  ",{"$f":"ORÇAMENTO!C5","v":" PAVIMENTAÇÃO ASFÁLTICA EM CBUQ - VIAS DIVERSAS - COMUNIDADE PERNAMBUCO (PIRAPORA / MG)"},null,null,null,"DATA: ",{"$f":"ORÇAMENTO!C6","v":" AGOSTO / 2023   "},null,null,"BDI DIFERENCIADO:",null,{"$f":"'BDI FORN'!D31/100","v":0.15}]
[null,"SERVIÇO:  ",{"$f":"VLOOKUP(A1,ORÇAMENTO!A10:I29,3)","v":"MOBILIZAÇÃO E DESMOBILIZAÇÃO"},null,"Referência:","CPU.1","UNIDADE: ",{"$f":"VLOOKUP(A1,ORÇAMENTO!A10:I29,5)","v":"GL"}]
[]
[null,"TIPO ITEM","CODIGO ITEM","DESCRIÇÃO ITEM","UNIDADE ITEM","COEFICIENTE","PRECO UNITARIO","CUSTO TOTAL"]
[null,"COMPOSICAO",89876,"CAMINHÃO BASCULANTE 14 M3, COM CAVALO MECÂNICO DE CAPACIDADE MÁXIMA DE TRAÇÃO COMBINADO DE 36000 KG, POTÊNCIA 286 CV, INCLUSIVE SEMIREBOQUE COM CAÇAMBA METÁLICA ","CHP DIURNO.",8,287.48,{"$f":"ROUNDDOWN(F6*G6,2)","v":2299.84}]
[null,"COMPOSICAO",89877,"CAMINHÃO BASCULANTE 14 M3, COM CAVALO MECÂNICO DE CAPACIDADE MÁXIMA DE TRAÇÃO COMBINADO DE 36000 KG, POTÊNCIA 286 CV, INCLUSIVE SEMIREBOQUE TRAÇÃO ","CHI DIURNO.",8,82.59,{"$f":"ROUNDDOWN(F7*G7,2)","v":660.72}]
[null,"COMPOSICAO",5914640,"TRANSPORTE COM CAVALO MECÂNICO COM SEMIRREBOQUE COM CAPACIDADE DE 30 T - RODOVIA PAVIMENTADA","T.KM",8223,0.56999999999999995,4687.1099999999997]
[null,"COMPOSIÇÃO",88316,"SERVENTE COM ENCARGOS COMPLEMENTARES","H",16,19.760000000000002,316.16000000000003]
[null,"PRODUÇÃO DA EQUIPE",null,null,0.5,"CUSTO ",null,{"$f":"SUM(H6:H9)","v":7963.83}]
[null,"TOTAL",{"$nulls":5},{"$f":"H10/E10","v":15927.66},"OK"]
[null,"BDI                %",{"$nulls":5},{"$f":"1+$M$1","v":1.2135}]
[null,"TOTAL DO SERVIÇO - R$",{"$nulls":5},{"$f":"ROUND(H11*H12,2)","v":19328.22}]
[]
[{"$f":"A1+1","v":2},"CODEVASF",null,null," COMPOSIÇÃO DE PREÇO UNITÁRIO",null,null,null,{"$f":"H30","v":83539},{"$f":"H32","v":101374.58}]
[null,"OBRA:  ",{"$f":"$C$2","v":" PAVIMENTAÇÃO ASFÁLTICA EM CBUQ - VIAS DIVERSAS - COMUNIDADE PERNAMBUCO (PIRAPORA / MG)"},null,null,null,"DATA: ",{"$f":"$H$2","v":" AGOSTO / 2023   "}]
[null,"SERVIÇO:  ",{"$f":"VLOOKUP(A15,ORÇAMENTO!$A$10:$I$29,3)","v":"ADMINISTRAÇÃO LOCAL"},null,"SINAPI","CPU.2","UNIDADE: ",{"$f":"VLOOKUP(A15,ORÇAMENTO!$A$10:$I$29,5)","v":"GL"}]
[]
[null,"TIPO ITEM","CODIGO ITEM","DESCRIÇÃO ITEM","UNIDADE ITEM","COEFICIENTE","PRECO UNITARIO","CUSTO TOTAL"]
[null,"INSUMO",14250,"ENERGIA ELÉTRICA","kwh",60,0.86,{"$f":"ROUNDDOWN(F20*G20,2)","v":51.6}]
[null,"INSUMO",44480,"TARIFA FORNECIMENTO DE ÁGUA/ESGOTO ","M3",6,16.27,97.62]
[null,"COTAÇÃO","MERC.","TELEFONE (PLANO CONTROLE)","UNID",2,59.99,119.98]
[null,"INSUMO","ED-50155 SEINFRA","BANHEIRO QUÍMICO 110 X 120 X 230 CM COM MANUTENÇÃO (CONSIDERANDO OBRAS SIMULTÂNEAS)","MÊS",2,820,1640]
[null,"COMPOSICAO",90777,"Engenheiro Civil Júnior com encargos complementares","H",55,114.12,6276.6]
[null,"COMPOSICAO",90776,"Encarregado Geral com encargos complementares","H",110,57.73,6350.3]
[null,"COMPOSICAO",88321,"Tecnico de Laboratório com encargos complementares","H",55,45.67,2511.85]
[null,"COMPOSICAO",100309,"Tecnico em Segurança do Trabalho com encargos complementares","H",55,45.93,2526.15]
[null,"COMPOSICAO",90772,"Auxiliar de escritório com encargos complementares","H",55,23.83,1310.6500000000001]
[null,"PRODUÇÃO DA EQUIPE",null,null,0.25,"CUSTO ",null,{"$f":"SUM(H20:H28)","v":20884.750000000004}]
[null,"TOTAL",{"$nulls":5},{"$f":"ROUND(H29/E29,2)","v":83539},"OK"]
[null,"BDI                %",{"$nulls":5},{"$f":"1+$M$1","v":1.2135}]
[null,"TOTAL DO SERVIÇO - R$",{"$nulls":5},{"$f":"ROUND(H30*H31,2)","v":101374.58}]
[]
[{"$f":"A15+1","v":3},"CODEVASF",null,null," COMPOSIÇÃO DE PREÇO UNITÁRIO",null,null,null,{"$f":"H46","v":13427.4},{"$f":"H48","v":16294.15}]
[null,"OBRA:  ",{"$f":"$C$2","v":" PAVIMENTAÇÃO ASFÁLTICA EM CBUQ - VIAS DIVERSAS - COMUNIDADE PERNAMBUCO (PIRAPORA / MG)"},null,null,null,"DATA: ",{"$f":"$H$2","v":" AGOSTO / 2023   "}]
[null,"SERVIÇO:  ",{"$f":"VLOOKUP(A34,ORÇAMENTO!$A$10:$I$29,3)","v":"CANTEIRO DE OBRAS"},null,"SINAPI",{"$f":"VLOOKUP(A34,ORÇAMENTO!$A$10:$I$29,4)","v":"CPU.3"},"UNIDADE: ",{"$f":"VLOOKUP(A34,ORÇAMENTO!$A$10:$I$29,5)","v":"GL"}]
[]
[null,"TIPO ITEM","CODIGO ITEM","DESCRIÇÃO ITEM","UNIDADE ITEM","COEFICIENTE","PRECO UNITARIO","CUSTO TOTAL"]
[null,"INSUMO",10775,"LOCACAO DE CONTAINER COM 1 SANITARIO, PARA ESCRITORIO,COMPLETO, SEM DIVISORIAS INTERNAS","MÊS",4,1040,{"$f":"ROUNDDOWN(F39*G39,2)","v":4160}]
[null,"INSUMO",10779,"LOCACAO DE CONTAINER P/ SANITARIO, C/ 5 BACIAS, 1 LAVATORIO E 4 MICTORIOS","MÊS",4,1300,5200]
[null,"COMPOSIÇÃO",100382,"FABRICAÇÃO E INSTALAÇÃO DE PONTALETES DE MADEIRA NÃO APARELHADA PARA TELHADOS COM TELHA ONDULADA DE FIBROCIMENTO","M2",48,34.39,1650.72]
[null,"COMPOSIÇÃO",94207,"TELHAMENTO COM TELHA ONDULADA DE FIBROCIMENTO E = 6 MM","M2",48,42.66,2047.68]
[null,"INSUMO","37525","TELA PLASTICA TECIDA LISTRADA BRANCA E LARANJA, TIPO GUARDA CORPO, EM POLIETILENO MONOFILADO, ROLO 1,20 X 50 M (L X C)","M",100,3.69,369]
[{"$nulls":7},0]
[null,"PRODUÇÃO DA EQUIPE",null,null,1,"CUSTO ",null,{"$f":"SUM(H39:H44)","v":13427.4}]
[null,"TOTAL",{"$nulls":5},{"$f":"H45/E45","v":13427.4},"OK"]
[null,"BDI                %",{"$nulls":5},{"$f":"1+$M$1","v":1.2135}]
[null,"TOTAL DO SERVIÇO - R$",{"$nulls":5},{"$f":"ROUND(H46*H47,2)","v":16294.15}]
[]
[{"$f":"A34+1","v":4},"CODEVASF",null,null," COMPOSIÇÃO DE PREÇO UNITÁRIO",null,null,null,{"$f":"H64","v":340.97999999999996},{"$f":"H66","v":413.78}]
[null,"OBRA:  ",{"$f":"$C$2","v":" PAVIMENTAÇÃO ASFÁLTICA EM CBUQ - VIAS DIVERSAS - COMUNIDADE PERNAMBUCO (PIRAPORA / MG)"},null,null,null,"DATA: ",{"$f":"$H$2","v":" AGOSTO / 2023   "}]
[null,"SERVIÇO:  ",{"$f":"VLOOKUP(A50,ORÇAMENTO!$A$10:$I$29,3)","v":"PLACA DE OBRA EM CHAPA DE AÇO GALVANIZADO"},null,"SINAPI",{"$f":"VLOOKUP(A50,ORÇAMENTO!$A$10:$I$29,4)","v":103689},"UNIDADE: ",{"$f":"VLOOKUP(A50,ORÇAMENTO!$A$10:$I$29,5)","v":"M2"}]
[]
[null,"TIPO ITEM","CODIGO ITEM","DESCRIÇÃO ITEM","UNIDADE ITEM","COEFICIENTE","PRECO UNITARIO","CUSTO TOTAL"]
[null,"INSUMO","4509","SARRAFO *2,5 X 10* CM EM PINUS, MISTA OU EQUIVALENTE DA REGIAO - BRUTA","M","3,2083000","4,39",{"$f":"ROUNDDOWN(F55*G55,2)","v":14.08}]
[null,"INSUMO","4813","PLACA DE OBRA (PARA CONSTRUCAO CIVIL) EM CHAPA GALVANIZADA *N. 22*, ADESIVADA, DE *2,4 X 1,2* M (SEM POSTES PARA FIXACAO)","M2","1,0000000","250,00",250]
[null,"INSUMO","5065","PREGO DE ACO POLIDO COM CABECA 10 X 10 ","KG","0,0113000","38,80",0.43]
[null,"INSUMO","5069","PREGO DE ACO POLIDO COM CABECA 17 X 27 ","KG","0,0132000","20,79",0.27]
[null,"COMPOSICAO","88262","CARPINTEIRO DE FORMAS COM ENCARGOS COMPLEMENTARES","H","0,3729000","27,05",10.08]
[null,"COMPOSICAO","88316","SERVENTE COM ENCARGOS COMPLEMENTARES","H","1,1186000","19,76",22.1]
{"$rows_left_out":309}
{"sheet":"BDI SERV","index":2,"n_rows":37,"n_cols":5,"rows_kept":37,"cut":false,"hidden":false,"merged":[[32,6,35,8],[36,0,36,5],[3,1,4,1],[3,2,4,2],[0,1,2,4],[32,0,34,5],[28,0,28,5],[30,1,30,2],[31,1,31,2]]}
[null,"DETALHAMENTO DO BDI - SERVIÇOS"]
[]
[]
[null,"Item","Descrição dos Serviços","%","%"]
[null,null,null,"PV","CD"]
[]
[null,1,"ADMINISTRAÇÃO CENTRAL"," ",4.01]
[null,"1.1","ESCRITÓRIO CENTRAL"," "," "]
[null,"1.2","VIAGENS"," "," "]
[null,"1.3","OUTROS"," "," "]
[null," "," "," "," "]
[null,2,"IMPOSTOS E TAXAS",{"$f":"SUM(D13:D16)","v":6.15},{"$f":"SUM(E13:E16)","v":7.6899999999999995}]
[null,"2.1","ISS (*)",{"$f":"5*0.5","v":2.5},{"$f":"ROUND(D13*1.2515,2)","v":3.13}]
[null,"2.2","PIS",0.65,0.81]
[null,"2.3","Cofins",3,3.75]
[null,"2.4","CONTRIBUIÇÃO PREVIDENCIÁRIA SOBRE A RENDA BRUTA",0,0]
[]
[null,3,"TAXA DE RISCO"," ",{"$f":"SUM(E19:E22)","v":0.96}]
[null,"3.1","SEGURO",null,0.2]
[null,"3.2","RISCO",null,0.56000000000000005]
[null,"3.3","GARANTIA",null,0.2]
[]
[null,4,"DESPESAS FINANCEIRAS"," ",1.1100000000000001]
[]
[null,5,"LUCRO",null,7.3]
[]
[null," ","BDI - CALCULADO"," ",{"$f":"ROUND((((1+(E7+E18)/100)*(1+E23/100)*(1+E25/100)/(1-D12/100)-1)*100),2)","v":21.35}]
[]
["BDI = ((1+((AC+S+R+G)/100))x(1+DF/100)x(1+L/100)/(1-I/100)-1)*100"]
[]
[null,"BDI (CALCULADO):",null,{"$f":"ROUND((((1+((E7+E18)/100))*(1+E23/100)*(1+E25/100))/(1-D12/100)-1)*100,2)","v":21.35},"%"]
[null," "]
["(*) ISS CONFORME LEI MUNICIPAL Nº 1.815 / 2005 - Considerando as deduções previstas no Art. 106 - § 2º (Dedução de 50% sem necessidade de comprovação)"]
[]
[]
[]
["BDI EM CONFORMIDADE COM OS ACÓRDÃOS Nº 2369/2011 e ACÓRDÃO Nº 2.622/2013 - TCU - PLENÁRIO"]

{"sheet":"BDI FORN","index":3,"n_rows":37,"n_cols":5,"rows_kept":37,"cut":false,"hidden":false,"merged":[[0,1,2,4],[28,0,28,5],[30,1,30,2],[31,1,31,2],[36,0,36,5],[3,1,4,1],[3,2,4,2],[32,0,34,5]]}
[null,"DETALHAMENTO DO BDI - FORNECIMENTO \n(MATERIAL ASFÁLTICO)"]
[]
[]
[null,"Item","Descrição dos Serviços","%","%"]
[null,null,null,"PV","CD"]
[]
[null,1,"ADMINISTRAÇÃO CENTRAL"," ",3.72]
[null,"1.1","ESCRITÓRIO CENTRAL"," "," "]
[null,"1.2","VIAGENS"," "," "]
[null,"1.3","OUTROS"," "," "]
[null," "," "," "," "]
[null,2,"IMPOSTOS E TAXAS",{"$f":"SUM(D13:D16)","v":3.65},{"$f":"SUM(E13:E16)","v":4.5600000000000005}]
[null,"2.1","ISS (*)",null,{"$f":"ROUND(D13*1.2515,2)","v":0}]
[null,"2.2","PIS",0.65,0.81]
[null,"2.3","Cofins",3,3.75]
[null,"2.4","CONTRIBUIÇÃO PREVIDENCIÁRIA SOBRE A RENDA BRUTA",0,0]
[]
[null,3,"TAXA DE RISCO"," ",{"$f":"SUM(E19:E22)","v":0.82000000000000006}]
[null,"3.1","SEGURO",null,0.16]
[null,"3.2","RISCO",null,0.5]
[null,"3.3","GARANTIA",null,0.16]
[]
[null,4,"DESPESAS FINANCEIRAS"," ",0.94]
[]
[null,5,"LUCRO",null,5]
[]
[null," ","BDI - CALCULADO"," ",{"$f":"ROUND((((1+(E7+E18)/100)*(1+E23/100)*(1+E25/100)/(1-D12/100)-1)*100),2)","v":15}]
[]
["BDI = ((1+((AC+S+R+G)/100))x(1+DF/100)x(1+L/100)/(1-I/100)-1)*100"]
[]
[null,"BDI (CALCULADO):",null,{"$f":"ROUND((((1+((E7+E18)/100))*(1+E23/100)*(1+E25/100))/(1-D12/100)-1)*100,2)","v":15},"%"]
[null," "]
[]
[]
[]
[]
["BDI EM CONFORMIDADE COM OS ACÓRDÃOS Nº 2369/2011 e ACÓRDÃO Nº 2.622/2013 - TCU - PLENÁRIO"]

{"sheet":"CRONOGRAMA","index":4,"n_rows":19,"n_cols":10,"rows_kept":19,"cut":false,"hidden":false,"merged":[[0,1,0,9],[3,1,3,7],[5,0,6,0],[5,2,6,2],[1,2,2,4],[1,6,1,9],[2,6,2,9],[7,0,8,0],[9,0,10,0],[11,0,12,0],[13,0,14,0],[1,1,2,1],[5,1,6,1],[7,1,8,1],[9,1,10,1],[11,1,12,1],[13,1,14,1],[15,1,16,2],[18,1,22,9],[7,2,8,2],[9,2,10,2],[11,2,12,2],[13,2,14,2]]}
[null,"CRONOGRAMA FÍSICO-FINANCEIRO"]
[null,"OBRA: ",{"$f":"ORÇAMENTO!C5","v":" PAVIMENTAÇÃO ASFÁLTICA EM CBUQ - VIAS DIVERSAS - COMUNIDADE PERNAMBUCO (PIRAPORA / MG)"},null,null,"VALOR:",{"$f":"ORÇAMENTO!I37","v":1910024.72}]
[{"$nulls":5},"PRAZO: ","180 DIAS "]
[]
[null,"ITEM","ETAPAS/DESCRIÇAO","FISICO/  FINANCEIRO","TOTAL    ETAPAS","MÊS 1","MÊS 2","MÊS 3","MÊS 4","TOTAL"]
["A",{"$f":"VLOOKUP(A6,ORÇAMENTO!$A$9:$I$37,2)","v":1},{"$f":"VLOOKUP(A6,ORÇAMENTO!$A$9:$I$37,3)","v":"SERVIÇOS PRELIMINARES "},"FISICO ",{"$f":"ROUND(E7/$G$2,4)","v":7.3099999999999998E-2},0.2,0.3,0.3,0.2,{"$f":"SUM(F6:I6)","v":1}]
[null,null,null,"FINANCEIRO",{"$f":"ORÇAMENTO!I9","v":139598.29},{"$f":"ROUND($E$7*F6,2)","v":27919.66},41879.49,41879.49,27919.66,{"$f":"SUM(F7:I7)","v":139598.29999999999}]
["B",{"$f":"VLOOKUP(A8,ORÇAMENTO!$A$9:$I$37,2)","v":2},{"$f":"VLOOKUP(A8,ORÇAMENTO!$A$9:$I$37,3)","v":"TERRAPLANAGEM E PAVIMENTAÇÃO"},"FISICO ",{"$f":"ROUND(E9/$G$2,4)","v":0.19939999999999999},0.2,0.3,0.3,0.2,{"$f":"SUM(F8:I8)","v":1}]
[null,null,null,"FINANCEIRO",{"$f":"ORÇAMENTO!I15","v":380771.64999999997},{"$f":"ROUND($E$9*F8,2)","v":76154.33},114231.5,114231.5,76154.33,{"$f":"SUM(F9:I9)","v":380771.66000000003}]
["C",{"$f":"VLOOKUP(A10,ORÇAMENTO!$A$9:$I$37,2)","v":3},{"$f":"VLOOKUP(A10,ORÇAMENTO!$A$9:$I$37,3)","v":"TRANSPORTE DE MATERIAIS"},"FISICO ",{"$f":"ROUND(E11/$G$2,4)","v":0.2029},0.2,0.3,0.3,0.2,{"$f":"SUM(F10:I10)","v":1}]
[null,null,null,"FINANCEIRO",{"$f":"ORÇAMENTO!I23","v":387492},{"$f":"ROUND($E$11*F10,2)","v":77498.399999999994},116247.6,116247.6,77498.399999999994,{"$f":"SUM(F11:I11)-0.04","v":387491.96}]
["D",{"$f":"VLOOKUP(A12,ORÇAMENTO!$A$9:$I$37,2)","v":4},{"$f":"VLOOKUP(A12,ORÇAMENTO!$A$9:$I$37,3)","v":"OBRAS COMPLEMENTARES"},"FISICO ",{"$f":"ROUND(E13/$G$2,4)","v":0.1449},0,0.3,0.4,0.3,{"$f":"SUM(F12:I12)","v":1}]
[null,null,null,"FINANCEIRO",{"$f":"ORÇAMENTO!I28","v":276830.06},{"$f":"ROUND($E$13*F12,2)","v":0},83049.02,110732.02,83049.02,{"$f":"SUM(F13:I13)-0.02","v":276830.03999999998}]
["E",{"$f":"VLOOKUP(A14,ORÇAMENTO!$A$9:$I$37,2)","v":5},{"$f":"VLOOKUP(A14,ORÇAMENTO!$A$9:$I$37,3)","v":"FORNECIMENTOS - MATERIAL ASFÁLTICO (BDI DIFERENCIADO)"},"FISICO ",{"$f":"ROUND(E15/$G$2,4)","v":0.37980000000000003},0.2,0.3,0.3,0.2,{"$f":"SUM(F14:I14)","v":1}]
[null,null,null,"FINANCEIRO",{"$f":"ORÇAMENTO!I33","v":725332.72},{"$f":"ROUND($E$15*F14,2)","v":145066.54},{"$f":"ROUND($E$15*G14,2)","v":217599.82},217599.82,145066.54,{"$f":"SUM(F15:I15)-0.02","v":725332.7}]
[null,"TOTAL",null,"FISICO ",{"$f":"SUM(F16:I16)","v":1.0000000104710687},{"$f":"F17/$E$17","v":0.17101293327763842},{"$f":"G17/$E$17","v":0.30000000732974808},0.31449353702605487,0.21449353283762734,{"$f":"SUM(F16:I16)","v":1.0000000104710687}]
[null,null,null,"FINANCEIRO",{"$f":"E11+E9+E7+E13+E15","v":1910024.72},{"$f":"F11+F9+F7+F13+F15","v":326638.93},{"$f":"G11+G9+G7+G13+G15","v":573007.43000000005},600690.43000000005,409687.94999999995,{"$f":"SUM(F17:I17)-0.02","v":1910024.72}]
[]
[null,"OBSERVAÇÕES:"]