{"text_format":"2","workbook":"xlsx","n_sheets":5,"sheets":["ORÇAMENTO","CPU","BDI SERV","BDI FORN","CRONOGRAMA"],"not_rendered":{"charts":0,"images":3,"macros":0,"external_links":0,"defined_names":5,"comments":1,"pivot_tables":0},"unopened":[],"bounds":{"document_bytes":16777216,"sheet_cells":100000,"run_cost":"one","rows_first":2000,"rows_last":500,"rows_between":2000,"halvings":0,"cell_chars":16384,"cell_head_chars":4096},"cells_cut":0,"cells_raw":0,"read":"whole","date_system":"1900"}

{"sheet":"ORÇAMENTO","index":0,"n_rows":39,"n_cols":9,"rows_kept":39,"cut":false,"hidden":false,"merged":[[38,1,38,2],[0,0,7,0],[0,2,0,8],[1,2,1,8],[2,2,2,8],[4,2,4,8],[5,6,5,7],[6,1,6,2],[6,6,6,7]]}
["<---- NUMERAR SERVIÇOS PARA CPU",null,"Ministério do Desenvolvimento Regional"]
[null,null,"Companhia de Desenvolvimento dos Vales do São Francisco e do Parnaíba"]
[null,null,"1ª Superintendência Regional"]
[]
[null,"OBRA: "," PAVIMENTAÇÃO ASFÁLTICA EM CBUQ – ESTRADA BONFIM - BELO VALE  (BONFIM / MG) - LOTE 1: VARGEM ALEGRE ATÉ MACAÚBAS"]
[null,"DATA:"," AGOSTO / 2023   ",null,null,null,"BDI Serviços:",null,{"$f":"'BDI SERV'!D31/100","v":0.23319999999999999}]
[null,"PRAZO DE EXECUÇÃO:    120 DIAS",{"$nulls":4},"BDI Serviços:",null,{"$f":"'BDI FORN'!D31/100","v":0.15}]
[null,"ITEM","DISCRIMINAÇÃO","REFER.","UNID.","QUANT.","P. UNITÁRIO","P.UNIT.C/ BDI","P. TOTAL"]
["A",1,"SERVIÇOS PRELIMINARES ",{"$nulls":5},{"$f":"SUM(I10:I14)","v":106782.95000000001}]
[1,"1.1","MOBILIZAÇÃO E DESMOBILIZAÇÃO","CPU.1","GL",1,{"$f":"VLOOKUP(A10,CPU!$A$1:$N$4683,9)","v":8742.3799999999992},{"$f":"VLOOKUP(A10,CPU!$A$1:$N$4683,10)","v":10781.1},{"$f":"ROUND(F10*H10,2)","v":10781.1}]
[2,"1.2","ADMINISTRAÇÃO LOCAL","CPU.2","GL",1,{"$f":"VLOOKUP(A11,CPU!$A$1:$N$4683,9)","v":60372.08},{"$f":"VLOOKUP(A11,CPU!$A$1:$N$4683,10)","v":74450.850000000006},{"$f":"ROUND(F11*H11,2)","v":74450.850000000006}]
[3,"1.3","CANTEIRO DE OBRAS","CPU.3","GL",1,{"$f":"VLOOKUP(A12,CPU!$A$1:$N$4683,9)","v":12877.36},{"$f":"VLOOKUP(A12,CPU!$A$1:$N$4683,10)","v":15880.36},{"$f":"ROUND(F12*H12,2)","v":15880.36}]
[4,"1.4","PLACA DE OBRA EM CHAPA DE AÇO GALVANIZADO",103689,"M2",6,{"$f":"VLOOKUP(A13,CPU!$A$1:$N$4683,9)","v":339.72},{"$f":"VLOOKUP(A13,CPU!$A$1:$N$4683,10)","v":418.94},{"$f":"ROUND(F13*H13,2)","v":2513.64}]
[5,"1.5","SERVIÇOS TOPOGRÁFICOS PARA PAVIMENTAÇÃO, INCLUSIVE NOTA DE SERVIÇO, ACOMPANHAMENTO E GREIDE",78472,"M2",7700,{"$f":"VLOOKUP(A14,CPU!$A$1:$N$4683,9)","v":0.32999999999999996},{"$f":"VLOOKUP(A14,CPU!$A$1:$N$4683,10)","v":0.41},{"$f":"ROUND(F14*H14,2)","v":3157}]
["B",2,"TERRAPLANAGEM E PAVIMENTAÇÃO",{"$nulls":5},{"$f":"SUM(I16:I22)","v":122889.2}]
[6,"2.1","ESCAVAÇÃO HORIZONTAL EM SOLO DE 1A CATEGORIA ",101116,"M3",3100,{"$f":"VLOOKUP(A16,CPU!$A$1:$N$4683,9)","v":2.0300000000000002},{"$f":"VLOOKUP(A16,CPU!$A$1:$N$4683,10)","v":2.5},{"$f":"ROUND(F16*H16,2)","v":7750}]
[7,"2.2","CARGA, MANOBRA E DESCARGA DE SOLOS E MATERIAIS GRANULARES EM CAMINHÃO BASCULANTE",100976,"M3",3100,{"$f":"VLOOKUP(A17,CPU!$A$1:$N$4683,9)","v":7.99},{"$f":"VLOOKUP(A17,CPU!$A$1:$N$4683,10)","v":9.85},30535]
[8,"2.3","REGULARIZAÇÃO E COMPACTAÇÃO DO SUBLEITO ",100577,"M2",7700,{"$f":"VLOOKUP(A18,CPU!$A$1:$N$4683,9)","v":1.1299999999999999},{"$f":"VLOOKUP(A18,CPU!$A$1:$N$4683,10)","v":1.39},10703]
[9,"2.4","EXECUÇÃO E COMPACTAÇÃO DE BASE E/OU SUB BASE PARA PAVIMENTAÇÃO DE SOLOS DE COMPORTAMENTO LATERÍTICO - EXCLUSIVE SOLO, ESCAVAÇÃO, CARGA E TRANSPORTE",96388,"M3",1550,{"$f":"VLOOKUP(A19,CPU!$A$1:$N$4683,9)","v":11.61},{"$f":"VLOOKUP(A19,CPU!$A$1:$N$4683,10)","v":14.32},22196]
[10,"2.5","IMPRIMAÇÃO COM EMULSÃO ASFÁLTICA (EAI)",96401,"M2",7700,{"$f":"VLOOKUP(A20,CPU!$A$1:$N$4683,9)","v":1.1200000000000001},{"$f":"VLOOKUP(A20,CPU!$A$1:$N$4683,10)","v":1.38},10626]
[11,"2.6","PINTURA DE LIGAÇÃO COM EMULSÃO ASFÁLTICA RR-1C",96402,"M2",7100,{"$f":"VLOOKUP(A21,CPU!$A$1:$N$4683,9)","v":0.93000000000000016},{"$f":"VLOOKUP(A21,CPU!$A$1:$N$4683,10)","v":1.1499999999999999},8165]
[12,"2.7","EXECUÇÃO DE PAVIMENTO COM APLICAÇÃO DE CONCRETO ASFÁLTICO USINADO A QUENTE (CBUQ), CAMADA DE ROLAMENTO - EXCLUSIVE TRANSPORTE",95995,"M3",220,{"$f":"VLOOKUP(A22,CPU!$A$1:$N$4683,9)","v":121.32},{"$f":"VLOOKUP(A22,CPU!$A$1:$N$4683,10)","v":149.61000000000001},32914.199999999997]
["C",3,"TRANSPORTE DE MATERIAIS",{"$nulls":5},{"$f":"SUM(I24:I25)","v":86709.99}]
[13,"3.1","TRANSPORTE COM CAMINHÃO BASCULANTE, EM VIA URBANA PAVIMENTADA",95877,"M3XKM",40000,{"$f":"VLOOKUP(A24,CPU!$A$1:$N$4683,9)","v":1.6099999999999999},{"$f":"VLOOKUP(A24,CPU!$A$1:$N$4683,10)","v":1.99},{"$f":"ROUND(F24*H24,2)","v":79600}]
[14,"3.2","TRANSPORTE COM CAMINHÃO CARROCERIA 9T, EM VIA URBANA PAVIMENTADA",100947,"TXKM",2999.9964032000007,{"$f":"VLOOKUP(A25,CPU!$A$1:$N$4683,9)","v":1.92},{"$f":"VLOOKUP(A25,CPU!$A$1:$N$4683,10)","v":2.37},{"$f":"ROUND(F25*H25,2)","v":7109.99}]
["D",4,"TRANSPORTE DE MATERIAL ASFÁLTICO (BDI DIFERENCIADO)",{"$nulls":5},{"$f":"SUM(I27:I28)","v":36486}]
[15,"4.1","TRANSPORTE DE MASSA ASFÁLTICA COM CAMINHÃO BASCULANTE, EM VIA URBANA PAVIMENTADA (BDI DIFERENCIADO)",95427,"TXKM",48000,{"$f":"VLOOKUP(A27,CPU!$A$1:$N$4683,9)","v":0.64999999999999991},{"$f":"VLOOKUP(A27,CPU!$A$1:$N$4683,10)","v":0.75},{"$f":"ROUND(F27*H27,2)","v":36000}]
[16,"4.2","TRANSPORTE COM CAMINHÃO TANQUE DE TRANSPORTE DE MATERIAL ASFÁLTICO DE 30000 L, EM VIA URBANA PAVIMENTADA (BDI DIFERENCIADO)",102331,"TXKM",899.99999999999989,{"$f":"VLOOKUP(A28,CPU!$A$1:$N$4683,9)","v":0.47},{"$f":"VLOOKUP(A28,CPU!$A$1:$N$4683,10)","v":0.54},{"$f":"ROUND(F28*H28,2)","v":486}]
["E",5,"OBRAS COMPLEMENTARES",{"$nulls":5},{"$f":"SUM(I30:I34)","v":190804.32}]
[17,"5.1","GUIA (MEIO-FIO) E SARJETA CONJUGADOS DE CONCRETO, MOLDADA  IN LOCO  45 CM BASE (15 CM BASE DA GUIA + 30 CM BASE DA SARJETA) X 22 CM ALTURA",94267,"M",2200,{"$f":"VLOOKUP(A30,CPU!$A$1:$N$4683,9)","v":57.36999999999999},{"$f":"VLOOKUP(A30,CPU!$A$1:$N$4683,10)","v":70.75},{"$f":"ROUND(F30*H30,2)","v":155650}]
[18,"5.2","PINTURA DE FAIXA DE PEDESTRE OU ZEBRADA TINTA RETRORREFLETIVA A BASE DE RESINA ACRÍLICA COM MICROESFERAS DE VIDRO, E = 30 CM, APLICAÇÃO MANUAL",102509,"M2",52,{"$f":"VLOOKUP(A31,CPU!$A$1:$N$4683,9)","v":25.499999999999996},{"$f":"VLOOKUP(A31,CPU!$A$1:$N$4683,10)","v":31.45},1635.4]
[19,"5.3","FORNECIMENTO E INSTALAÇÃO DE PLACA DE SINALIZAÇÃO VIÁRIA - REGULAMENTAÇÃO (FAIXA DE PEDESTRE E OUTROS)","CPU.4","UN.",2,{"$f":"VLOOKUP(A32,CPU!$A$1:$N$4683,9)","v":422.66},{"$f":"VLOOKUP(A32,CPU!$A$1:$N$4683,10)","v":521.22},1042.44]
[20,"5.4","FORNECIMENTO E INSTALAÇÃO DE PLACA DE SINALIZAÇÃO VIÁRIA - REGULAMENTAÇÃO ","CPU.5","UN.",4,{"$f":"VLOOKUP(A33,CPU!$A$1:$N$4683,9)","v":482.58000000000004},{"$f":"VLOOKUP(A33,CPU!$A$1:$N$4683,10)","v":595.12},2380.48]
[22,"5.5","PINTURA DE EIXO VIÁRIO SOBRE ASFALTO COM TINTA RETRORREFLETIVA A BASE DE RESINA ACRÍLICA COM MICROESFERAS DE VIDRO, APLICAÇÃO MECÂNICA COM DEMARCADORA AUTOPROPELIDA - ESPESSURA DE 0,10 MM",102512,"M",4400,{"$f":"VLOOKUP(A34,CPU!$A$1:$N$4683,9)","v":5.5500000000000007},{"$f":"VLOOKUP(A34,CPU!$A$1:$N$4683,10)","v":6.84},30096]
["F",6,"FORNECIMENTOS - MATERIAL ASFÁLTICO (BDI DIFERENCIADO)",{"$nulls":5},{"$f":"SUM(I36:I38)","v":395651.06}]
[23,"6.1","AQUISIÇÃO DE EMULSÃO ASFÁLTICA PARA IMPRIMAÇÃO (EAI) - EXCLUSIVE TRANSPORTE","CPU.7","T",10.5,{"$f":"VLOOKUP(A36,CPU!$A$1:$N$4683,9)","v":2812.65},{"$f":"VLOOKUP(A36,CPU!$A$1:$N$4683,10)","v":3234.55},{"$f":"ROUND(F36*H36,2)","v":33962.78}]
[24,"6.2","AQUISIÇÃO DE EMULSAO ASFALTICA CATIONICA RR-1C - EXCLUSIVE TRANSPORTE","CPU.8","T",3.4950000000000001,{"$f":"VLOOKUP(A37,CPU!$A$1:$N$4683,9)","v":2736.39},{"$f":"VLOOKUP(A37,CPU!$A$1:$N$4683,10)","v":3146.85},{"$f":"ROUND(F37*H37,2)","v":10998.24}]
[25,"6.3","AQUISIÇÃO DE CONCRETO BETUMINOSO USINADO A QUENTE (CBUQ) PARA PAVIMENTACAO ASFALTICA, PADRAO DNIT, FAIXA C, COM CAP 50/70 - EXCLUSIVE TRANSPORTE","CPU.9","T",569.99600000000009,{"$f":"VLOOKUP(A38,CPU!$A$1:$N$4683,9)","v":535},{"$f":"VLOOKUP(A38,CPU!$A$1:$N$4683,10)","v":615.25},{"$f":"ROUND(F38*H38,2)","v":350690.04}]
[null,"TOTAL GERAL DA OBRA COM BDI ",{"$nulls":6},{"$f":"SUM(I9,I15,I23,I29,I35,I26)","v":939323.52}]

{"sheet":"CPU","index":1,"n_rows":380,"n_cols":13,"rows_kept":380,"cut":false,"hidden":false,"merged":[[0,0,13,0],[0,1,0,3],[0,4,0,7],[0,10,0,11],[1,2,1,5],[1,10,1,11],[2,2,2,3],[3,1,3,7],[9,1,9,3],[9,5,9,6],[10,1,10,6],[11,1,11,6],[12,1,12,6],[14,0,32,0],[14,1,14,3],[14,4,14,7],[14,10,14,11],[15,2,15,5],[15,8,16,9],[16,2,16,3],[17,1,17,7],[28,1,28,3],[28,5,28,6],[29,1,29,6],[30,1,30,6],[31,1,31,6],[33,0,47,0],[33,1,33,3],[33,4,33,7],[33,10,33,11],[34,2,34,5],[34,8,35,9],[35,2,35,3],[36,1,36,7],[43,1,43,3],[43,5,43,6],[44,1,44,6],[45,1,45,6],[46,1,46,6],[48,0,65,0],[48,1,48,3],[48,4,48,7],[48,10,48,11],[49,2,49,5],[50,2,50,3],[51,1,51,7],[61,1,61,3],[61,5,61,6],[62,1,62,6],[63,1,63,6],[64,1,64,6],[66,0,81,0],[66,1,66,3],[66,4,66,7],[66,10,66,11],[67,2,67,5],[68,2,68,3],[69,1,69,7],[77,1,77,3],[77,5,77,6],[78,1,78,6],[79,1,79,6],[80,1,80,6],[82,0,94,0],[82,1,82,3],[82,4,82,7],[82,10,82,11],[83,2,83,5],[84,2,84,3],[85,1,85,7],[90,1,90,3],[90,5,90,6],[91,1,91,6],[92,1,92,6],[93,1,93,6],[95,0,107,0],[95,1,95,3],[95,4,95,7],[96,2,96,5],[97,2,97,3],[98,1,98,7],[104,1,104,3],[104,5,104,6],[105,1,105,6],[106,1,106,6],[107,1,107,6],[109,0,126,0],[109,1,109,3],[109,4,109,7],[109,10,109,11],[110,2,110,5],[111,2,111,3],[112,1,112,7],[122,1,122,3],[122,5,122,6],[123,1,123,6],[124,1,124,6],[125,1,125,6],[127,0,144,0],[127,1,127,3],[127,4,127,7],[128,2,128,5],[129,2,129,3],[130,1,130,7],[141,1,141,3],[141,5,141,6],[142,1,142,6],[143,1,143,6],[144,1,144,6],[146,0,164,0],[146,1,146,3],[146,4,146,7],[146,10,146,11],[147,2,147,5],[148,2,148,3],[149,1,149,7],[160,1,160,3],[160,5,160,6],[161,1,161,6],[162,1,162,6],[163,1,163,6],[165,0,183,0],[165,1,165,3],[165,4,165,7],[165,10,165,11],[166,2,166,5],[167,2,167,3],[168,1,168,7],[179,1,179,3],[179,5,179,6],[180,1,180,6],[181,1,181,6],[182,1,182,6],[184,0,205,0],[184,1,184,3],[184,4,184,7],[184,10,184,11],[185,2,185,5],[186,2,186,3],[187,1,187,7],[201,1,201,3],[201,5,201,6],[202,1,202,6],[203,1,203,6],[204,1,204,6],[206,0,217,0],[206,1,206,3],[206,4,206,7],[206,10,206,11],[207,2,207,5],[208,2,208,3],[209,1,209,7],[214,1,214,3],[214,5,214,6],[215,1,215,6],[216,1,216,6],[217,1,217,6],[219,0,230,0],[219,1,219,3],[219,4,219,7],[220,2,220,5],[221,2,221,3],[222,1,222,7],[227,1,227,3],[227,5,227,6],[228,1,228,6],[229,1,229,6],[230,1,230,6],[232,0,243,0],[232,1,232,3],[232,4,232,7],[233,2,233,5],[234,2,234,3],[235,1,235,7],[240,1,240,3],[240,5,240,6],[241,1,241,6],[242,1,242,6],[243,1,243,6],[245,0,256,0],[245,1,245,3],[245,4,245,7],[245,10,245,11],[246,2,246,5],[247,2,247,3],[248,1,248,7],[252,1,252,3],[252,5,252,6],[253,1,253,6],[254,1,254,6],[255,1,255,6],[257,0,275,0],[257,1,257,3],[257,4,257,7],[257,10,257,11],[258,2,258,5],[259,2,259,3],[260,1,260,7],[262,12,271,15],[272,1,272,3],[272,5,272,6],[273,1,273,6],[274,1,274,6],[275,1,275,6],[277,0,292,0],[277,1,277,3],[277,4,277,7],[278,2,278,5],[279,2,279,3],[280,1,280,7],[289,1,289,3],[289,5,289,6],[290,1,290,6],[291,1,291,6],[292,1,292,6],[294,0,310,0],[294,1,294,3],[294,4,294,7],[295,2,295,5],[296,2,296,3],[297,1,297,7],[307,1,307,3],[307,5,307,6],[308,1,308,6],[309,1,309,6],[310,1,310,6],[312,0,328,0],[312,1,312,3],[312,4,312,7],[313,2,313,5],[314,2,314,3],[315,1,315,7],[325,1,325,3],[325,5,325,6],[326,1,326,6],[327,1,327,6],[328,1,328,6],[330,0,346,0],[330,1,330,3],[330,4,330,7],[331,2,331,5],[332,2,332,3],[333,1,333,7],[343,1,343,3],[343,5,343,6],[344,1,344,6],[345,1,345,6],[346,1,346,6],[348,0,357,0],[348,1,348,3],[348,4,348,7],[349,2,349,5],[350,2,350,3],[351,1,351,7],[354,1,354,3],[354,5,354,6],[355,1,355,6],[356,1,356,6],[357,1,357,6],[359,0,368,0],[359,1,359,3],[359,4,359,7],[360,2,360,5],[361,2,361,3],[362,1,362,7],[365,1,365,3],[365,5,365,6],[366,1,366,6],[367,1,367,6],[368,1,368,6],[370,0,379,0],[370,1,370,3],[370,4,370,7],[371,2,371,5],[372,2,372,3],[373,1,373,7],[376,1,376,3],[376,5,376,6],[377,1,377,6],[378,1,378,6],[379,1,379,6]]}
[1,"CODEVASF",null,null," COMPOSIÇÃO DE PREÇO UNITÁRIO",null,null,null,{"$f":"H11","v":8742.3799999999992},{"$f":"H13","v":10781.1},"BDI CALCULADO:",null,{"$f":"ORÇAMENTO!I6","v":0.23319999999999999}]
[null,"OBRA:  ",{"$f":"ORÇAMENTO!C5","v":" PAVIMENTAÇÃO ASFÁLTICA EM CBUQ – ESTRADA BONFIM - BELO VALE  (BONFIM / MG) - LOTE 1: VARGEM ALEGRE ATÉ MACAÚBAS"},null,null,null,"DATA: ",{"$f":"ORÇAMENTO!C6","v":" AGOSTO / 2023   "},null,null,"BDI DIFERENCIADO:",null,{"$f":"'BDI FORN'!D31/100","v":0.15}]
[null,"SERVIÇO:  ",{"$f":"VLOOKUP(A1,ORÇAMENTO!A10:I30,3)","v":"MOBILIZAÇÃO E DESMOBILIZAÇÃO"},null,"Referência:",{"$f":"VLOOKUP(A1,ORÇAMENTO!$A$10:$I$30,4)","v":"CPU.1"},"UNIDADE: ",{"$f":"VLOOKUP(A1,ORÇAMENTO!A10:I30,5)","v":"GL"}]
[]
[null,"TIPO ITEM","CODIGO ITEM","DESCRIÇÃO ITEM","UNIDADE ITEM","COEFICIENTE","PRECO UNITARIO","CUSTO TOTAL"]
[null,"COMPOSICAO",89876,"CAMINHÃO BASCULANTE 14 M3, COM CAVALO MECÂNICO DE CAPACIDADE MÁXIMA DE TRAÇÃO COMBINADO DE 36000 KG, POTÊNCIA 286 CV, INCLUSIVE SEMIREBOQUE COM CAÇAMBA METÁLICA","CHP DIURNO.",16,286.2,{"$f":"ROUNDDOWN(F6*G6,2)","v":4579.2}]
[null,"COMPOSICAO",89877,"CAMINHÃO BASCULANTE 14 M3, COM CAVALO MECÂNICO DE CAPACIDADE MÁXIMA DE TRAÇÃO COMBINADO DE 36000 KG, POTÊNCIA 286 CV, INCLUSIVE SEMIREBOQUE COM CAÇAMBA METÁLICA","CHI DIURNO.",16,82.81,{"$f":"ROUNDDOWN(F7*G7,2)","v":1324.96}]
[null,"COMPOSICAO",5914640,"TRANSPORTE COM CAVALO MECÂNICO COM SEMIRREBOQUE COM CAPACIDADE DE 30 T - RODOVIA PAVIMENTADA","T.KM",3870,0.56999999999999995,{"$f":"ROUNDDOWN(F8*G8,2)","v":2205.9}]
[null,"COMPOSIÇÃO",88316,"SERVENTE COM ENCARGOS COMPLEMENTARES","H",32,19.760000000000002,{"$f":"ROUNDDOWN(F9*G9,2)","v":632.32000000000005}]
[null,"PRODUÇÃO DA EQUIPE",null,null,1,"CUSTO ",null,{"$f":"SUM(H6:H9)","v":8742.3799999999992}]
[null,"TOTAL",{"$nulls":5},{"$f":"H10/E10","v":8742.3799999999992},"OK"]
[null,"BDI                %",{"$nulls":5},{"$f":"1+$M$1","v":1.2332000000000001}]
[null,"TOTAL DO SERVIÇO - R$",{"$nulls":5},{"$f":"ROUND(H11*H12,2)","v":10781.1}]
[]
[2,"CODEVASF",null,null," COMPOSIÇÃO DE PREÇO UNITÁRIO",null,null,null,{"$f":"H30","v":60372.08},{"$f":"H32","v":74450.850000000006}]
[null,"OBRA:  ",{"$f":"$C$2","v":" PAVIMENTAÇÃO ASFÁLTICA EM CBUQ – ESTRADA BONFIM - BELO VALE  (BONFIM / MG) - LOTE 1: VARGEM ALEGRE ATÉ MACAÚBAS"},null,null,null,"DATA: ",{"$f":"$H$2","v":" AGOSTO / 2023   "}]
[null,"SERVIÇO:  ",{"$f":"VLOOKUP(A15,ORÇAMENTO!$A$10:$I$30,3)","v":"ADMINISTRAÇÃO LOCAL"},null,"SINAPI",{"$f":"VLOOKUP(A15,ORÇAMENTO!$A$10:$I$30,4)","v":"CPU.2"},"UNIDADE: ",{"$f":"VLOOKUP(A15,ORÇAMENTO!$A$10:$I$30,5)","v":"GL"}]
[]
[null,"TIPO ITEM","CODIGO ITEM","DESCRIÇÃO ITEM","UNIDADE ITEM","COEFICIENTE","PRECO UNITARIO","CUSTO TOTAL"]
[null,"INSUMO",14250,"ENERGIA ELÉTRICA","kwh",60,0.95,{"$f":"ROUNDDOWN(F20*G20,2)","v":57}]
[null,"INSUMO",44480,"TARIFA \"A\" - ÁGUA/ESGOTO ","m³",6,17.97,107.82]
[null,"COTAÇÃO","MERC.","TELEFONE (PLANO CONTROLE)","UNID",2,59.9,119.8]
[null,"INSUMO","ED-50155 SEINFRA","BANHEIRO QUÍMICO 110 X 120 X 230 CM COM MANUTENÇÃO (CONSIDERANDO OBRAS SIMULTÂNEAS)","MÊS",2,515,1030]
[null,"COMPOSICAO",90777,"Engenheiro Civil Júnior com encargos complementares","H",40,114.12,4564.8]
[null,"COMPOSICAO",90776,"Encarregado Geral com encargos complementares","H",80,57.73,4618.3999999999996]
[null,"COMPOSICAO",88321,"Tecnico de Laboratório com encargos complementares","H",40,45.45,1818]
[null,"COMPOSICAO",100309,"Tecnico em Segurança do Trabalho com encargos complementares","H",40,45.71,1828.4]
[null,"COMPOSICAO",90772,"Auxiliar de escritório com encargos complementares","H",40,23.72,948.8]
[null,"PRODUÇÃO DA EQUIPE",null,null,0.25,"CUSTO ",null,{"$f":"SUM(H20:H28)","v":15093.019999999999}]
[null,"TOTAL",{"$nulls":5},{"$f":"ROUND(H29/E29,2)","v":60372.08},"OK"]
[null,"BDI                %",{"$nulls":5},{"$f":"1+$M$1","v":1.2332000000000001}]
[null,"TOTAL DO SERVIÇO - R$",{"$nulls":5},{"$f":"ROUND(H30*H31,2)","v":74450.850000000006}]
[]
[{"$f":"A15+1","v":3},"CODEVASF",null,null," COMPOSIÇÃO DE PREÇO UNITÁRIO",null,null,null,{"$f":"H45","v":12877.36},{"$f":"H47","v":15880.36}]
[null,"OBRA:  ",{"$f":"$C$2","v":" PAVIMENTAÇÃO ASFÁLTICA EM CBUQ – ESTRADA BONFIM - BELO VALE  (BONFIM / MG) - LOTE 1: VARGEM ALEGRE ATÉ MACAÚBAS"},null,null,null,"DATA: ",{"$f":"$H$2","v":" AGOSTO / 2023   "}]
[null,"SERVIÇO:  ",{"$f":"VLOOKUP(A34,ORÇAMENTO!$A$10:$I$30,3)","v":"CANTEIRO DE OBRAS"},null,"SINAPI",{"$f":"VLOOKUP(A34,ORÇAMENTO!$A$10:$I$30,4)","v":"CPU.3"},"UNIDADE: ",{"$f":"VLOOKUP(A34,ORÇAMENTO!$A$10:$I$30,5)","v":"GL"}]
[]
[null,"TIPO ITEM","CODIGO ITEM","DESCRIÇÃO ITEM","UNIDADE ITEM","COEFICIENTE","PRECO UNITARIO","CUSTO TOTAL"]
[null,"INSUMO",10775,"LOCACAO DE CONTAINER 2,30 X 6,00 M, ALT. 2,50 M, COM 1 SANITARIO, PARA ESCRITORIO, COMPLETO, SEM DIVISORIAS INTERNAS","MÊS",4,"995,00",{"$f":"ROUNDDOWN(F39*G39,2)","v":3980}]
[null,"INSUMO",10776,"LOCACAO DE CONTAINER 2,30 X 6,00 M, ALT. 2,50 M, PARA ALMOXARIFADO, SEM DIVISORIAS INTERNAS E SEM SANITARIO","MÊS",4,777.34,{"$f":"ROUNDDOWN(F40*G40,2)","v":3109.36}]
[null,"INSUMO",10779,"LOCACAO DE CONTAINER 2,30 X 4,30 M, ALT. 2,50 M, P/ SANITARIO, C/ 5 BACIAS, 1 LAVATORIO E 4 MICTORIOS","MÊS",4,1234.75,{"$f":"ROUNDDOWN(F41*G41,2)","v":4939}]
[null,"INSUMO","37525","TELA PLASTICA TECIDA LISTRADA BRANCA E LARANJA, TIPO GUARDA CORPO, EM POLIETILENO MONOFILADO, ROLO 1,20 X 50 M (L X C)","M",100,3.69,{"$f":"ROUNDDOWN(F42*G42,2)","v":369}]
[null,"COMPOSICAO"," - ","PLACA DE SINALIZAÇÃO - \"PERIGO - OBRAS A FRENTE\" - FORNECIMENTO E MOVIMENTAÇÃO","UNID.",24,20,{"$f":"ROUNDDOWN(F43*G43,2)","v":480}]
[null,"PRODUÇÃO DA EQUIPE",null,null,1,"CUSTO ",null,{"$f":"SUM(H39:H43)","v":12877.36}]
[null,"TOTAL",{"$nulls":5},{"$f":"H44/E44","v":12877.36},"OK"]
[null,"BDI                %",{"$nulls":5},{"$f":"1+$M$1","v":1.2332000000000001}]
[null,"TOTAL DO SERVIÇO - R$",{"$nulls":5},{"$f":"ROUND(H45*H46,2)","v":15880.36}]
[]
[{"$f":"A34+1","v":4},"CODEVASF",null,null," COMPOSIÇÃO DE PREÇO UNITÁRIO",null,null,null,{"$f":"H63","v":339.72},{"$f":"H65","v":418.94}]
[null,"OBRA:  ",{"$f":"$C$2","v":" PAVIMENTAÇÃO ASFÁLTICA EM CBUQ – ESTRADA BONFIM - BELO VALE  (BONFIM / MG) - LOTE 1: VARGEM ALEGRE ATÉ MACAÚBAS"},null,null,null,"DATA: ",{"$f":"$H$2","v":" AGOSTO / 2023   "}]
[null,"SERVIÇO:  ",{"$f":"VLOOKUP(A49,ORÇAMENTO!$A$10:$I$30,3)","v":"PLACA DE OBRA EM CHAPA DE AÇO GALVANIZADO"},null,"SINAPI",{"$f":"VLOOKUP(A49,ORÇAMENTO!$A$10:$I$30,4)","v":103689},"UNIDADE: ",{"$f":"VLOOKUP(A49,ORÇAMENTO!$A$10:$I$30,5)","v":"M2"}]
[]
[null,"TIPO ITEM","CODIGO ITEM","DESCRIÇÃO ITEM","UNIDADE ITEM","COEFICIENTE","PRECO UNITARIO","CUSTO TOTAL"]
[null,"INSUMO","4509","SARRAFO *2,5 X 10* CM EM PINUS, MISTA OU EQUIVALENTE DA REGIAO - BRUTA","M","3,2083000","4,41",{"$f":"ROUNDDOWN(F54*G54,2)","v":14.14}]
[null,"INSUMO","4813","PLACA DE OBRA (PARA CONSTRUCAO CIVIL) EM CHAPA GALVANIZADA *N. 22*, ADESIVADA, DE *2,4 X 1,2* M ","M2","1,0000000","250,00",250]
[null,"INSUMO",4115,"MADEIRA ROLICA TRATADA, D = 12 A 15 CM, EM EUCALIPTO OU EQUIVALENTE DA REGIAO","M",2,21.37,42.74]
[null,"INSUMO","5065","PREGO DE ACO POLIDO COM CABECA 10 X 10 (7/8 X 17)","KG","0,0113000","36,57",0.41]
[null,"INSUMO","5069","PREGO DE ACO POLIDO COM CABECA 17 X 27 (2 1/2 X 11)","KG","0,0132000",19.59,0.25]
[null,"COMPOSICAO","88262","CARPINTEIRO DE FORMAS COM ENCARGOS COMPLEMENTARES","H","0,3729000","27,05",10.08]
[null,"COMPOSICAO","88316","SERVENTE COM ENCARGOS COMPLEMENTARES","H","1,1186000","19,76",22.1]
[{"$nulls":7},0]
[null,"PRODUÇÃO DA EQUIPE",null,null,1,"CUSTO ",null,{"$f":"SUM(H54:H61)","v":339.72}]
[null,"TOTAL",{"$nulls":5},{"$f":"H62/E62","v":339.72},"OK"]
[null,"BDI                %",{"$nulls":5},{"$f":"1+$M$1","v":1.2332000000000001}]
[null,"TOTAL DO SERVIÇO - R$",{"$nulls":5},{"$f":"ROUND(H63*H64,2)","v":418.94}]
[]
[{"$f":"A49+1","v":5},"CODEVASF",null,null," COMPOSIÇÃO DE PREÇO UNITÁRIO",null,null,null,{"$f":"H79","v":0.32999999999999996},{"$f":"H81","v":0.41}]
[null,"OBRA:  ",{"$f":"$C$2","v":" PAVIMENTAÇÃO ASFÁLTICA EM CBUQ – ESTRADA BONFIM - BELO VALE  (BONFIM / MG) - LOTE 1: VARGEM ALEGRE ATÉ MACAÚBAS"},null,null,null,"DATA: ",{"$f":"$H$2","v":" AGOSTO / 2023   "}]
[null,"SERVIÇO:  ",{"$f":"VLOOKUP(A67,ORÇAMENTO!$A$10:$I$30,3)","v":"SERVIÇOS TOPOGRÁFICOS PARA PAVIMENTAÇÃO, INCLUSIVE NOTA DE SERVIÇO, ACOMPANHAMENTO E GREIDE"},null,"SINAPI",{"$f":"VLOOKUP(A67,ORÇAMENTO!$A$10:$I$30,4)","v":78472},"UNIDADE: ",{"$f":"VLOOKUP(A67,ORÇAMENTO!$A$10:$I$30,5)","v":"M2"}]
[]
[null,"TIPO ITEM","CODIGO ITEM","DESCRIÇÃO ITEM","UNIDADE ITEM","COEFICIENTE","PRECO UNITARIO","CUSTO TOTAL"]
[null,"COMPOSICAO",88253,"AUXILIAR DE TOPÓGRAFO COM ENCARGOS COMPLEMENTARES","H",2.5000000000000001E-3,21.57,{"$f":"ROUNDDOWN(F72*G72,2)","v":0.05}]
[null,"COMPOSICAO",88288,"NIVELADOR COM ENCARGOS COMPLEMENTARES","H",2.5000000000000001E-3,26.99,0.06]
[null,"COMPOSICAO",88316,"SERVENTE COM ENCARGOS COMPLEMENTARES","H",7.4999999999999997E-3,19.760000000000002,0.14000000000000001]
[null,"COMPOSICAO",88597,"DESENHISTA DETALHISTA COM ENCARGOS COMPLEMENTARES ","H",2E-3,29.72,0.05]
[null,"COMPOSICAO",92145,"CAMINHONETE CABINE SIMPLES COM MOTOR 1.6 FLEX, CÂMBIO MANUAL, POTÊNCIA 101/104 CV, 2 PORTAS","CHP",5.0000000000000001E-4,72.790000000000006,0.03]
[{"$nulls":7},0]
[null,"PRODUÇÃO DA EQUIPE",null,null,1,"CUSTO ",null,{"$f":"SUM(H72:H77)","v":0.32999999999999996}]
[null,"TOTAL",{"$nulls":5},{"$f":"H78/E78","v":0.32999999999999996},"OK"]
[null,"BDI                %",{"$nulls":5},{"$f":"1+$M$1","v":1.2332000000000001}]
[null,"TOTAL DO SERVIÇO - R$",{"$nulls":5},{"$f":"ROUND(H79*H80,2)","v":0.41}]
[]
[{"$f":"A67+1","v":6},"CODEVASF",null,null," COMPOSIÇÃO DE PREÇO UNITÁRIO",null,null,null,{"$f":"H92","v":2.0300000000000002},{"$f":"H94","v":2.5}]
[null,"OBRA:  ",{"$f":"$C$2","v":" PAVIMENTAÇÃO ASFÁLTICA EM CBUQ – ESTRADA BONFIM - BELO VALE  (BONFIM / MG) - LOTE 1: VARGEM ALEGRE ATÉ MACAÚBAS"},null,null,null,"DATA: ",{"$f":"$H$2","v":" AGOSTO / 2023   "}]
[null,"SERVIÇO:  ",{"$f":"VLOOKUP(A83,ORÇAMENTO!$A$10:$I$30,3)","v":"ESCAVAÇÃO HORIZONTAL EM SOLO DE 1A CATEGORIA "},null,"SINAPI",{"$f":"VLOOKUP(A83,ORÇAMENTO!$A$10:$I$30,4)","v":101116},"UNIDADE: ",{"$f":"VLOOKUP(A83,ORÇAMENTO!$A$10:$I$30,5)","v":"M3"}]
[]
[null,"TIPO ITEM","CODIGO ITEM","DESCRIÇÃO ITEM","UNIDADE ITEM","COEFICIENTE","PRECO UNITARIO","CUSTO TOTAL"]
[null,"COMPOSICAO","5847","TRATOR DE ESTEIRAS, POTÊNCIA 170 HP, PESO OPERACIONAL 19 T, CAÇAMBA 5,2 M3","CHP","0,0048000",231.82,{"$f":"ROUNDDOWN(F88*G88,2)","v":1.1100000000000001}]
[null,"COMPOSICAO","5849","TRATOR DE ESTEIRAS, POTÊNCIA 170 HP, PESO OPERACIONAL 19 T, CAÇAMBA 5,2 M3","CHI","0,0082000",82.14,{"$f":"ROUNDDOWN(F89*G89,2)","v":0.67}]
[null,"COMPOSICAO","88316","SERVENTE COM ENCARGOS COMPLEMENTARES","H","0,0131000","19,76",{"$f":"ROUNDDOWN(F90*G90,2)","v":0.25}]
[null,"PRODUÇÃO DA EQUIPE",null,null,1,"CUSTO ",null,{"$f":"SUM(H88:H90)","v":2.0300000000000002}]
[null,"TOTAL",{"$nulls":5},{"$f":"H91/E91","v":2.0300000000000002},"OK"]
[null,"BDI                %",{"$nulls":5},{"$f":"1+$M$1","v":1.2332000000000001}]
[null,"TOTAL DO SERVIÇO - R$",{"$nulls":5},{"$f":"ROUND(H92*H93,2)","v":2.5}]
[]
[7,"CODEVASF",null,null," COMPOSIÇÃO DE PREÇO UNITÁRIO",null,null,null,{"$f":"H106","v":7.99},{"$f":"H108","v":9.85}]
[null,"OBRA:  ",{"$f":"$C$2","v":" PAVIMENTAÇÃO ASFÁLTICA EM CBUQ – ESTRADA BONFIM - BELO VALE  (BONFIM / MG) - LOTE 1: VARGEM ALEGRE ATÉ MACAÚBAS"},null,null,null,"DATA: ",{"$f":"$H$2","v":" AGOSTO / 2023   "}]
[null,"SERVIÇO:  ",{"$f":"VLOOKUP(A96,ORÇAMENTO!$A$10:$I$30,3)","v":"CARGA, MANOBRA E DESCARGA DE SOLOS E MATERIAIS GRANULARES EM CAMINHÃO BASCULANTE"},null,"SINAPI",{"$f":"VLOOKUP(A96,ORÇAMENTO!$A$10:$I$30,4)","v":100976},"UNIDADE: ",{"$f":"VLOOKUP(A96,ORÇAMENTO!$A$10:$I$30,5)","v":"M3"}]
[]
[null,"TIPO ITEM","CODIGO ITEM","DESCRIÇÃO ITEM","UNIDADE ITEM","COEFICIENTE","PRECO UNITARIO","CUSTO TOTAL"]
[null,"COMPOSICAO","5940","PÁ CARREGADEIRA SOBRE RODAS, POTÊNCIA LÍQUIDA 128 HP, CAPACIDADE DA CAÇAMBA 1,7 A 2,8 M3, PESO OPERACIONAL 11632 KG","CHP","0,0083000","205,93",{"$f":"ROUNDDOWN(F101*G101,2)","v":1.7}]
[null,"COMPOSICAO","5942","PÁ CARREGADEIRA SOBRE RODAS, POTÊNCIA LÍQUIDA 128 HP, CAPACIDADE DA CAÇAMBA 1,7 A 2,8 M3, PESO OPERACIONAL 11632 KG","CHI","0,0074000","90,02",{"$f":"ROUNDDOWN(F102*G102,2)","v":0.66}]
[null,"COMPOSICAO","89883","CAMINHÃO BASCULANTE 18 M3, COM CAVALO MECÂNICO DE CAPACIDADE MÁXIMA DE TRAÇÃO COMBINADO DE 45000 KG, POTÊNCIA 330 CV, INCLUSIVE SEMIREBOQUE COM CAÇAMBA METÁLICA","CHP","0,0153000","314,64",{"$f":"ROUNDDOWN(F103*G103,2)","v":4.8099999999999996}]
[null,"COMPOSICAO","89884","CAMINHÃO BASCULANTE 18 M3, COM CAVALO MECÂNICO DE CAPACIDADE MÁXIMA DE TRAÇÃO COMBINADO DE 45000 KG, POTÊNCIA 330 CV, INCLUSIVE SEMIREBOQUE COM CAÇAMBA METÁLICA","CHI","0,0095000","86,36",{"$f":"ROUNDDOWN(F104*G104,2)","v":0.82}]
[null,"PRODUÇÃO DA EQUIPE",null,null,1,"CUSTO ",null,{"$f":"SUM(H101:H104)","v":7.99}]
[null,"TOTAL",{"$nulls":5},{"$f":"H105/E105","v":7.99},"OK"]
[null,"BDI                %",{"$nulls":5},{"$f":"1+$M$1","v":1.2332000000000001}]
[null,"TOTAL DO SERVIÇO - R$",{"$nulls":5},{"$f":"ROUND(H106*H107,2)","v":9.85}]
[]
[8,"CODEVASF",null,null," COMPOSIÇÃO DE PREÇO UNITÁRIO",null,null,null,{"$f":"H124","v":1.1299999999999999},{"$f":"H126","v":1.39}]
[null,"OBRA:  ",{"$f":"$C$2","v":" PAVIMENTAÇÃO ASFÁLTICA EM CBUQ – ESTRADA BONFIM - BELO VALE  (BONFIM / MG) - LOTE 1: VARGEM ALEGRE ATÉ MACAÚBAS"},null,null,null,"DATA: ",{"$f":"$H$2","v":" AGOSTO / 2023   "}]
[null,"SERVIÇO:  ",{"$f":"VLOOKUP(A110,ORÇAMENTO!$A$10:$I$30,3)","v":"REGULARIZAÇÃO E COMPACTAÇÃO DO SUBLEITO "},null,"SICRO",{"$f":"VLOOKUP(A110,ORÇAMENTO!$A$10:$I$30,4)","v":100577},"UNIDADE: ","M2"]
[]
[null,"TIPO ITEM","CODIGO ITEM","DESCRIÇÃO ITEM","UNIDADE ITEM","COEFICIENTE","PRECO UNITARIO","CUSTO TOTAL"]
[null,"COMPOSICAO","5901","CAMINHÃO PIPA 10.000 L TRUCADO, PESO BRUTO TOTAL 23.000 KG, CARGA ÚTIL MÁXIMA 15.935 KG, DISTÂNCIA ENTRE EIXOS 4,8 M, POTÊNCIA 230 CV, INCLUSIVE TANQUE DE AÇO PARA TRANSPORTE DE ÁGUA","CHP","0,0010000","264,71",{"$f":"ROUNDDOWN(F115*G115,2)","v":0.26}]
[null,"COMPOSICAO","5903","CAMINHÃO PIPA 10.000 L TRUCADO, PESO BRUTO TOTAL 23.000 KG, CARGA ÚTIL MÁXIMA 15.935 KG, DISTÂNCIA ENTRE EIXOS 4,8 M, POTÊNCIA 230 CV, INCLUSIVE TANQUE DE AÇO PARA TRANSPORTE DE ÁGUA","CHI","0,0020000","67,26",0.13]
[null,"COMPOSICAO","5932","MOTONIVELADORA POTÊNCIA BÁSICA LÍQUIDA (PRIMEIRA MARCHA) 125 HP, PESO BRUTO 13032 KG, LARGURA DA LÂMINA DE 3,7 M","CHP","0,0001000","244,89",0.02]
[null,"COMPOSICAO","5934","MOTONIVELADORA POTÊNCIA BÁSICA LÍQUIDA (PRIMEIRA MARCHA) 125 HP, PESO BRUTO 13032 KG, LARGURA DA LÂMINA DE 3,7 M","CHI","0,0030000","101,62",0.3]
[null,"COMPOSICAO","88316","SERVENTE COM ENCARGOS COMPLEMENTARES","H","0,0030000","19,76",0.05]
[null,"COMPOSICAO","96463","ROLO COMPACTADOR DE PNEUS, ESTATICO, PRESSAO VARIAVEL, POTENCIA 110 HP, PESO SEM/COM LASTRO 10,8/27 T, LARGURA DE ROLAGEM 2,30 M","CHP","0,0010000","203,13",0.2]
[null,"COMPOSICAO","96464","ROLO COMPACTADOR DE PNEUS, ESTATICO, PRESSAO VARIAVEL, POTENCIA 110 HP, PESO SEM/COM LASTRO 10,8/27 T, LARGURA DE ROLAGEM 2,30 M","CHI","0,0020000","89,07",0.17]
[]
[null,"PRODUÇÃO DA EQUIPE",null,null,1,"CUSTO ",null,{"$f":"SUM(H115:H122)","v":1.1299999999999999}]
[null,"TOTAL",{"$nulls":5},{"$f":"H123/E123","v":1.1299999999999999},"OK"]
[null,"BDI                %",{"$nulls":5},{"$f":"1+$M$1","v":1.2332000000000001}]
[null,"TOTAL DO SERVIÇO - R$",{"$nulls":5},{"$f":"ROUND(H124*H125,2)","v":1.39}]
[]
[9,"CODEVASF",null,null," COMPOSIÇÃO DE PREÇO UNITÁRIO",null,null,null,{"$f":"H143","v":11.61},{"$f":"H145","v":14.32}]
[null,"OBRA:  ",{"$f":"$C$2","v":" PAVIMENTAÇÃO ASFÁLTICA EM CBUQ – ESTRADA BONFIM - BELO VALE  (BONFIM / MG) - LOTE 1: VARGEM ALEGRE ATÉ MACAÚBAS"},null,null,null,"DATA: ",{"$f":"$H$2","v":" AGOSTO / 2023   "}]
[null,"SERVIÇO:  ",{"$f":"VLOOKUP(A128,ORÇAMENTO!$A$10:$I$30,3)","v":"EXECUÇÃO E COMPACTAÇÃO DE BASE E/OU SUB BASE PARA PAVIMENTAÇÃO DE SOLOS DE COMPORTAMENTO LATERÍTICO - EXCLUSIVE SOLO, ESCAVAÇÃO, CARGA E TRANSPORTE"},null,"SINAPI",{"$f":"VLOOKUP(A128,ORÇAMENTO!$A$10:$I$30,4)","v":96388},"UNIDADE: ",{"$f":"VLOOKUP(A128,ORÇAMENTO!$A$10:$I$30,5)","v":"M3"}]
[]
[null,"TIPO ITEM","CODIGO ITEM","DESCRIÇÃO ITEM","UNIDADE ITEM","COEFICIENTE","PRECO UNITARIO","CUSTO TOTAL"]
[null,"COMPOSICAO","5684","ROLO COMPACTADOR VIBRATÓRIO DE UM CILINDRO AÇO LISO, POTÊNCIA 80 HP, PESO OPERACIONAL MÁXIMO 8,1 T, IMPACTO DINÂMICO 16,15 / 9,5 T, LARGURA DE TRABALHO 1,68 M","CHP","0,0030000","148,46",{"$f":"ROUNDDOWN(F133*G133,2)","v":0.44}]
[null,"COMPOSICAO","5685","ROLO COMPACTADOR VIBRATÓRIO DE UM CILINDRO AÇO LISO, POTÊNCIA 80 HP, PESO OPERACIONAL MÁXIMO 8,1 T, IMPACTO DINÂMICO 16,15 / 9,5 T, LARGURA DE TRABALHO 1,68 M","CHI","0,0230000","65,46",1.5]
[null,"COMPOSICAO","5901","CAMINHÃO PIPA 10.000 L TRUCADO, PESO BRUTO TOTAL 23.000 KG, CARGA ÚTIL MÁXIMA 15.935 KG, DISTÂNCIA ENTRE EIXOS 4,8 M, POTÊNCIA 230 CV, INCLUSIVE TANQUE DE AÇO PARA TRANSPORTE DE ÁGUA","CHP","0,0040000","264,71",1.05]
[null,"COMPOSICAO","5903","CAMINHÃO PIPA 10.000 L TRUCADO, PESO BRUTO TOTAL 23.000 KG, CARGA ÚTIL MÁXIMA 15.935 KG, DISTÂNCIA ENTRE EIXOS 4,8 M, POTÊNCIA 230 CV, INCLUSIVE TANQUE DE AÇO PARA TRANSPORTE DE ÁGUA","CHI","0,0220000","67,26",1.47]
[null,"COMPOSICAO","5932","MOTONIVELADORA POTÊNCIA BÁSICA LÍQUIDA (PRIMEIRA MARCHA) 125 HP, PESO BRUTO 13032 KG, LARGURA DA LÂMINA DE 3,7 M","CHP","0,0080000","244,89",1.95]
[null,"COMPOSICAO","5934","MOTONIVELADORA POTÊNCIA BÁSICA LÍQUIDA (PRIMEIRA MARCHA) 125 HP, PESO BRUTO 13032 KG, LARGURA DA LÂMINA DE 3,7 M","CHI","0,0190000","101,62",1.93]
[null,"COMPOSICAO","88316","SERVENTE COM ENCARGOS COMPLEMENTARES","H","0,0260000","19,76",0.51]
[null,"COMPOSICAO","96463","ROLO COMPACTADOR DE PNEUS, ESTATICO, PRESSAO VARIAVEL, POTENCIA 110 HP, PESO SEM/COM LASTRO 10,8/27 T, LARGURA DE ROLAGEM 2,30 M","CHP","0,0040000","203,13",0.81]
[null,"COMPOSICAO","96464","ROLO COMPACTADOR DE PNEUS, ESTATICO, PRESSAO VARIAVEL, POTENCIA 110 HP, PESO SEM/COM LASTRO 10,8/27 T, LARGURA DE ROLAGEM 2,30 M","CHI","0,0220000","89,07",1.95]
[null,"PRODUÇÃO DA EQUIPE",null,null,1,"CUSTO ",null,{"$f":"SUM(H133:H141)","v":11.61}]
[null,"TOTAL",{"$nulls":5},{"$f":"H142/E142","v":11.61},"OK"]
[null,"BDI                %",{"$nulls":5},{"$f":"1+$M$1","v":1.2332000000000001}]
[null,"TOTAL DO SERVIÇO - R$",{"$nulls":5},{"$f":"ROUND(H143*H144,2)","v":14.32}]
[]
[10,"CODEVASF",null,null," COMPOSIÇÃO DE PREÇO UNITÁRIO",null,null,null,{"$f":"H162","v":1.1200000000000001},{"$f":"H164","v":1.38}]
[null,"OBRA:  ",{"$f":"$C$2","v":" PAVIMENTAÇÃO ASFÁLTICA EM CBUQ – ESTRADA BONFIM - BELO VALE  (BONFIM / MG) - LOTE 1: VARGEM ALEGRE ATÉ MACAÚBAS"},null,null,null,"DATA: ",{"$f":"$H$2","v":" AGOSTO / 2023   "}]
[null,"SERVIÇO:  ",{"$f":"VLOOKUP(A147,ORÇAMENTO!$A$10:$I$30,3)","v":"IMPRIMAÇÃO COM EMULSÃO ASFÁLTICA (EAI)"},null,"SINAPI",{"$f":"VLOOKUP(A147,ORÇAMENTO!$A$10:$I$30,4)","v":96401},"UNIDADE: ",{"$f":"VLOOKUP(A147,ORÇAMENTO!$A$10:$I$30,5)","v":"M2"}]
[]
[null,"TIPO ITEM","CODIGO ITEM","DESCRIÇÃO ITEM","UNIDADE ITEM","COEFICIENTE","PRECO UNITARIO","CUSTO TOTAL"]
[null,"COMPOSICAO",5839,"VASSOURA MECÂNICA REBOCÁVEL COM ESCOVA CILÍNDRICA, LARGURA ÚTIL DE VARRIMENTO DE 2,44 M ","CHP","0,0020000",9.77,{"$f":"ROUNDDOWN(F152*G152,2)","v":0.01}]
[null,"COMPOSICAO",5841,"VASSOURA MECÂNICA REBOCÁVEL COM ESCOVA CILÍNDRICA, LARGURA ÚTIL DE VARRIMENTO DE 2,44 M ","CHI","0,0040000",4.6500000000000004,0.01]
[null,"INSUMO","ANP","EMULSÃO ASFÁLTICA PARA IMPRIMAÇÃO - EAI (FORNECIMENTO COM BDI DIFERENCIADO)","T",{"$f":"1.3/1000","v":1.2999999999999999E-3},null,0]
[null,"COMPOSICAO",83362,"ESPARGIDOR DE ASFALTO PRESSURIZADO, TANQUE 6 M3 COM ISOLAÇÃO TÉRMICA, AQUECIDO COM 2 MAÇARICOS, COM BARRA ESPARGIDORA 3,60 M, MONTADO SOBRE CAMINHÃO  TOCO, PBT 14.300 KG, POTÊNCIA 185 CV","CHP","0,0010000",232.92,0.23]
[null,"COMPOSICAO",88316,"SERVENTE COM ENCARGOS COMPLEMENTARES","H","0,0060000",19.760000000000002,0.11]
[null,"COMPOSICAO",89035,"TRATOR DE PNEUS, POTÊNCIA 85 CV, TRAÇÃO 4X4, PESO COM LASTRO DE 4.675 KG ","CHP","0,0020000",119.96,0.23]
[null,"COMPOSICAO",89036,"TRATOR DE PNEUS, POTÊNCIA 85 CV, TRAÇÃO 4X4, PESO COM LASTRO DE 4.675 KG ","CHI","0,0040000",52.19,0.2]
[null,"COMPOSICAO",91486,"ESPARGIDOR DE ASFALTO PRESSURIZADO, TANQUE 6 M3 COM ISOLAÇÃO TÉRMICA, AQUECIDO COM 2 MAÇARICOS, COM BARRA ESPARGIDORA 3,60 M, MONTADO SOBRE CAMINHÃO  TOCO, PBT 14.300 KG, POTÊNCIA 185 CV","CHI","0,0050000",66.180000000000007,0.33]
[{"$nulls":7},0]
[null,"PRODUÇÃO DA EQUIPE",null,null,1,"CUSTO ",null,{"$f":"SUM(H152:H160)","v":1.1200000000000001}]
[null,"TOTAL",{"$nulls":5},{"$f":"H161/E161","v":1.1200000000000001},"OK"]
[null,"BDI                %",{"$nulls":5},{"$f":"1+$M$1","v":1.2332000000000001}]
[null,"TOTAL DO SERVIÇO - R$",{"$nulls":5},{"$f":"ROUND(H162*H163,2)","v":1.38}]
[]
[11,"CODEVASF",null,null," COMPOSIÇÃO DE PREÇO UNITÁRIO",null,null,null,{"$f":"H181","v":0.93000000000000016},{"$f":"H183","v":1.1499999999999999}]
[null,"OBRA:  ",{"$f":"$C$2","v":" PAVIMENTAÇÃO ASFÁLTICA EM CBUQ – ESTRADA BONFIM - BELO VALE  (BONFIM / MG) - LOTE 1: VARGEM ALEGRE ATÉ MACAÚBAS"},null,null,null,"DATA: ",{"$f":"$H$2","v":" AGOSTO / 2023   "}]
[null,"SERVIÇO:  ",{"$f":"VLOOKUP(A166,ORÇAMENTO!$A$10:$I$30,3)","v":"PINTURA DE LIGAÇÃO COM EMULSÃO ASFÁLTICA RR-1C"},null,"SINAPI",{"$f":"VLOOKUP(A166,ORÇAMENTO!$A$10:$I$30,4)","v":96402},"UNIDADE: ","M2"]
[]
[null,"TIPO ITEM","CODIGO ITEM","DESCRIÇÃO ITEM","UNIDADE ITEM","COEFICIENTE","PRECO UNITARIO","CUSTO TOTAL"]
[null,"COMPOSICAO",5839,"VASSOURA MECÂNICA REBOCÁVEL COM ESCOVA CILÍNDRICA, LARGURA ÚTIL DE VARRIMENTO DE 2,44 M","CHP","0,0020000",9.77,{"$f":"ROUNDDOWN(F171*G171,2)","v":0.01}]
[null,"COMPOSICAO",5841,"VASSOURA MECÂNICA REBOCÁVEL COM ESCOVA CILÍNDRICA, LARGURA ÚTIL DE VARRIMENTO DE 2,44 M","CHI","0,0040000",4.6500000000000004,0.01]
[null,"INSUMO",41903,"EMULSAO ASFALTICA CATIONICA RR-1C PARA USO EM PAVIMENTACAO ASFALTICA (FORNECIMENTO COM BDI DIFERENCIADO)","KG","0,4500000",null,0]
[null,"COMPOSICAO",83362,"ESPARGIDOR DE ASFALTO PRESSURIZADO, TANQUE 6 M3 COM ISOLAÇÃO TÉRMICA, AQUECIDO COM 2 MAÇARICOS, COM BARRA ESPARGIDORA 3,60 M, MONTADO SOBRE CAMINHÃO  TOCO, PBT 14.300 KG, POTÊNCIA 185 CV","CHP","0,0004000",232.92,0.09]
[null,"COMPOSICAO",88316,"SERVENTE COM ENCARGOS COMPLEMENTARES","H","0,0055000",19.760000000000002,0.1]
[null,"COMPOSICAO",89035,"TRATOR DE PNEUS, POTÊNCIA 85 CV, TRAÇÃO 4X4, PESO COM LASTRO DE 4.675 KG","CHP","0,0017000",119.96,0.2]
[null,"COMPOSICAO",89036,"TRATOR DE PNEUS, POTÊNCIA 85 CV, TRAÇÃO 4X4, PESO COM LASTRO DE 4.675 KG","CHI","0,0038000",52.19,0.19]
[null,"COMPOSICAO",91486,"ESPARGIDOR DE ASFALTO PRESSURIZADO, TANQUE 6 M3 COM ISOLAÇÃO TÉRMICA, AQUECIDO COM 2 MAÇARICOS, COM BARRA ESPARGIDORA 3,60 M, MONTADO SOBRE CAMINHÃO  TOCO, PBT 14.300 KG, POTÊNCIA 185 CV","CHI","0,0051000",66.180000000000007,0.33]
[{"$nulls":7},0]
[null,"PRODUÇÃO DA EQUIPE",null,null,1,"CUSTO ",null,{"$f":"SUM(H171:H179)","v":0.93000000000000016}]
[null,"TOTAL",{"$nulls":5},{"$f":"H180/E180","v":0.93000000000000016},"OK"]
[null,"BDI                %",{"$nulls":5},{"$f":"1+$M$1","v":1.2332000000000001}]
[null,"TOTAL DO SERVIÇO - R$",{"$nulls":5},{"$f":"ROUND(H181*H182,2)","v":1.1499999999999999}]
[]
[12,"CODEVASF",null,null," COMPOSIÇÃO DE PREÇO UNITÁRIO",null,null,null,{"$f":"H203","v":121.32},{"$f":"H205","v":149.61000000000001}]
[null,"OBRA:  ",{"$f":"$C$2","v":" PAVIMENTAÇÃO ASFÁLTICA EM CBUQ – ESTRADA BONFIM - BELO VALE  (BONFIM / MG) - LOTE 1: VARGEM ALEGRE ATÉ MACAÚBAS"},null,null,null,"DATA: ",{"$f":"$H$2","v":" AGOSTO / 2023   "}]
[null,"SERVIÇO:  ",{"$f":"VLOOKUP(A185,ORÇAMENTO!$A$10:$I$30,3)","v":"EXECUÇÃO DE PAVIMENTO COM APLICAÇÃO DE CONCRETO ASFÁLTICO USINADO A QUENTE (CBUQ), CAMADA DE ROLAMENTO - EXCLUSIVE TRANSPORTE"},null,"SINAPI",{"$f":"VLOOKUP(A185,ORÇAMENTO!$A$10:$I$30,4)","v":95995},"UNIDADE: ",{"$f":"VLOOKUP(A185,ORÇAMENTO!$A$10:$I$30,5)","v":"M3"}]
[]
[null,"TIPO ITEM","CODIGO ITEM","DESCRIÇÃO ITEM","UNIDADE ITEM","COEFICIENTE","PRECO UNITARIO","CUSTO TOTAL"]
[null,"INSUMO","1518","CONCRETO BETUMINOSO USINADO A QUENTE (CBUQ) PARA PAVIMENTACAO ASFALTICA, PADRAO DNIT, FAIXA C, COM CAP 50/70 - AQUISICAO POSTO USINA","T","2,5548000",null,{"$f":"ROUNDDOWN(F190*G190,2)","v":0}]
[null,"COMPOSICAO","5835","VIBROACABADORA DE ASFALTO SOBRE ESTEIRAS, LARGURA DE PAVIMENTAÇÃO 1,90 M A 5,30 M, POTÊNCIA 105 HP CAPACIDADE 450 T/H","CHP","0,0464000","366,49",17]
[null,"COMPOSICAO","5837","VIBROACABADORA DE ASFALTO SOBRE ESTEIRAS, LARGURA DE PAVIMENTAÇÃO 1,90 M A 5,30 M, POTÊNCIA 105 HP CAPACIDADE 450 T/H","CHI","0,0949000","147,82",14.02]
[null,"COMPOSICAO","88314","RASTELEIRO COM ENCARGOS COMPLEMENTARES","H","1,1301000","26,52",29.97]
[null,"COMPOSICAO","91386","CAMINHÃO BASCULANTE 10 M3, TRUCADO CABINE SIMPLES, PESO BRUTO TOTAL 23.000 KG, CARGA ÚTIL MÁXIMA 15.935 KG, DISTÂNCIA ENTRE EIXOS 4,80 M, POTÊNCIA 230 CV INCLUSIVE CAÇAMBA METÁLICA ","CHP","0,0464000","228,50",10.6]
[null,"COMPOSICAO","95631","ROLO COMPACTADOR VIBRATORIO TANDEM, ACO LISO, POTENCIA 125 HP, PESO SEM/COM LASTRO 10,20/11,65 T, LARGURA DE TRABALHO 1,73 M","CHP","0,0805000","210,29",16.920000000000002]
[null,"COMPOSICAO","95632","ROLO COMPACTADOR VIBRATORIO TANDEM, ACO LISO, POTENCIA 125 HP, PESO SEM/COM LASTRO 10,20/11,65 T, LARGURA DE TRABALHO 1,73 M","CHI","0,0607000","83,23",5.05]
[null,"COMPOSICAO","96155","TRATOR DE PNEUS COM POTÊNCIA DE 85 CV, TRAÇÃO 4X4, COM VASSOURA MECÂNICA ACOPLADA","CHI","0,1071000","56,63",6.06]
[null,"COMPOSICAO","96157","TRATOR DE PNEUS COM POTÊNCIA DE 85 CV, TRAÇÃO 4X4, COM VASSOURA MECÂNICA ACOPLADA","CHP","0,0341000","128,67",4.38]
[null,"COMPOSICAO","96463","ROLO COMPACTADOR DE PNEUS, ESTATICO, PRESSAO VARIAVEL, POTENCIA 110 HP, PESO SEM/COM LASTRO 10,8/27 T, LARGURA DE ROLAGEM 2,30 M","CHP","0,0419000","203,13",8.51]
[null,"COMPOSICAO","96464","ROLO COMPACTADOR DE PNEUS, ESTATICO, PRESSAO VARIAVEL, POTENCIA 110 HP, PESO SEM/COM LASTRO 10,8/27 T, LARGURA DE ROLAGEM 2,30 M","CHI","0,0990000","89,07",8.81]
[{"$nulls":7},0]
[null,"PRODUÇÃO DA EQUIPE",null,null,1,"CUSTO ",null,{"$f":"SUM(H190:H201)","v":121.32}]
[null,"TOTAL",{"$nulls":5},{"$f":"H202/E202","v":121.32},"OK"]
[null,"BDI                %",{"$nulls":5},{"$f":"1+$M$1","v":1.2332000000000001}]
[null,"TOTAL DO SERVIÇO - R$",{"$nulls":5},{"$f":"ROUND(H203*H204,2)","v":149.61000000000001}]
[]
[13,"CODEVASF",null,null," COMPOSIÇÃO DE PREÇO UNITÁRIO",null,null,null,{"$f":"H216","v":1.6099999999999999},{"$f":"H218","v":1.99}]
[null,"OBRA:  ",{"$f":"$C$2","v":" PAVIMENTAÇÃO ASFÁLTICA EM CBUQ – ESTRADA BONFIM - BELO VALE  (BONFIM / MG) - LOTE 1: VARGEM ALEGRE ATÉ MACAÚBAS"},null,null,null,"DATA: ",{"$f":"$H$2","v":" AGOSTO / 2023   "}]
[null,"SERVIÇO:  ",{"$f":"VLOOKUP(A207,ORÇAMENTO!$A$10:$I$30,3)","v":"TRANSPORTE COM CAMINHÃO BASCULANTE, EM VIA URBANA PAVIMENTADA"},null,"SINAPI",{"$f":"VLOOKUP(A207,ORÇAMENTO!$A$10:$I$30,4)","v":95877},"UNIDADE: ",{"$f":"VLOOKUP(A207,ORÇAMENTO!$A$10:$I$30,5)","v":"M3XKM"}]
[]
[null,"TIPO ITEM","CODIGO ITEM","DESCRIÇÃO ITEM","UNIDADE ITEM","COEFICIENTE","PRECO UNITARIO","CUSTO TOTAL"]
[null,"COMPOSICAO","89883","CAMINHÃO BASCULANTE 18 M3, COM CAVALO MECÂNICO DE CAPACIDADE MÁXIMA DE TRAÇÃO COMBINADO DE 45000 KG, POTÊNCIA 330 CV, INCLUSIVE SEMIREBOQUE COM CAÇAMBA METÁLICA","CHP","0,0046000",314.64,{"$f":"ROUNDDOWN(F212*G212,2)","v":1.44}]
[null,"COMPOSICAO","89884","CAMINHÃO BASCULANTE 18 M3, COM CAVALO MECÂNICO DE CAPACIDADE MÁXIMA DE TRAÇÃO COMBINADO DE 45000 KG, POTÊNCIA 330 CV, INCLUSIVE SEMIREBOQUE COM CAÇAMBA METÁLICA","CHI","0,0020000","86,36",{"$f":"ROUNDDOWN(F213*G213,2)","v":0.17}]
[{"$nulls":7},{"$f":"ROUNDDOWN(F214*G214,2)","v":0}]
[null,"PRODUÇÃO DA EQUIPE",null,null,1,"CUSTO ",null,{"$f":"SUM(H212:H214)","v":1.6099999999999999}]
[null,"TOTAL",{"$nulls":5},{"$f":"H215/E215","v":1.6099999999999999},"OK"]
[null,"BDI                %",{"$nulls":5},{"$f":"1+$M$1","v":1.2332000000000001}]
[null,"TOTAL DO SERVIÇO - R$",{"$nulls":5},{"$f":"ROUND(H216*H217,2)","v":1.99}]
[]
[14,"CODEVASF",null,null," COMPOSIÇÃO DE PREÇO UNITÁRIO",null,null,null,{"$f":"H229","v":1.92},{"$f":"H231","v":2.37}]
[null,"OBRA:  ",{"$f":"$C$2","v":" PAVIMENTAÇÃO ASFÁLTICA EM CBUQ – ESTRADA BONFIM - BELO VALE  (BONFIM / MG) - LOTE 1: VARGEM ALEGRE ATÉ MACAÚBAS"},null,null,null,"DATA: ",{"$f":"$H$2","v":" AGOSTO / 2023   "}]
[null,"SERVIÇO:  ",{"$f":"VLOOKUP(A220,ORÇAMENTO!$A$10:$I$30,3)","v":"TRANSPORTE COM CAMINHÃO CARROCERIA 9T, EM VIA URBANA PAVIMENTADA"},null,"SINAPI",{"$f":"VLOOKUP(A220,ORÇAMENTO!$A$10:$I$30,4)","v":100947},"UNIDADE: ",{"$f":"VLOOKUP(A220,ORÇAMENTO!$A$10:$I$30,5)","v":"TXKM"}]
[]
[null,"TIPO ITEM","CODIGO ITEM","DESCRIÇÃO ITEM","UNIDADE ITEM","COEFICIENTE","PRECO UNITARIO","CUSTO TOTAL"]
[null,"COMPOSICAO","5824","CAMINHÃO TOCO, PBT 16.000 KG, CARGA ÚTIL MÁX. 10.685 KG, DIST. ENTRE EIXOS 4,8 M, POTÊNCIA 189 CV, INCLUSIVE CARROCERIA FIXA ABERTA DE MADEIRA P/ TRANSPORTE GERAL DE CARGA SECA, DIMEN. APROX. 2,5 X 7,00 X 0,50 M ","CHP","0,0093000",183.71,{"$f":"ROUNDDOWN(F225*G225,2)","v":1.7}]
[null,"COMPOSICAO","5826","CAMINHÃO TOCO, PBT 16.000 KG, CARGA ÚTIL MÁX. 10.685 KG, DIST. ENTRE EIXOS 4,8 M, POTÊNCIA 189 CV, INCLUSIVE CARROCERIA FIXA ABERTA DE MADEIRA P/ TRANSPORTE GERAL DE CARGA SECA, DIMEN. APROX. 2,5 X 7,00 X 0,50 M ","CHI","0,0040000",57,{"$f":"ROUNDDOWN(F226*G226,2)","v":0.22}]
[{"$nulls":7},{"$f":"ROUNDDOWN(F227*G227,2)","v":0}]
[null,"PRODUÇÃO DA EQUIPE",null,null,1,"CUSTO ",null,{"$f":"SUM(H225:H227)","v":1.92}]
[null,"TOTAL",{"$nulls":5},{"$f":"H228/E228","v":1.92},"OK"]
[null,"BDI                %",{"$nulls":5},{"$f":"1+$M$1","v":1.2332000000000001}]
[null,"TOTAL DO SERVIÇO - R$",{"$nulls":5},{"$f":"ROUND(H229*H230,2)","v":2.37}]
[]
[15,"CODEVASF",null,null," COMPOSIÇÃO DE PREÇO UNITÁRIO",null,null,null,{"$f":"H242","v":0.64999999999999991},{"$f":"H244","v":0.75}]
[null,"OBRA:  ",{"$f":"$C$2","v":" PAVIMENTAÇÃO ASFÁLTICA EM CBUQ – ESTRADA BONFIM - BELO VALE  (BONFIM / MG) - LOTE 1: VARGEM ALEGRE ATÉ MACAÚBAS"},null,null,null,"DATA: ",{"$f":"$H$2","v":" AGOSTO / 2023   "}]
[null,"SERVIÇO:  ",{"$f":"VLOOKUP(A233,ORÇAMENTO!$A$10:$I$30,3)","v":"TRANSPORTE DE MASSA ASFÁLTICA COM CAMINHÃO BASCULANTE, EM VIA URBANA PAVIMENTADA (BDI DIFERENCIADO)"},null,"SINAPI",{"$f":"VLOOKUP(A233,ORÇAMENTO!$A$10:$I$30,4)","v":95427},"UNIDADE: ",{"$f":"VLOOKUP(A233,ORÇAMENTO!$A$10:$I$30,5)","v":"TXKM"}]
[]
[null,"TIPO ITEM","CODIGO ITEM","DESCRIÇÃO ITEM","UNIDADE ITEM","COEFICIENTE","PRECO UNITARIO","CUSTO TOTAL"]
[null,"COMPOSICAO","89883","CAMINHÃO BASCULANTE 18 M3, COM CAVALO MECÂNICO DE CAPACIDADE MÁXIMA DE TRAÇÃO COMBINADO DE 45000 KG, POTÊNCIA 330 CV, INCLUSIVE SEMIREBOQUE COM CAÇAMBA METÁLICA - CHP DIURNO. AF_12/2014","CHP","0,0019000","314,64",{"$f":"ROUNDDOWN(F238*G238,2)","v":0.59}]
[null,"COMPOSICAO","89884","CAMINHÃO BASCULANTE 18 M3, COM CAVALO MECÂNICO DE CAPACIDADE MÁXIMA DE TRAÇÃO COMBINADO DE 45000 KG, POTÊNCIA 330 CV, INCLUSIVE SEMIREBOQUE COM CAÇAMBA METÁLICA - CHI DIURNO. AF_12/2014","CHI","0,0008000","86,36",{"$f":"ROUNDDOWN(F239*G239,2)","v":0.06}]
[{"$nulls":7},{"$f":"ROUNDDOWN(F240*G240,2)","v":0}]
[null,"PRODUÇÃO DA EQUIPE",null,null,1,"CUSTO ",null,{"$f":"SUM(H238:H240)","v":0.64999999999999991}]
[null,"TOTAL",{"$nulls":5},{"$f":"H241/E241","v":0.64999999999999991},"OK"]
[null,"BDI                %",{"$nulls":5},{"$f":"1+$M$2","v":1.1499999999999999}]
[null,"TOTAL DO SERVIÇO - R$",{"$nulls":5},{"$f":"ROUND(H242*H243,2)","v":0.75}]
[]
[16,"CODEVASF",null,null," COMPOSIÇÃO DE PREÇO UNITÁRIO",null,null,null,{"$f":"H254","v":0.47},{"$f":"H256","v":0.54}]
[null,"OBRA:  ",{"$f":"$C$2","v":" PAVIMENTAÇÃO ASFÁLTICA EM CBUQ – ESTRADA BONFIM - BELO VALE  (BONFIM / MG) - LOTE 1: VARGEM ALEGRE ATÉ MACAÚBAS"},null,null,null,"DATA: ",{"$f":"$H$2","v":" AGOSTO / 2023   "}]
[null,"SERVIÇO:  ",{"$f":"VLOOKUP(A246,ORÇAMENTO!$A$10:$I$30,3)","v":"TRANSPORTE COM CAMINHÃO TANQUE DE TRANSPORTE DE MATERIAL ASFÁLTICO DE 30000 L, EM VIA URBANA PAVIMENTADA (BDI DIFERENCIADO)"},null,"SINAPI",{"$f":"VLOOKUP(A246,ORÇAMENTO!$A$10:$I$30,4)","v":102331},"UNIDADE: ",{"$f":"VLOOKUP(A246,ORÇAMENTO!$A$10:$I$30,5)","v":"TXKM"}]
[]
[null,"TIPO ITEM","CODIGO ITEM","DESCRIÇÃO ITEM","UNIDADE ITEM","COEFICIENTE","PRECO UNITARIO","CUSTO TOTAL"]
[null,"COMPOSICAO","91645","CAMINHÃO DE TRANSPORTE DE MATERIAL ASFÁLTICO 30.000 L, COM CAVALO MECÂNICO DE CAPACIDADE MÁXIMA DE TRAÇÃO COMBINADO DE 66.000 KG, POTÊNCIA 360 CV, INCLUSIVE TANQUE DE ASFALTO COM SERPENTINA ","CHP","0,0011000",394.83,{"$f":"ROUNDDOWN(F251*G251,2)","v":0.43}]
[null,"COMPOSICAO","91646","CAMINHÃO DE TRANSPORTE DE MATERIAL ASFÁLTICO 30.000 L, COM CAVALO MECÂNICO DE CAPACIDADE MÁXIMA DE TRAÇÃO COMBINADO DE 66.000 KG, POTÊNCIA 360 CV, INCLUSIVE TANQUE DE ASFALTO COM SERPENTINA","CHI","0,0005000",90.79,{"$f":"ROUNDDOWN(F252*G252,2)","v":0.04}]
[null,"PRODUÇÃO DA EQUIPE",null,null,1,"CUSTO ",null,{"$f":"SUM(H251:H252)","v":0.47}]
[null,"TOTAL",{"$nulls":5},{"$f":"H253/E253","v":0.47},"OK"]
[null,"BDI                %",{"$nulls":5},{"$f":"1+$M$2","v":1.1499999999999999}]
[null,"TOTAL DO SERVIÇO - R$",{"$nulls":5},{"$f":"ROUND(H254*H255,2)","v":0.54}]
[]
[17,"CODEVASF",null,null," COMPOSIÇÃO DE PREÇO UNITÁRIO",null,null,null,{"$f":"H274","v":57.36999999999999},{"$f":"H276","v":70.75}]
[null,"OBRA:  ",{"$f":"$C$2","v":" PAVIMENTAÇÃO ASFÁLTICA EM CBUQ – ESTRADA BONFIM - BELO VALE  (BONFIM / MG) - LOTE 1: VARGEM ALEGRE ATÉ MACAÚBAS"},null,null,null,"DATA: ",{"$f":"$H$2","v":" AGOSTO / 2023   "}]
[null,"SERVIÇO:  ",{"$f":"VLOOKUP(A258,ORÇAMENTO!$A$10:$I$30,3)","v":"GUIA (MEIO-FIO) E SARJETA CONJUGADOS DE CONCRETO, MOLDADA  IN LOCO  45 CM BASE (15 CM BASE DA GUIA + 30 CM BASE DA SARJETA) X 22 CM ALTURA"},null,"SINAPI",{"$f":"VLOOKUP(A258,ORÇAMENTO!$A$10:$I$30,4)","v":94267},"UNIDADE: ",{"$f":"VLOOKUP(A258,ORÇAMENTO!$A$10:$I$30,5)","v":"M"}]
[]
[null,"TIPO ITEM","CODIGO ITEM","DESCRIÇÃO ITEM","UNIDADE ITEM","COEFICIENTE","PRECO UNITARIO","CUSTO TOTAL"]
[null,"INSUMO","370","AREIA MEDIA - POSTO JAZIDA/FORNECEDOR (RETIRADO NA JAZIDA, SEM TRANSPORTE)","M3","0,0150000","97,50",{"$f":"ROUNDDOWN(F263*G263,2)","v":1.46}]
[null,"INSUMO","34492","CONCRETO USINADO BOMBEAVEL, CLASSE DE RESISTENCIA C20, COM BRITA 0 E 1, SLUMP = 100 +/- 20 MM, EXCLUI SERVICO DE BOMBEAMENTO (NBR 8953)","M3","0,0630000","550,00",34.65]
[null,"COMPOSICAO","88243","AJUDANTE ESPECIALIZADO COM ENCARGOS COMPLEMENTARES","H","0,1090000","21,76",2.37]
[null,"COMPOSICAO","88309","PEDREIRO COM ENCARGOS COMPLEMENTARES","H","0,2440000","27,45",6.69]
[null,"COMPOSICAO","88316","SERVENTE COM ENCARGOS COMPLEMENTARES","H","0,4870000","19,76",9.6199999999999992]
[null,"COMPOSICAO","88631","ARGAMASSA TRAÇO 1:4 (EM VOLUME DE CIMENTO E AREIA MÉDIA ÚMIDA), PREPARO MANUAL. AF_08/2019","M3","0,0030000","575,87",1.72]
[null,"COMPOSICAO","92960","MÁQUINA EXTRUSORA DE CONCRETO PARA GUIAS E SARJETAS, MOTOR A DIESEL, POTÊNCIA 14 CV - CHP DIURNO. AF_12/2015","CHP","0,0180000","18,74",0.33]
[null,"COMPOSICAO","92961","MÁQUINA EXTRUSORA DE CONCRETO PARA GUIAS E SARJETAS, MOTOR A DIESEL, POTÊNCIA 14 CV - CHI DIURNO. AF_12/2015","CHI","0,0910000","5,89",0.53]
[{"$nulls":7},0]
[{"$nulls":7},0]
[null,"PRODUÇÃO DA EQUIPE",null,null,1,"CUSTO ",null,{"$f":"SUM(H263:H272)","v":57.36999999999999}]
[null,"TOTAL",{"$nulls":5},{"$f":"H273/E273","v":57.36999999999999},"OK"]
[null,"BDI                %",{"$nulls":5},{"$f":"1+$M$1","v":1.2332000000000001}]
[null,"TOTAL DO SERVIÇO - R$",{"$nulls":5},{"$f":"ROUND(H274*H275,2)","v":70.75}]
[]
[18,"CODEVASF",null,null," COMPOSIÇÃO DE PREÇO UNITÁRIO",null,null,null,{"$f":"H291","v":25.499999999999996},{"$f":"H293","v":31.45}]
[null,"OBRA:  ",{"$f":"$C$2","v":" PAVIMENTAÇÃO ASFÁLTICA EM CBUQ – ESTRADA BONFIM - BELO VALE  (BONFIM / MG) - LOTE 1: VARGEM ALEGRE ATÉ MACAÚBAS"},null,null,null,"DATA: ",{"$f":"$H$2","v":" AGOSTO / 2023   "}]
[null,"SERVIÇO:  ",{"$f":"VLOOKUP(A278,ORÇAMENTO!$A$10:$I$39,3)","v":"PINTURA DE FAIXA DE PEDESTRE OU ZEBRADA TINTA RETRORREFLETIVA A BASE DE RESINA ACRÍLICA COM MICROESFERAS DE VIDRO, E = 30 CM, APLICAÇÃO MANUAL"},null,"SINAPI",{"$f":"VLOOKUP(A278,ORÇAMENTO!$A$10:$I$39,4)","v":102509},"UNIDADE: ",{"$f":"VLOOKUP(A278,ORÇAMENTO!$A$10:$I$39,5)","v":"M2"}]
[]
[null,"TIPO ITEM","CODIGO ITEM","DESCRIÇÃO ITEM","UNIDADE ITEM","COEFICIENTE","PRECO UNITARIO","CUSTO TOTAL"]
[null,"INSUMO","5318","DILUENTE AGUARRAS","L","0,0210000","26,76",{"$f":"ROUNDDOWN(F283*G283,2)","v":0.56000000000000005}]
[null,"INSUMO","7343","TINTA ACRILICA A BASE DE SOLVENTE, PARA SINALIZACAO HORIZONTAL VIARIA (NBR 11862)","L","0,4270000","17,71",7.56]
[null,"INSUMO","12815","FITA CREPE ROLO DE 25 MM X 50 M","UN","0,0120000","9,31",0.11]
[null,"INSUMO","44477","MICROESFERAS DE VIDRO PARA SINALIZACAO HORIZONTAL VIARIA, TIPO II-A (DROP-ON) - NBR  16184","KG","0,2500000","10,74",2.68]
[null,"INSUMO","44478","MICROESFERAS DE VIDRO PARA SINALIZACAO HORIZONTAL VIARIA, TIPO I-B (PREMIX) - NBR  16184","KG","0,1100000","10,74",1.18]
[null,"COMPOSICAO","88310","PINTOR COM ENCARGOS COMPLEMENTARES","H","0,3640000","28,66",10.43]
[null,"COMPOSICAO","88316","SERVENTE COM ENCARGOS COMPLEMENTARES","H","0,1510000","19,76",2.98]
[null,"PRODUÇÃO DA EQUIPE",null,null,1,"CUSTO ",null,{"$f":"SUM(H283:H289)","v":25.499999999999996}]
[null,"TOTAL",{"$nulls":5},{"$f":"H290/E290","v":25.499999999999996},"OK"]
[null,"BDI                %",{"$nulls":5},{"$f":"1+$M$1","v":1.2332000000000001}]
[null,"TOTAL DO SERVIÇO - R$",{"$nulls":5},{"$f":"ROUND(H291*H292,2)","v":31.45}]
[]
[19,"CODEVASF",null,null," COMPOSIÇÃO DE PREÇO UNITÁRIO",null,null,null,{"$f":"H309","v":422.66},{"$f":"H311","v":521.22}]
[null,"OBRA:  ",{"$f":"$C$2","v":" PAVIMENTAÇÃO ASFÁLTICA EM CBUQ – ESTRADA BONFIM - BELO VALE  (BONFIM / MG) - LOTE 1: VARGEM ALEGRE ATÉ MACAÚBAS"},null,null,null,"DATA: ",{"$f":"$H$2","v":" AGOSTO / 2023   "}]
[null,"SERVIÇO:  ",{"$f":"VLOOKUP(A295,ORÇAMENTO!$A$10:$I$37,3)","v":"FORNECIMENTO E INSTALAÇÃO DE PLACA DE SINALIZAÇÃO VIÁRIA - REGULAMENTAÇÃO (FAIXA DE PEDESTRE E OUTROS)"},null,"SINAPI",{"$f":"VLOOKUP(A295,ORÇAMENTO!$A$10:$I$41,4)","v":"CPU.4"},"UNIDADE: ",{"$f":"VLOOKUP(A295,ORÇAMENTO!$A$10:$I$41,5)","v":"UN."}]
[]
[null,"TIPO ITEM","CODIGO ITEM","DESCRIÇÃO ITEM","UNIDADE ITEM","COEFICIENTE","PRECO UNITARIO","CUSTO TOTAL"]
[null,"COMPOSICAO",94962,"CONCRETO MAGRO PARA LASTRO, TRAÇO 1:4,5:4,5 (EM MASSA SECA DE CIMENTO/ AREIA MÉDIA/ BRITA 1)","M3",2.4E-2,397.46,{"$f":"ROUNDDOWN(F300*G300,2)","v":9.5299999999999994}]
[null,"COMPOSICAO",93358,"ESCAVAÇÃO MANUAL DE VALA COM PROFUNDIDADE MENOR OU IGUAL A 1,30 M","M3",2.4E-2,78.17,1.87]
[null,"COMPOSICAO",88309,"PEDREIRO COM ENCARGOS COMPLEMENTARES","H",0.2,27.45,5.49]
[null,"COMPOSICAO",88316,"SERVENTE COM ENCARGOS COMPLEMENTARES","H",1,19.760000000000002,19.760000000000002]
[null,"COMPOSICAO",103670,"LANÇAMENTO COM USO DE BALDES, ADENSAMENTO E ACABAMENTO DE CONCRETO EM ESTRUTURAS","M3",2.4E-2,281.66000000000003,6.75]
[null,"INSUMO",34723,"PLACA DE SINALIZACAO EM CHAPA DE ACO NUM 16 COM PINTURA REFLETIVA (CIRCULAR - D=50CM) ","M2",{"$f":"3.14*0.5*0.5/4","v":0.19625000000000001},577.5,113.33]
[null,"INSUMO",21013,"TUBO AÇO GALVANIZADO COM COSTURA, CLASSE LEVE, DN 50 MM ( 2\")E = 3,00 MM, *4,40* KG/M ","M",3.5,75.98,265.93]
[{"$nulls":7},0]
[null,"PRODUÇÃO DA EQUIPE",null,null,1,"CUSTO ",null,{"$f":"SUM(H300:H306)","v":422.66}]
[null,"TOTAL",{"$nulls":5},{"$f":"H308/E308","v":422.66},"OK"]
[null,"BDI                %",{"$nulls":5},{"$f":"1+$M$1","v":1.2332000000000001}]
[null,"TOTAL DO SERVIÇO - R$",{"$nulls":5},{"$f":"ROUND(H309*H310,2)","v":521.22}]
[]
[20,"CODEVASF",null,null," COMPOSIÇÃO DE PREÇO UNITÁRIO",null,null,null,{"$f":"H327","v":482.58000000000004},{"$f":"H329","v":595.12}]
[null,"OBRA:  ",{"$f":"$C$2","v":" PAVIMENTAÇÃO ASFÁLTICA EM CBUQ – ESTRADA BONFIM - BELO VALE  (BONFIM / MG) - LOTE 1: VARGEM ALEGRE ATÉ MACAÚBAS"},null,null,null,"DATA: ",{"$f":"$H$2","v":" AGOSTO / 2023   "}]
[null,"SERVIÇO:  ",{"$f":"VLOOKUP(A313,ORÇAMENTO!$A$10:$I$37,3)","v":"FORNECIMENTO E INSTALAÇÃO DE PLACA DE SINALIZAÇÃO VIÁRIA - REGULAMENTAÇÃO "},null,"SINAPI",{"$f":"VLOOKUP(A313,ORÇAMENTO!$A$10:$I$41,4)","v":"CPU.5"},"UNIDADE: ","UN."]
[]
[null,"TIPO ITEM","CODIGO ITEM","DESCRIÇÃO ITEM","UNIDADE ITEM","COEFICIENTE","PRECO UNITARIO","CUSTO TOTAL"]
[null,"COMPOSICAO",94962,"CONCRETO MAGRO PARA LASTRO, TRAÇO 1:4,5:4,5 (EM MASSA SECA DE CIMENTO/ AREIA MÉDIA/ BRITA 1)","M3",2.4E-2,{"$f":"G300","v":397.46},{"$f":"ROUNDDOWN(F318*G318,2)","v":9.5299999999999994}]
[null,"COMPOSICAO",93358,"ESCAVAÇÃO MANUAL DE VALA COM PROFUNDIDADE MENOR OU IGUAL A 1,30 M","M3",2.4E-2,78.17,1.87]
[null,"COMPOSICAO",88309,"PEDREIRO COM ENCARGOS COMPLEMENTARES","H",0.2,27.45,5.49]
[null,"COMPOSICAO",88316,"SERVENTE COM ENCARGOS COMPLEMENTARES","H",1,19.760000000000002,19.760000000000002]
[null,"COMPOSICAO",103670,"LANÇAMENTO COM USO DE BALDES, ADENSAMENTO E ACABAMENTO DE CONCRETO EM ESTRUTURAS","M3",2.4E-2,281.66000000000003,6.75]
[null,"INSUMO",34723,"PLACA DE SINALIZACAO EM CHAPA DE ACO NUM 16 COM PINTURA REFLETIVA ","M2",{"$f":"4*0.3*0.25","v":0.3},577.5,173.25]
[null,"INSUMO",21013,"TUBO AÇO GALVANIZADO COM COSTURA, CLASSE LEVE, DN 50 MM ( 2\")E = 3,00 MM, *4,40* KG/M","M",3.5,75.98,265.93]
[{"$nulls":7},0]
[null,"PRODUÇÃO DA EQUIPE",null,null,1,"CUSTO ",null,{"$f":"SUM(H318:H325)","v":482.58000000000004}]
[null,"TOTAL",{"$nulls":5},{"$f":"H326/E326","v":482.58000000000004},"OK"]
[null,"BDI                %",{"$nulls":5},{"$f":"1+$M$1","v":1.2332000000000001}]
[null,"TOTAL DO SERVIÇO - R$",{"$nulls":5},{"$f":"ROUND(H327*H328,2)","v":595.12}]
[]
[22,"CODEVASF",null,null," COMPOSIÇÃO DE PREÇO UNITÁRIO",null,null,null,{"$f":"H345","v":5.5500000000000007},{"$f":"H347","v":6.84}]
[null,"OBRA:  ",{"$f":"$C$2","v":" PAVIMENTAÇÃO ASFÁLTICA EM CBUQ – ESTRADA BONFIM - BELO VALE  (BONFIM / MG) - LOTE 1: VARGEM ALEGRE ATÉ MACAÚBAS"},null,null,null,"DATA: ",{"$f":"$H$2","v":" AGOSTO / 2023   "}]
[null,"SERVIÇO:  ",{"$f":"VLOOKUP(A331,ORÇAMENTO!$A$10:$I$37,3)","v":"PINTURA DE EIXO VIÁRIO SOBRE ASFALTO COM TINTA RETRORREFLETIVA A BASE DE RESINA ACRÍLICA COM MICROESFERAS DE VIDRO, APLICAÇÃO MECÂNICA COM DEMARCADORA AUTOPROPELIDA - ESPESSURA DE 0,10 MM"},null,"SINAPI",{"$f":"VLOOKUP(A331,ORÇAMENTO!$A$10:$I$41,4)","v":102512},"UNIDADE: ",{"$f":"VLOOKUP(A331,ORÇAMENTO!$A$10:$I$41,5)","v":"M"}]
[]
[null,"TIPO ITEM","CODIGO ITEM","DESCRIÇÃO ITEM","UNIDADE ITEM","COEFICIENTE","PRECO UNITARIO","CUSTO TOTAL"]
[null,"INSUMO","5318","DILUENTE AGUARRAS","L","0,0020000","26,76",{"$f":"ROUNDDOWN(F336*G336,2)","v":0.05}]
[null,"INSUMO","7343","TINTA ACRILICA A BASE DE SOLVENTE, PARA SINALIZACAO HORIZONTAL VIARIA (NBR 11862)","L","0,0430000","17,71",0.76]
[null,"INSUMO","44477","MICROESFERAS DE VIDRO PARA SINALIZACAO HORIZONTAL VIARIA, TIPO II-A (DROP-ON) - NBR  16184","KG","0,0250000","10,74",0.26]
[null,"INSUMO","44478","MICROESFERAS DE VIDRO PARA SINALIZACAO HORIZONTAL VIARIA, TIPO I-B (PREMIX) - NBR  16184","KG","0,0110000","10,74",0.11]
[null,"COMPOSICAO","88310","PINTOR COM ENCARGOS COMPLEMENTARES","H","0,0340000","28,66",0.97]
[null,"COMPOSICAO","88316","SERVENTE COM ENCARGOS COMPLEMENTARES","H","0,0140000","19,76",0.27]
[null,"COMPOSICAO","95133","MÁQUINA DEMARCADORA DE FAIXA DE TRÁFEGO À FRIO, AUTOPROPELIDA, POTÊNCIA 38 HP - CHP DIURNO. AF_07/2016","CHP","0,0003000","173,43",0.05]
[null,"COMPOSICAO","96159","MÁQUINA DEMARCADORA DE FAIXA DE TRÁFEGO À FRIO, AUTOPROPELIDA, POTÊNCIA 38 HP - CHI DIURNO. AF_07/2016","CHI","0,0334000","92,42",3.08]
[null,"PRODUÇÃO DA EQUIPE",null,null,1,"CUSTO ",null,{"$f":"SUM(H336:H343)","v":5.5500000000000007}]
[null,"TOTAL",{"$nulls":5},{"$f":"H344/E344","v":5.5500000000000007},"OK"]
[null,"BDI                %",{"$nulls":5},{"$f":"1+$M$1","v":1.2332000000000001}]
[null,"TOTAL DO SERVIÇO - R$",{"$nulls":5},{"$f":"ROUND(H345*H346,2)","v":6.84}]
[]
[23,"CODEVASF",null,null," COMPOSIÇÃO DE PREÇO UNITÁRIO",null,null,null,{"$f":"H356","v":2812.65},{"$f":"H358","v":3234.55}]
[null,"OBRA:  ",{"$f":"$C$2","v":" PAVIMENTAÇÃO ASFÁLTICA EM CBUQ – ESTRADA BONFIM - BELO VALE  (BONFIM / MG) - LOTE 1: VARGEM ALEGRE ATÉ MACAÚBAS"},null,null,null,"DATA: ",{"$f":"$H$2","v":" AGOSTO / 2023   "}]
[null,"SERVIÇO:  ",{"$f":"VLOOKUP(A349,ORÇAMENTO!$A$10:$I$46,3)","v":"AQUISIÇÃO DE EMULSÃO ASFÁLTICA PARA IMPRIMAÇÃO (EAI) - EXCLUSIVE TRANSPORTE"},null,"SEINFRA",{"$f":"VLOOKUP(A349,ORÇAMENTO!$A$10:$I$46,4)","v":"CPU.7"},"UNIDADE: ",{"$f":"VLOOKUP(A349,ORÇAMENTO!$A$10:$I$46,5)","v":"T"}]
[]
[null,"TIPO ITEM","CODIGO ITEM","DESCRIÇÃO ITEM","UNIDADE ITEM","COEFICIENTE","PRECO UNITARIO","CUSTO TOTAL"]
[null,"INSUMO","ANP","EMULSÃO ASFÁLTICA PARA SERVIÇO DE IMPRIMAÇÃO (CUSTO ANP, INCLUINDO ICMS 18%)","T",1,{"$f":"2.30638*1000*1.2195122","v":2812.6585478359998},{"$f":"ROUNDDOWN(F354*G354,2)","v":2812.65}]
[null,"PRODUÇÃO DA EQUIPE",null,null,1,"CUSTO ",null,{"$f":"SUM(H354:H354)","v":2812.65}]
[null,"TOTAL",{"$nulls":5},{"$f":"H355/E355","v":2812.65}]
[null,"BDI                %",{"$nulls":5},{"$f":"1+$M$2","v":1.1499999999999999}]
[null,"TOTAL DO SERVIÇO - R$",{"$nulls":5},{"$f":"ROUND(H356*H357,2)","v":3234.55},"OK"]
[]
[24,"CODEVASF",null,null," COMPOSIÇÃO DE PREÇO UNITÁRIO",null,null,null,{"$f":"H367","v":2736.39},{"$f":"H369","v":3146.85}]
[null,"OBRA:  ",{"$f":"$C$2","v":" PAVIMENTAÇÃO ASFÁLTICA EM CBUQ – ESTRADA BONFIM - BELO VALE  (BONFIM / MG) - LOTE 1: VARGEM ALEGRE ATÉ MACAÚBAS"},null,null,null,"DATA: ",{"$f":"$H$2","v":" AGOSTO / 2023   "}]
[null,"SERVIÇO:  ",{"$f":"VLOOKUP(A360,ORÇAMENTO!$A$10:$I$46,3)","v":"AQUISIÇÃO DE EMULSAO ASFALTICA CATIONICA RR-1C - EXCLUSIVE TRANSPORTE"},null,"SINAPI",{"$f":"VLOOKUP(A360,ORÇAMENTO!$A$10:$I$46,4)","v":"CPU.8"},"UNIDADE: ",{"$f":"VLOOKUP(A360,ORÇAMENTO!$A$10:$I$46,5)","v":"T"}]
[]
[null,"TIPO ITEM","CODIGO ITEM","DESCRIÇÃO ITEM","UNIDADE ITEM","COEFICIENTE","PRECO UNITARIO","CUSTO TOTAL"]
[null,"INSUMO","ANP","EMULSÃO ASFÁLTICA CATIÔNICA RR-1C(CUSTO ANP, INCLUINDO ICMS 18%)","T",1,{"$f":"2.24384*1.2195122*1000","v":2736.390254848},{"$f":"ROUNDDOWN(F365*G365,2)","v":2736.39}]
[null,"PRODUÇÃO DA EQUIPE",null,null,1,"CUSTO ",null,{"$f":"SUM(H365:H365)","v":2736.39}]
[null,"TOTAL",{"$nulls":5},{"$f":"H366/E366","v":2736.39},"OK"]
[null,"BDI                %",{"$nulls":5},{"$f":"1+$M$2","v":1.1499999999999999}]
[null,"TOTAL DO SERVIÇO - R$",{"$nulls":5},{"$f":"ROUND(H367*H368,2)","v":3146.85}]
[]
[25,"CODEVASF",null,null," COMPOSIÇÃO DE PREÇO UNITÁRIO",null,null,null,{"$f":"H378","v":535},{"$f":"H380","v":615.25}]
[null,"OBRA:  ",{"$f":"$C$2","v":" PAVIMENTAÇÃO ASFÁLTICA EM CBUQ – ESTRADA BONFIM - BELO VALE  (BONFIM / MG) - LOTE 1: VARGEM ALEGRE ATÉ MACAÚBAS"},null,null,null,"DATA: ",{"$f":"$H$2","v":" AGOSTO / 2023   "}]
[null,"SERVIÇO:  ",{"$f":"VLOOKUP(A371,ORÇAMENTO!$A$10:$I$46,3)","v":"AQUISIÇÃO DE CONCRETO BETUMINOSO USINADO A QUENTE (CBUQ) PARA PAVIMENTACAO ASFALTICA, PADRAO DNIT, FAIXA C, COM CAP 50/70 - EXCLUSIVE TRANSPORTE"},null,"SINAPI",{"$f":"VLOOKUP(A371,ORÇAMENTO!$A$10:$I$46,4)","v":"CPU.9"},"UNIDADE: ",{"$f":"VLOOKUP(A371,ORÇAMENTO!$A$10:$I$46,5)","v":"T"}]
[]
[null,"TIPO ITEM","CODIGO ITEM","DESCRIÇÃO ITEM","UNIDADE ITEM","COEFICIENTE","PRECO UNITARIO","CUSTO TOTAL"]
[null,"INSUMO",1518,"CONCRETO BETUMINOSO USINADO A QUENTE (CBUQ) PARA PAVIMENTACAO ASFALTICA, PADRAO DNIT, FAIXA C, COM CAP 50/70 - AQUISICAO POSTO USINA","T",1,535,{"$f":"ROUNDDOWN(F376*G376,2)","v":535}]
[null,"PRODUÇÃO DA EQUIPE",null,null,1,"CUSTO ",null,{"$f":"SUM(H376:H376)","v":535}]
[null,"TOTAL",{"$nulls":5},{"$f":"H377/E377","v":535},"OK"]
[null,"BDI                %",{"$nulls":5},{"$f":"1+$M$2","v":1.1499999999999999}]
[null,"TOTAL DO SERVIÇO - R$",{"$nulls":5},{"$f":"ROUND(H378*H379,2)","v":615.25}]

{"sheet":"BDI SERV","index":2,"n_rows":37,"n_cols":20,"rows_kept":37,"cut":false,"hidden":false,"merged":[[31,1,31,2],[32,0,34,5],[36,0,36,5],[0,1,2,4],[3,1,4,1],[3,2,4,2],[28,0,28,5],[30,1,30,2]]}
[null,"DETALHAMENTO DO BDI - SERVIÇOS"]
[]
[]
[null,"Item","Descrição dos Serviços","%","%"]
[null,null,null,"PV","CD"]
[]
[null,1,"ADMINISTRAÇÃO CENTRAL"," ",4.01]
[null,"1.1","ESCRITÓRIO CENTRAL"," "," "]
[null,"1.2","VIAGENS"," "," "]
[null,"1.3","OUTROS"," "," "]
[null," "," "," "," "]
[null,2,"IMPOSTOS E TAXAS",{"$f":"SUM(D13:D16)","v":7.65},{"$f":"SUM(E13:E16)","v":9.57}]
[null,"2.1","ISS (*)",{"$f":"5*0.8","v":4},{"$f":"ROUND(D13*1.2515,2)","v":5.01}]
[null,"2.2","PIS",0.65,{"$f":"ROUND(D14*1.2515,2)","v":0.81}]
[null,"2.3","Cofins",3,{"$f":"ROUND(D15*1.2515,2)","v":3.75}]
[null,"2.4","CONTRIBUIÇÃO PREVIDENCIÁRIA SOBRE A RENDA BRUTA",0,{"$f":"ROUND(D16*1.2515,2)","v":0}]
[]
[null,3,"TAXA DE RISCO"," ",{"$f":"SUM(E19:E22)","v":0.96}]
[null,"3.1","SEGURO",null,0.2]
[null,"3.2","RISCO",null,0.56000000000000005]
[null,"3.3","GARANTIA",null,0.2]
[{"$nulls":19},{"$f":"1/0.82","v":1.2195121951219512}]
[null,4,"DESPESAS FINANCEIRAS"," ",1.1100000000000001]
[]
[null,5,"LUCRO",null,7.3]
[]
[null," ","BDI - CALCULADO"," ",{"$f":"ROUND((((1+(E7+E18)/100)*(1+E23/100)*(1+E25/100)/(1-D12/100)-1)*100),2)","v":23.32}]
[]
["BDI = ((1+((AC+S+R+G)/100))x(1+DF/100)x(1+L/100)/(1-I/100)-1)*100"]
[]
[null,"BDI (CALCULADO):",null,{"$f":"ROUND((((1+((E7+E18)/100))*(1+E23/100)*(1+E25/100))/(1-D12/100)-1)*100,2)","v":23.32},"%"]
[null," "]
["(*) ISS CONFORME LEI COMPLEMENTAR Nº 016/2005 - CONSIDERANDO A DEDUÇÃO DOS MATERIAIS PREVISTOS NO ART. 115 (QUANT. ESTIMADA: 20%)"]
[]
[]
[]
["BDI EM CONFORMIDADE COM OS ACÓRDÃOS Nº 2369/2011 e ACÓRDÃO Nº 2.622/2013 - TCU - PLENÁRIO"]

{"sheet":"BDI FORN","index":3,"n_rows":37,"n_cols":5,"rows_kept":37,"cut":false,"hidden":false,"merged":[[31,1,31,2],[32,0,34,5],[36,0,36,5],[0,1,2,4],[3,1,4,1],[3,2,4,2],[28,0,28,5],[30,1,30,2]]}
[null,"DETALHAMENTO DO BDI - FORNECIMENTO \n(MATERIAL ASFÁLTICO)"]
[]
[]
[null,"Item","Descrição dos Serviços","%","%"]
[null,null,null,"PV","CD"]
[]
[null,1,"ADMINISTRAÇÃO CENTRAL"," ",3.72]
[null,"1.1","ESCRITÓRIO CENTRAL"," "," "]
[null,"1.2","VIAGENS"," "," "]
[null,"1.3","OUTROS"," "," "]
[null," "," "," "," "]
[null,2,"IMPOSTOS E TAXAS",{"$f":"SUM(D13:D16)","v":3.65},{"$f":"SUM(E13:E16)","v":4.5600000000000005}]
[null,"2.1","ISS (*)",null,{"$f":"ROUND(D13*1.2515,2)","v":0}]
[null,"2.2","PIS",0.65,{"$f":"ROUND(D14*1.2515,2)","v":0.81}]
[null,"2.3","Cofins",3,{"$f":"ROUND(D15*1.2515,2)","v":3.75}]
[null,"2.4","CONTRIBUIÇÃO PREVIDENCIÁRIA SOBRE A RENDA BRUTA",0,{"$f":"ROUND(D16*1.2515,2)","v":0}]
[]
[null,3,"TAXA DE RISCO"," ",{"$f":"SUM(E19:E22)","v":0.82000000000000006}]
[null,"3.1","SEGURO",null,0.16]
[null,"3.2","RISCO",null,0.5]
[null,"3.3","GARANTIA",null,0.16]
[]
[null,4,"DESPESAS FINANCEIRAS"," ",0.94]
[]
[null,5,"LUCRO",null,5]
[]
[null," ","BDI - CALCULADO"," ",{"$f":"ROUND((((1+(E7+E18)/100)*(1+E23/100)*(1+E25/100)/(1-D12/100)-1)*100),2)","v":15}]
[]
["BDI = ((1+((AC+S+R+G)/100))x(1+DF/100)x(1+L/100)/(1-I/100)-1)*100"]
[]
[null,"BDI (CALCULADO):",null,{"$f":"ROUND((((1+((E7+E18)/100))*(1+E23/100)*(1+E25/100))/(1-D12/100)-1)*100,2)","v":15},"%"]
[null," "]
[]
[]
[]
[]
["BDI EM CONFORMIDADE COM OS ACÓRDÃOS Nº 2369/2011 e ACÓRDÃO Nº 2.622/2013 - TCU - PLENÁRIO"]

{"sheet":"CRONOGRAMA","index":4,"n_rows":21,"n_cols":10,"rows_kept":21,"cut":false,"hidden":false,"merged":[[0,1,0,9],[1,1,2,1],[1,2,2,4],[1,6,1,9],[2,6,2,9],[3,1,3,8],[5,0,6,0],[5,1,6,1],[5,2,6,2],[7,0,8,0],[7,1,8,1],[7,2,8,2],[9,0,10,0],[9,1,10,1],[9,2,10,2],[11,0,12,0],[11,1,12,1],[11,2,12,2],[17,1,18,2],[20,1,24,9],[13,0,14,0],[13,1,14,1],[13,2,14,2],[15,0,16,0],[15,1,16,1],[15,2,16,2]]}
[null,"CRONOGRAMA FÍSICO-FINANCEIRO"]
[null,"OBRA: ",{"$f":"ORÇAMENTO!C5","v":" PAVIMENTAÇÃO ASFÁLTICA EM CBUQ – ESTRADA BONFIM - BELO VALE  (BONFIM / MG) - LOTE 1: VARGEM ALEGRE ATÉ MACAÚBAS"},null,null,"VALOR:",{"$f":"ORÇAMENTO!I39","v":939323.52}]
[{"$nulls":5},"PRAZO: ","120 DIAS"]
[]
[null,"ITEM","ETAPAS/DESCRIÇAO","FISICO/  FINANCEIRO","TOTAL    ETAPAS","MÊS 1","MÊS 2","MÊS 3","MÊS 4","TOTAL"]
["A",{"$f":"VLOOKUP(A6,ORÇAMENTO!$A$9:$I$39,2)","v":1},{"$f":"VLOOKUP(A6,ORÇAMENTO!$A$9:$I$39,3)","v":"SERVIÇOS PRELIMINARES "},"FISICO ",{"$f":"ROUND(E7/$G$2,4)","v":0.1137},0.25,0.25,0.25,0.25,{"$f":"SUM(F6:I6)","v":1}]
[null,null,null,"FINANCEIRO",{"$f":"ORÇAMENTO!I9","v":106782.95000000001},{"$f":"ROUND($E$7*F6,2)","v":26695.74},{"$f":"ROUND($E$7*G6,2)","v":26695.74},{"$f":"ROUND($E$7*H6,2)","v":26695.74},{"$f":"ROUND($E$7*I6,2)","v":26695.74},{"$f":"SUM(F7:I7)","v":106782.96}]
["B",{"$f":"VLOOKUP(A8,ORÇAMENTO!$A$9:$I$39,2)","v":2},{"$f":"VLOOKUP(A8,ORÇAMENTO!$A$9:$I$39,3)","v":"TERRAPLANAGEM E PAVIMENTAÇÃO"},"FISICO ",{"$f":"ROUND(E9/$G$2,4)","v":0.1308},0.2,0.3,0.3,0.2,{"$f":"SUM(F8:I8)","v":1}]
[null,null,null,"FINANCEIRO",{"$f":"ORÇAMENTO!I15","v":122889.2},{"$f":"ROUND($E$9*F8,2)","v":24577.84},{"$f":"ROUND($E$9*G8,2)","v":36866.76},{"$f":"ROUND($E$9*H8,2)","v":36866.76},{"$f":"ROUND($E$9*I8,2)","v":24577.84},{"$f":"SUM(F9:I9)","v":122889.20000000001}]
["C",{"$f":"VLOOKUP(A10,ORÇAMENTO!$A$9:$I$39,2)","v":3},{"$f":"VLOOKUP(A10,ORÇAMENTO!$A$9:$I$39,3)","v":"TRANSPORTE DE MATERIAIS"},"FISICO ",{"$f":"ROUND(E11/$G$2,4)","v":9.2299999999999993E-2},0.2,0.3,0.3,0.2,{"$f":"SUM(F10:I10)","v":1}]
[null,null,null,"FINANCEIRO",{"$f":"ORÇAMENTO!I23","v":86709.99},{"$f":"ROUND($E$11*F10,2)","v":17342},{"$f":"ROUND($E$11*G10,2)","v":26013},{"$f":"ROUND($E$11*H10,2)","v":26013},{"$f":"ROUND($E$11*I10,2)","v":17342},{"$f":"SUM(F11:I11)-0.04","v":86709.96}]
["D",{"$f":"VLOOKUP(A12,ORÇAMENTO!$A$9:$I$39,2)","v":4},{"$f":"VLOOKUP(A12,ORÇAMENTO!$A$9:$I$39,3)","v":"TRANSPORTE DE MATERIAL ASFÁLTICO (BDI DIFERENCIADO)"},"FISICO ",{"$f":"ROUND(E13/$G$2,4)","v":3.8800000000000001E-2},0.2,0.3,0.3,0.2,{"$f":"SUM(F12:I12)","v":1}]
[null,null,null,"FINANCEIRO",{"$f":"ORÇAMENTO!I26","v":36486},{"$f":"ROUND($E$13*F12,2)","v":7297.2},{"$f":"ROUND($E$13*G12,2)","v":10945.8},{"$f":"ROUND($E$13*H12,2)","v":10945.8},{"$f":"ROUND($E$13*I12,2)","v":7297.2},{"$f":"SUM(F13:I13)-0.02","v":36485.980000000003}]
["E",{"$f":"VLOOKUP(A14,ORÇAMENTO!$A$9:$I$39,2)","v":5},{"$f":"VLOOKUP(A14,ORÇAMENTO!$A$9:$I$39,3)","v":"OBRAS COMPLEMENTARES"},"FISICO ",{"$f":"ROUND(E15/$G$2,4)","v":0.2031},0,0.2,0.4,0.4,{"$f":"SUM(F14:I14)","v":1}]
[null,null,null,"FINANCEIRO",{"$f":"ORÇAMENTO!I29","v":190804.32},{"$f":"ROUND($E$15*F14,2)","v":0},{"$f":"ROUND($E$15*G14,2)","v":38160.86},{"$f":"ROUND($E$15*H14,2)","v":76321.73},{"$f":"ROUND($E$15*I14,2)","v":76321.73},{"$f":"SUM(F15:I15)-0.02","v":190804.30000000002}]
["F",{"$f":"VLOOKUP(A16,ORÇAMENTO!$A$9:$I$39,2)","v":6},{"$f":"VLOOKUP(A16,ORÇAMENTO!$A$9:$I$39,3)","v":"FORNECIMENTOS - MATERIAL ASFÁLTICO (BDI DIFERENCIADO)"},"FISICO ",{"$f":"ROUND(E17/$G$2,4)","v":0.42120000000000002},0.2,0.3,0.3,0.2,{"$f":"SUM(F16:I16)","v":1}]
[null,null,null,"FINANCEIRO",{"$f":"ORÇAMENTO!I35","v":395651.06},{"$f":"ROUND($E$17*F16,2)","v":79130.210000000006},{"$f":"ROUND($E$17*G16,2)","v":118695.32},{"$f":"ROUND($E$17*H16,2)","v":118695.32},{"$f":"ROUND($E$17*I16,2)","v":79130.210000000006},{"$f":"SUM(F17:I17)-0.02","v":395651.04000000004}]
[null,"TOTAL",null,"FISICO ",{"$f":"SUM(F18:I18)","v":1.0000000212919187},{"$f":"F19/$E$19","v":0.16505813673227301},{"$f":"G19/$E$19","v":0.27400301868306243},{"$f":"H19/$E$19","v":0.31462892571879814},{"$f":"I19/$E$19","v":0.24630994015778501},{"$f":"SUM(F18:I18)","v":1.0000000212919187}]
[null,null,null,"FINANCEIRO",{"$f":"E11+E9+E7+E13+E17+E15","v":939323.52},{"$f":"F11+F9+F7+F13+F17+F15","v":155042.99},{"$f":"G11+G9+G7+G13+G17+G15","v":257377.47999999998},{"$f":"H11+H9+H7+H13+H17+H15","v":295538.34999999998},{"$f":"I11+I9+I7+I13+I17+I15","v":231364.71999999997},{"$f":"SUM(F19:I19)","v":939323.53999999992}]
[]
[null,"OBSERVAÇÕES:"]