{"text_format":"2","workbook":"xlsx","n_sheets":5,"sheets":["ORÇAMENTO","CPU","BDI SERV","BDI FORN","CRONOGRAMA"],"not_rendered":{"charts":0,"images":3,"macros":0,"external_links":0,"defined_names":5,"comments":1,"pivot_tables":0},"unopened":[],"bounds":{"document_bytes":16777216,"sheet_cells":100000,"run_cost":"one","rows_first":2000,"rows_last":500,"rows_between":2000,"halvings":0,"cell_chars":16384,"cell_head_chars":4096},"cells_cut":0,"cells_raw":0,"read":"whole","date_system":"1900"}

{"sheet":"ORÇAMENTO","index":0,"n_rows":40,"n_cols":9,"rows_kept":40,"cut":false,"hidden":false,"merged":[[39,1,39,2],[0,0,7,0],[0,2,0,8],[1,2,1,8],[2,2,2,8],[4,2,4,8],[5,6,5,7],[6,1,6,2],[6,6,6,7]]}
["<---- NUMERAR SERVIÇOS PARA CPU",null,"Ministério do Desenvolvimento Regional"]
[null,null,"Companhia de Desenvolvimento dos Vales do São Francisco e do Parnaíba"]
[null,null,"1ª Superintendência Regional"]
[]
[null,"OBRA: "," PAVIMENTAÇÃO ASFÁLTICA EM CBUQ – AVENIDA SANITÁRIA (BONFIM / MG) - LOTE 3"]
[null,"DATA:"," AGOSTO / 2023   ",null,null,null,"BDI Serviços:",null,{"$f":"'BDI SERV'!D31/100","v":0.23319999999999999}]
[null,"PRAZO DE EXECUÇÃO:     120 DIAS",{"$nulls":4},"BDI Serviços:",null,{"$f":"'BDI FORN'!D31/100","v":0.15}]
[null,"ITEM","DISCRIMINAÇÃO","REFER.","UNID.","QUANT.","P. UNITÁRIO","P.UNIT.C/ BDI","P. TOTAL"]
["A",1,"SERVIÇOS PRELIMINARES ",{"$nulls":5},{"$f":"SUM(I10:I14)","v":125004.35}]
[1,"1.1","MOBILIZAÇÃO E DESMOBILIZAÇÃO","CPU.1","GL",1,{"$f":"VLOOKUP(A10,CPU!$A$1:$N$4703,9)","v":9018.26},{"$f":"VLOOKUP(A10,CPU!$A$1:$N$4703,10)","v":11121.32},{"$f":"ROUND(F10*H10,2)","v":11121.32}]
[2,"1.2","ADMINISTRAÇÃO LOCAL","CPU.2","GL",1,{"$f":"VLOOKUP(A11,CPU!$A$1:$N$4703,9)","v":75821.279999999999},{"$f":"VLOOKUP(A11,CPU!$A$1:$N$4703,10)","v":93502.8},{"$f":"ROUND(F11*H11,2)","v":93502.8}]
[3,"1.3","CANTEIRO DE OBRAS","CPU.3","GL",1,{"$f":"VLOOKUP(A12,CPU!$A$1:$N$4703,9)","v":13246.36},{"$f":"VLOOKUP(A12,CPU!$A$1:$N$4703,10)","v":16335.41},{"$f":"ROUND(F12*H12,2)","v":16335.41}]
[4,"1.4","PLACA DE OBRA EM CHAPA DE AÇO GALVANIZADO",103689,"M2",3,{"$f":"VLOOKUP(A13,CPU!$A$1:$N$4703,9)","v":339.72},{"$f":"VLOOKUP(A13,CPU!$A$1:$N$4703,10)","v":418.94},{"$f":"ROUND(F13*H13,2)","v":1256.82}]
[5,"1.5","SERVIÇOS TOPOGRÁFICOS PARA PAVIMENTAÇÃO, INCLUSIVE NOTA DE SERVIÇO, ACOMPANHAMENTO E GREIDE",78472,"M2",6799.9999999999991,{"$f":"VLOOKUP(A14,CPU!$A$1:$N$4703,9)","v":0.32999999999999996},{"$f":"VLOOKUP(A14,CPU!$A$1:$N$4703,10)","v":0.41},{"$f":"ROUND(F14*H14,2)","v":2788}]
["B",2,"TERRAPLANAGEM E PAVIMENTAÇÃO",{"$nulls":5},{"$f":"SUM(I16:I23)","v":272070.69}]
[6,"2.1","ESCAVAÇÃO HORIZONTAL EM SOLO DE 1A CATEGORIA ",101116,"M3",9900.0024999999987,{"$f":"VLOOKUP(A16,CPU!$A$1:$N$4703,9)","v":2.0300000000000002},{"$f":"VLOOKUP(A16,CPU!$A$1:$N$4703,10)","v":2.5},{"$f":"ROUND(F16*H16,2)","v":24750.01}]
[7,"2.2","CARGA, MANOBRA E DESCARGA DE SOLOS E MATERIAIS GRANULARES EM CAMINHÃO BASCULANTE",100976,"M3",9900.0024999999987,{"$f":"VLOOKUP(A17,CPU!$A$1:$N$4703,9)","v":7.99},{"$f":"VLOOKUP(A17,CPU!$A$1:$N$4703,10)","v":9.85},97515.02]
[7.5,"2.3","EXECUÇÃO E COMPACTAÇÃO DE ATERRO COM SOLO PREDOMINANTEMENTE ARGILOSO - EXCLUSIVE SOLO, ESCAVAÇÃO, CARGA E TRANSPORTE",96385,"M3",6999.9974999999995,{"$f":"VLOOKUP(A18,CPU!$A$1:$N$4703,9)","v":11.54},{"$f":"VLOOKUP(A18,CPU!$A$1:$N$4703,10)","v":14.23},{"$f":"ROUND(F18*H18,2)","v":99609.96}]
[8,"2.3","REGULARIZAÇÃO E COMPACTAÇÃO DO SUBLEITO ",100577,"M2",4600,{"$f":"VLOOKUP(A19,CPU!$A$1:$N$4703,9)","v":1.1299999999999999},{"$f":"VLOOKUP(A19,CPU!$A$1:$N$4703,10)","v":1.39},6394]
[9,"2.4","EXECUÇÃO E COMPACTAÇÃO DE BASE E/OU SUB BASE PARA PAVIMENTAÇÃO DE SOLOS DE COMPORTAMENTO LATERÍTICO - EXCLUSIVE SOLO, ESCAVAÇÃO, CARGA E TRANSPORTE",96388,"M3",920,{"$f":"VLOOKUP(A20,CPU!$A$1:$N$4703,9)","v":11.61},{"$f":"VLOOKUP(A20,CPU!$A$1:$N$4703,10)","v":14.32},13174.4]
[10,"2.5","IMPRIMAÇÃO COM EMULSÃO ASFÁLTICA (EAI)",96401,"M2",4600,{"$f":"VLOOKUP(A21,CPU!$A$1:$N$4703,9)","v":1.1200000000000001},{"$f":"VLOOKUP(A21,CPU!$A$1:$N$4703,10)","v":1.38},6348]
[11,"2.6","PINTURA DE LIGAÇÃO COM EMULSÃO ASFÁLTICA RR-1C",96402,"M2",4200,{"$f":"VLOOKUP(A22,CPU!$A$1:$N$4703,9)","v":0.93000000000000016},{"$f":"VLOOKUP(A22,CPU!$A$1:$N$4703,10)","v":1.1499999999999999},4830]
[12,"2.7","EXECUÇÃO DE PAVIMENTO COM APLICAÇÃO DE CONCRETO ASFÁLTICO USINADO A QUENTE (CBUQ), CAMADA DE ROLAMENTO - EXCLUSIVE TRANSPORTE",95995,"M3",130,{"$f":"VLOOKUP(A23,CPU!$A$1:$N$4703,9)","v":121.32},{"$f":"VLOOKUP(A23,CPU!$A$1:$N$4703,10)","v":149.61000000000001},19449.3]
["C",3,"TRANSPORTE DE MATERIAIS",{"$nulls":5},{"$f":"SUM(I25:I26)","v":104665}]
[13,"3.1","TRANSPORTE COM CAMINHÃO BASCULANTE, EM VIA URBANA PAVIMENTADA",95877,"M3XKM",51999.997749999988,{"$f":"VLOOKUP(A25,CPU!$A$1:$N$4703,9)","v":1.6099999999999999},{"$f":"VLOOKUP(A25,CPU!$A$1:$N$4703,10)","v":1.99},{"$f":"ROUND(F25*H25,2)","v":103480}]
[14,"3.2","TRANSPORTE COM CAMINHÃO CARROCERIA 9T, EM VIA URBANA PAVIMENTADA",100947,"TXKM",500.00008960000002,{"$f":"VLOOKUP(A26,CPU!$A$1:$N$4703,9)","v":1.92},{"$f":"VLOOKUP(A26,CPU!$A$1:$N$4703,10)","v":2.37},{"$f":"ROUND(F26*H26,2)","v":1185}]
["D",4,"TRANSPORTE DE MATERIAL ASFÁLTICO (BDI DIFERENCIADO)",{"$nulls":5},{"$f":"SUM(I28:I29)","v":22824}]
[15,"4.1","TRANSPORTE DE MASSA ASFÁLTICA COM CAMINHÃO BASCULANTE, EM VIA URBANA PAVIMENTADA (BDI DIFERENCIADO)",95427,"TXKM",30000,{"$f":"VLOOKUP(A28,CPU!$A$1:$N$4703,9)","v":0.64999999999999991},{"$f":"VLOOKUP(A28,CPU!$A$1:$N$4703,10)","v":0.75},{"$f":"ROUND(F28*H28,2)","v":22500}]
[16,"4.2","TRANSPORTE COM CAMINHÃO TANQUE DE TRANSPORTE DE MATERIAL ASFÁLTICO DE 30000 L, EM VIA URBANA PAVIMENTADA (BDI DIFERENCIADO)",102331,"TXKM",600,{"$f":"VLOOKUP(A29,CPU!$A$1:$N$4703,9)","v":0.47},{"$f":"VLOOKUP(A29,CPU!$A$1:$N$4703,10)","v":0.54},{"$f":"ROUND(F29*H29,2)","v":324}]
["E",5,"OBRAS COMPLEMENTARES",{"$nulls":5},{"$f":"SUM(I31:I35)","v":214881.32}]
[17,"5.1","GUIA (MEIO-FIO) E SARJETA CONJUGADOS DE CONCRETO, MOLDADA  IN LOCO  EM TRECHO RETO COM EXTRUSORA, 45 CM BASE (15 CM BASE DA GUIA + 30 CM BASE DA SARJETA) X 22 CM ALTURA. AF_06/2016",94267,"M",1200,{"$f":"VLOOKUP(A31,CPU!$A$1:$N$4703,9)","v":57.36999999999999},{"$f":"VLOOKUP(A31,CPU!$A$1:$N$4703,10)","v":70.75},{"$f":"ROUND(F31*H31,2)","v":84900}]
[18,"5.2","EXECUÇÃO DE PASSEIO (CALÇADA) OU PISO DE CONCRETO COM CONCRETO MOLDADO IN LOCO, ACABAMENTO CONVENCIONAL, NÃO ARMADO",94990,"M3",120,{"$f":"VLOOKUP(A32,CPU!$A$1:$N$4703,9)","v":766.74},{"$f":"VLOOKUP(A32,CPU!$A$1:$N$4703,10)","v":945.54},113464.8]
[19,"5.3","FORNECIMENTO E INSTALAÇÃO DE PLACA DE SINALIZAÇÃO VIÁRIA - REGULAMENTAÇÃO (FAIXA DE PEDESTRE E OUTROS)","CPU.4","UN.",6,{"$f":"VLOOKUP(A33,CPU!$A$1:$N$4703,9)","v":422.66},{"$f":"VLOOKUP(A33,CPU!$A$1:$N$4703,10)","v":521.22},3127.32]
[20,"5.4","PINTURA DE FAIXA DE PEDESTRE OU ZEBRADA TINTA RETRORREFLETIVA A BASE DE RESINA ACRÍLICA COM MICROESFERAS DE VIDRO, E = 30 CM, APLICAÇÃO MANUAL",102509,"M2",56.000000000000007,{"$f":"VLOOKUP(A34,CPU!$A$1:$N$4703,9)","v":25.499999999999996},{"$f":"VLOOKUP(A34,CPU!$A$1:$N$4703,10)","v":31.45},1761.2]
[22,"5.5","PINTURA DE EIXO VIÁRIO SOBRE ASFALTO COM TINTA RETRORREFLETIVA A BASE DE RESINA ACRÍLICA COM MICROESFERAS DE VIDRO, APLICAÇÃO MECÂNICA COM DEMARCADORA AUTOPROPELIDA - ESPESSURA DE 0,10 MM",102512,"M",1700,{"$f":"VLOOKUP(A35,CPU!$A$1:$N$4703,9)","v":5.5500000000000007},{"$f":"VLOOKUP(A35,CPU!$A$1:$N$4703,10)","v":6.84},11628]
["F",6,"FORNECIMENTOS - MATERIAL ASFÁLTICO (BDI DIFERENCIADO)",{"$nulls":5},{"$f":"SUM(I37:I39)","v":242972.93}]
[23,"6.1","AQUISIÇÃO DE EMULSÃO ASFÁLTICA PARA IMPRIMAÇÃO (EAI) - EXCLUSIVE TRANSPORTE","CPU.7","T",6.5,{"$f":"VLOOKUP(A37,CPU!$A$1:$N$4703,9)","v":2812.65},{"$f":"VLOOKUP(A37,CPU!$A$1:$N$4703,10)","v":3234.55},{"$f":"ROUND(F37*H37,2)","v":21024.58}]
[24,"6.2","AQUISIÇÃO DE EMULSAO ASFALTICA CATIONICA RR-1C - EXCLUSIVE TRANSPORTE","CPU.8","T",2.1,{"$f":"VLOOKUP(A38,CPU!$A$1:$N$4703,9)","v":2736.39},{"$f":"VLOOKUP(A38,CPU!$A$1:$N$4703,10)","v":3146.85},{"$f":"ROUND(F38*H38,2)","v":6608.39}]
[25,"6.3","AQUISIÇÃO DE CONCRETO BETUMINOSO USINADO A QUENTE (CBUQ) PARA PAVIMENTACAO ASFALTICA, PADRAO DNIT, FAIXA C, COM CAP 50/70 - EXCLUSIVE TRANSPORTE","CPU.9","T",350.00400000000002,{"$f":"VLOOKUP(A39,CPU!$A$1:$N$4703,9)","v":535},{"$f":"VLOOKUP(A39,CPU!$A$1:$N$4703,10)","v":615.25},{"$f":"ROUND(F39*H39,2)","v":215339.96}]
[null,"TOTAL GERAL DA OBRA COM BDI ",{"$nulls":6},{"$f":"SUM(I9,I15,I24,I30,I36,I27)","v":982418.29}]

{"sheet":"CPU","index":1,"n_rows":400,"n_cols":13,"rows_kept":400,"cut":false,"hidden":false,"merged":[[0,0,13,0],[0,1,0,3],[0,4,0,7],[0,10,0,11],[1,2,1,5],[1,10,1,11],[2,2,2,3],[3,1,3,7],[9,1,9,3],[9,5,9,6],[10,1,10,6],[11,1,11,6],[12,1,12,6],[14,0,32,0],[14,1,14,3],[14,4,14,7],[14,10,14,11],[15,2,15,5],[15,8,16,9],[16,2,16,3],[17,1,17,7],[28,1,28,3],[28,5,28,6],[29,1,29,6],[30,1,30,6],[31,1,31,6],[33,0,47,0],[33,1,33,3],[33,4,33,7],[33,10,33,11],[34,2,34,5],[34,8,35,9],[35,2,35,3],[36,1,36,7],[43,1,43,3],[43,5,43,6],[44,1,44,6],[45,1,45,6],[46,1,46,6],[48,0,65,0],[48,1,48,3],[48,4,48,7],[48,10,48,11],[49,2,49,5],[50,2,50,3],[51,1,51,7],[61,1,61,3],[61,5,61,6],[62,1,62,6],[63,1,63,6],[64,1,64,6],[66,0,81,0],[66,1,66,3],[66,4,66,7],[66,10,66,11],[67,2,67,5],[68,2,68,3],[69,1,69,7],[77,1,77,3],[77,5,77,6],[78,1,78,6],[79,1,79,6],[80,1,80,6],[82,0,94,0],[82,1,82,3],[82,4,82,7],[82,10,82,11],[83,2,83,5],[84,2,84,3],[85,1,85,7],[90,1,90,3],[90,5,90,6],[91,1,91,6],[92,1,92,6],[93,1,93,6],[95,0,107,0],[95,1,95,3],[95,4,95,7],[96,2,96,5],[97,2,97,3],[98,1,98,7],[104,1,104,3],[104,5,104,6],[105,1,105,6],[106,1,106,6],[107,1,107,6],[127,0,144,0],[127,1,127,3],[127,4,127,7],[127,10,127,11],[128,2,128,5],[129,2,129,3],[130,1,130,7],[140,1,140,3],[140,5,140,6],[141,1,141,6],[142,1,142,6],[143,1,143,6],[145,0,162,0],[145,1,145,3],[145,4,145,7],[146,2,146,5],[147,2,147,3],[148,1,148,7],[159,1,159,3],[159,5,159,6],[160,1,160,6],[161,1,161,6],[162,1,162,6],[164,0,182,0],[164,1,164,3],[164,4,164,7],[164,10,164,11],[165,2,165,5],[166,2,166,3],[167,1,167,7],[178,1,178,3],[178,5,178,6],[179,1,179,6],[180,1,180,6],[181,1,181,6],[183,0,201,0],[183,1,183,3],[183,4,183,7],[183,10,183,11],[184,2,184,5],[185,2,185,3],[186,1,186,7],[197,1,197,3],[197,5,197,6],[198,1,198,6],[199,1,199,6],[200,1,200,6],[202,0,223,0],[202,1,202,3],[202,4,202,7],[202,10,202,11],[203,2,203,5],[204,2,204,3],[205,1,205,7],[219,1,219,3],[219,5,219,6],[220,1,220,6],[221,1,221,6],[222,1,222,6],[224,0,235,0],[224,1,224,3],[224,4,224,7],[224,10,224,11],[225,2,225,5],[226,2,226,3],[227,1,227,7],[232,1,232,3],[232,5,232,6],[233,1,233,6],[234,1,234,6],[235,1,235,6],[237,0,248,0],[237,1,237,3],[237,4,237,7],[238,2,238,5],[239,2,239,3],[240,1,240,7],[245,1,245,3],[245,5,245,6],[246,1,246,6],[247,1,247,6],[248,1,248,6],[250,0,261,0],[250,1,250,3],[250,4,250,7],[251,2,251,5],[252,2,252,3],[253,1,253,7],[258,1,258,3],[258,5,258,6],[259,1,259,6],[260,1,260,6],[261,1,261,6],[263,0,274,0],[263,1,263,3],[263,4,263,7],[263,10,263,11],[264,2,264,5],[265,2,265,3],[266,1,266,7],[270,1,270,3],[270,5,270,6],[271,1,271,6],[272,1,272,6],[273,1,273,6],[275,0,293,0],[275,1,275,3],[275,4,275,7],[275,10,275,11],[276,2,276,5],[277,2,277,3],[278,1,278,7],[280,12,289,15],[290,1,290,3],[290,5,290,6],[291,1,291,6],[292,1,292,6],[293,1,293,6],[295,0,312,0],[295,1,295,3],[295,4,295,7],[296,2,296,5],[297,2,297,3],[298,1,298,7],[309,1,309,3],[309,5,309,6],[310,1,310,6],[311,1,311,6],[312,1,312,6],[314,0,330,0],[314,1,314,3],[314,4,314,7],[315,2,315,5],[316,2,316,3],[317,1,317,7],[327,1,327,3],[327,5,327,6],[328,1,328,6],[329,1,329,6],[330,1,330,6],[332,0,348,0],[332,1,332,3],[332,4,332,7],[333,2,333,5],[334,2,334,3],[335,1,335,7],[345,1,345,3],[345,5,345,6],[346,1,346,6],[347,1,347,6],[348,1,348,6],[350,0,366,0],[350,1,350,3],[350,4,350,7],[351,2,351,5],[352,2,352,3],[353,1,353,7],[363,1,363,3],[363,5,363,6],[364,1,364,6],[365,1,365,6],[366,1,366,6],[368,0,377,0],[368,1,368,3],[368,4,368,7],[369,2,369,5],[370,2,370,3],[371,1,371,7],[374,1,374,3],[374,5,374,6],[375,1,375,6],[376,1,376,6],[377,1,377,6],[379,0,388,0],[379,1,379,3],[379,4,379,7],[380,2,380,5],[381,2,381,3],[382,1,382,7],[385,1,385,3],[385,5,385,6],[386,1,386,6],[387,1,387,6],[388,1,388,6],[390,0,399,0],[390,1,390,3],[390,4,390,7],[391,2,391,5],[392,2,392,3],[393,1,393,7],[396,1,396,3],[396,5,396,6],[397,1,397,6],[398,1,398,6],[399,1,399,6],[124,1,124,6],[125,1,125,6],[109,0,126,0],[109,1,109,3],[109,4,109,7],[109,10,109,11],[110,2,110,5],[111,2,111,3],[112,1,112,7],[122,1,122,3],[122,5,122,6],[123,1,123,6]]}
[1,"CODEVASF",null,null," COMPOSIÇÃO DE PREÇO UNITÁRIO",null,null,null,{"$f":"H11","v":9018.26},{"$f":"H13","v":11121.32},"BDI CALCULADO:",null,{"$f":"ORÇAMENTO!I6","v":0.23319999999999999}]
[null,"OBRA:  ",{"$f":"ORÇAMENTO!C5","v":" PAVIMENTAÇÃO ASFÁLTICA EM CBUQ – AVENIDA SANITÁRIA (BONFIM / MG) - LOTE 3"},null,null,null,"DATA: ",{"$f":"ORÇAMENTO!C6","v":" AGOSTO / 2023   "},null,null,"BDI DIFERENCIADO:",null,{"$f":"'BDI FORN'!D31/100","v":0.15}]
[null,"SERVIÇO:  ",{"$f":"VLOOKUP(A1,ORÇAMENTO!A10:I31,3)","v":"MOBILIZAÇÃO E DESMOBILIZAÇÃO"},null,"Referência:",{"$f":"VLOOKUP(A1,ORÇAMENTO!$A$10:$I$31,4)","v":"CPU.1"},"UNIDADE: ",{"$f":"VLOOKUP(A1,ORÇAMENTO!A10:I31,5)","v":"GL"}]
[]
[null,"TIPO ITEM","CODIGO ITEM","DESCRIÇÃO ITEM","UNIDADE ITEM","COEFICIENTE","PRECO UNITARIO","CUSTO TOTAL"]
[null,"COMPOSICAO",89876,"CAMINHÃO BASCULANTE 14 M3, COM CAVALO MECÂNICO DE CAPACIDADE MÁXIMA DE TRAÇÃO COMBINADO DE 36000 KG, POTÊNCIA 286 CV, INCLUSIVE SEMIREBOQUE COM CAÇAMBA METÁLICA","CHP DIURNO.",16,286.2,{"$f":"ROUNDDOWN(F6*G6,2)","v":4579.2}]
[null,"COMPOSICAO",89877,"CAMINHÃO BASCULANTE 14 M3, COM CAVALO MECÂNICO DE CAPACIDADE MÁXIMA DE TRAÇÃO COMBINADO DE 36000 KG, POTÊNCIA 286 CV, INCLUSIVE SEMIREBOQUE COM CAÇAMBA METÁLICA","CHI DIURNO.",16,82.81,{"$f":"ROUNDDOWN(F7*G7,2)","v":1324.96}]
[null,"COMPOSICAO",5914640,"TRANSPORTE COM CAVALO MECÂNICO COM SEMIRREBOQUE COM CAPACIDADE DE 30 T - RODOVIA PAVIMENTADA","T.KM",4354,0.56999999999999995,{"$f":"ROUNDDOWN(F8*G8,2)","v":2481.7800000000002}]
[null,"COMPOSIÇÃO",88316,"SERVENTE COM ENCARGOS COMPLEMENTARES","H",32,19.760000000000002,{"$f":"ROUNDDOWN(F9*G9,2)","v":632.32000000000005}]
[null,"PRODUÇÃO DA EQUIPE",null,null,1,"CUSTO ",null,{"$f":"SUM(H6:H9)","v":9018.26}]
[null,"TOTAL",{"$nulls":5},{"$f":"H10/E10","v":9018.26},"OK"]
[null,"BDI                %",{"$nulls":5},{"$f":"1+$M$1","v":1.2332000000000001}]
[null,"TOTAL DO SERVIÇO - R$",{"$nulls":5},{"$f":"ROUND(H11*H12,2)","v":11121.32}]
[]
[2,"CODEVASF",null,null," COMPOSIÇÃO DE PREÇO UNITÁRIO",null,null,null,{"$f":"H30","v":75821.279999999999},{"$f":"H32","v":93502.8}]
[null,"OBRA:  ",{"$f":"$C$2","v":" PAVIMENTAÇÃO ASFÁLTICA EM CBUQ – AVENIDA SANITÁRIA (BONFIM / MG) - LOTE 3"},null,null,null,"DATA: ",{"$f":"$H$2","v":" AGOSTO / 2023   "}]
[null,"SERVIÇO:  ",{"$f":"VLOOKUP(A15,ORÇAMENTO!$A$10:$I$31,3)","v":"ADMINISTRAÇÃO LOCAL"},null,"SINAPI",{"$f":"VLOOKUP(A15,ORÇAMENTO!$A$10:$I$31,4)","v":"CPU.2"},"UNIDADE: ",{"$f":"VLOOKUP(A15,ORÇAMENTO!$A$10:$I$31,5)","v":"GL"}]
[]
[null,"TIPO ITEM","CODIGO ITEM","DESCRIÇÃO ITEM","UNIDADE ITEM","COEFICIENTE","PRECO UNITARIO","CUSTO TOTAL"]
[null,"INSUMO",14250,"ENERGIA ELÉTRICA","kwh",60,0.95,{"$f":"ROUNDDOWN(F20*G20,2)","v":57}]
[null,"INSUMO",44480,"TARIFA \"A\" - ÁGUA/ESGOTO ","m³",6,17.97,107.82]
[null,"COTAÇÃO","MERC.","TELEFONE (PLANO CONTROLE)","UNID",2,59.9,119.8]
[null,"INSUMO","ED-50155 SEINFRA","BANHEIRO QUÍMICO 110 X 120 X 230 CM COM MANUTENÇÃO (CONSIDERANDO OBRAS SIMULTÂNEAS)","MÊS",2,515,1030]
[null,"COMPOSICAO",90777,"Engenheiro Civil Júnior com encargos complementares","H",55,114.12,6276.6]
[null,"COMPOSICAO",90776,"Encarregado Geral com encargos complementares","H",110,57.73,6350.3]
[null,"COMPOSICAO",88321,"Tecnico de Laboratório com encargos complementares","H",55,45.45,2499.75]
[null,"COMPOSICAO",100309,"Tecnico em Segurança do Trabalho com encargos complementares","H",55,45.71,2514.0500000000002]
[{"$nulls":7},0]
[null,"PRODUÇÃO DA EQUIPE",null,null,0.25,"CUSTO ",null,{"$f":"SUM(H20:H28)","v":18955.32}]
[null,"TOTAL",{"$nulls":5},{"$f":"ROUND(H29/E29,2)","v":75821.279999999999},"OK"]
[null,"BDI                %",{"$nulls":5},{"$f":"1+$M$1","v":1.2332000000000001}]
[null,"TOTAL DO SERVIÇO - R$",{"$nulls":5},{"$f":"ROUND(H30*H31,2)","v":93502.8}]
[]
[{"$f":"A15+1","v":3},"CODEVASF",null,null," COMPOSIÇÃO DE PREÇO UNITÁRIO",null,null,null,{"$f":"H45","v":13246.36},{"$f":"H47","v":16335.41}]
[null,"OBRA:  ",{"$f":"$C$2","v":" PAVIMENTAÇÃO ASFÁLTICA EM CBUQ – AVENIDA SANITÁRIA (BONFIM / MG) - LOTE 3"},null,null,null,"DATA: ",{"$f":"$H$2","v":" AGOSTO / 2023   "}]
[null,"SERVIÇO:  ",{"$f":"VLOOKUP(A34,ORÇAMENTO!$A$10:$I$31,3)","v":"CANTEIRO DE OBRAS"},null,"SINAPI",{"$f":"VLOOKUP(A34,ORÇAMENTO!$A$10:$I$31,4)","v":"CPU.3"},"UNIDADE: ",{"$f":"VLOOKUP(A34,ORÇAMENTO!$A$10:$I$31,5)","v":"GL"}]
[]
[null,"TIPO ITEM","CODIGO ITEM","DESCRIÇÃO ITEM","UNIDADE ITEM","COEFICIENTE","PRECO UNITARIO","CUSTO TOTAL"]
[null,"INSUMO",10775,"LOCACAO DE CONTAINER 2,30 X 6,00 M, ALT. 2,50 M, COM 1 SANITARIO, PARA ESCRITORIO, COMPLETO, SEM DIVISORIAS INTERNAS","MÊS",4,"995,00",{"$f":"ROUNDDOWN(F39*G39,2)","v":3980}]
[null,"INSUMO",10776,"LOCACAO DE CONTAINER 2,30 X 6,00 M, ALT. 2,50 M, PARA ALMOXARIFADO, SEM DIVISORIAS INTERNAS E SEM SANITARIO","MÊS",4,777.34,{"$f":"ROUNDDOWN(F40*G40,2)","v":3109.36}]
[null,"INSUMO",10779,"LOCACAO DE CONTAINER 2,30 X 4,30 M, ALT. 2,50 M, P/ SANITARIO, C/ 5 BACIAS, 1 LAVATORIO E 4 MICTORIOS","MÊS",4,1234.75,{"$f":"ROUNDDOWN(F41*G41,2)","v":4939}]
[null,"INSUMO","37525","TELA PLASTICA TECIDA LISTRADA BRANCA E LARANJA, TIPO GUARDA CORPO, EM POLIETILENO MONOFILADO, ROLO 1,20 X 50 M (L X C)","M",200,3.69,{"$f":"ROUNDDOWN(F42*G42,2)","v":738}]
[null,"COMPOSICAO"," - ","PLACA DE SINALIZAÇÃO - \"PERIGO - OBRAS A FRENTE\" - FORNECIMENTO E MOVIMENTAÇÃO","UNID.",24,20,{"$f":"ROUNDDOWN(F43*G43,2)","v":480}]
[null,"PRODUÇÃO DA EQUIPE",null,null,1,"CUSTO ",null,{"$f":"SUM(H39:H43)","v":13246.36}]
[null,"TOTAL",{"$nulls":5},{"$f":"H44/E44","v":13246.36},"OK"]
[null,"BDI                %",{"$nulls":5},{"$f":"1+$M$1","v":1.2332000000000001}]
[null,"TOTAL DO SERVIÇO - R$",{"$nulls":5},{"$f":"ROUND(H45*H46,2)","v":16335.41}]
[]
[{"$f":"A34+1","v":4},"CODEVASF",null,null," COMPOSIÇÃO DE PREÇO UNITÁRIO",null,null,null,{"$f":"H63","v":339.72},{"$f":"H65","v":418.94}]
[null,"OBRA:  ",{"$f":"$C$2","v":" PAVIMENTAÇÃO ASFÁLTICA EM CBUQ – AVENIDA SANITÁRIA (BONFIM / MG) - LOTE 3"},null,null,null,"DATA: ",{"$f":"$H$2","v":" AGOSTO / 2023   "}]
[null,"SERVIÇO:  ",{"$f":"VLOOKUP(A49,ORÇAMENTO!$A$10:$I$31,3)","v":"PLACA DE OBRA EM CHAPA DE AÇO GALVANIZADO"},null,"SINAPI",{"$f":"VLOOKUP(A49,ORÇAMENTO!$A$10:$I$31,4)","v":103689},"UNIDADE: ",{"$f":"VLOOKUP(A49,ORÇAMENTO!$A$10:$I$31,5)","v":"M2"}]
[]
[null,"TIPO ITEM","CODIGO ITEM","DESCRIÇÃO ITEM","UNIDADE ITEM","COEFICIENTE","PRECO UNITARIO","CUSTO TOTAL"]
[null,"INSUMO","4509","SARRAFO *2,5 X 10* CM EM PINUS, MISTA OU EQUIVALENTE DA REGIAO - BRUTA","M","3,2083000","4,41",{"$f":"ROUNDDOWN(F54*G54,2)","v":14.14}]
[null,"INSUMO","4813","PLACA DE OBRA (PARA CONSTRUCAO CIVIL) EM CHAPA GALVANIZADA *N. 22*, ADESIVADA, DE *2,4 X 1,2* M ","M2","1,0000000","250,00",250]
[null,"INSUMO",4115,"MADEIRA ROLICA TRATADA, D = 12 A 15 CM, EM EUCALIPTO OU EQUIVALENTE DA REGIAO","M",2,21.37,42.74]
[null,"INSUMO","5065","PREGO DE ACO POLIDO COM CABECA 10 X 10 (7/8 X 17)","KG","0,0113000","36,57",0.41]
[null,"INSUMO","5069","PREGO DE ACO POLIDO COM CABECA 17 X 27 (2 1/2 X 11)","KG","0,0132000",19.59,0.25]
[null,"COMPOSICAO","88262","CARPINTEIRO DE FORMAS COM ENCARGOS COMPLEMENTARES","H","0,3729000","27,05",10.08]
[null,"COMPOSICAO","88316","SERVENTE COM ENCARGOS COMPLEMENTARES","H","1,1186000","19,76",22.1]
[{"$nulls":7},0]
[null,"PRODUÇÃO DA EQUIPE",null,null,1,"CUSTO ",null,{"$f":"SUM(H54:H61)","v":339.72}]
[null,"TOTAL",{"$nulls":5},{"$f":"H62/E62","v":339.72},"OK"]
[null,"BDI                %",{"$nulls":5},{"$f":"1+$M$1","v":1.2332000000000001}]
[null,"TOTAL DO SERVIÇO - R$",{"$nulls":5},{"$f":"ROUND(H63*H64,2)","v":418.94}]
[]
[{"$f":"A49+1","v":5},"CODEVASF",null,null," COMPOSIÇÃO DE PREÇO UNITÁRIO",null,null,null,{"$f":"H79","v":0.32999999999999996},{"$f":"H81","v":0.41}]
[null,"OBRA:  ",{"$f":"$C$2","v":" PAVIMENTAÇÃO ASFÁLTICA EM CBUQ – AVENIDA SANITÁRIA (BONFIM / MG) - LOTE 3"},null,null,null,"DATA: ",{"$f":"$H$2","v":" AGOSTO / 2023   "}]
[null,"SERVIÇO:  ",{"$f":"VLOOKUP(A67,ORÇAMENTO!$A$10:$I$31,3)","v":"SERVIÇOS TOPOGRÁFICOS PARA PAVIMENTAÇÃO, INCLUSIVE NOTA DE SERVIÇO, ACOMPANHAMENTO E GREIDE"},null,"SINAPI",{"$f":"VLOOKUP(A67,ORÇAMENTO!$A$10:$I$31,4)","v":78472},"UNIDADE: ",{"$f":"VLOOKUP(A67,ORÇAMENTO!$A$10:$I$31,5)","v":"M2"}]
[]
[null,"TIPO ITEM","CODIGO ITEM","DESCRIÇÃO ITEM","UNIDADE ITEM","COEFICIENTE","PRECO UNITARIO","CUSTO TOTAL"]
[null,"COMPOSICAO",88253,"AUXILIAR DE TOPÓGRAFO COM ENCARGOS COMPLEMENTARES","H",2.5000000000000001E-3,21.57,{"$f":"ROUNDDOWN(F72*G72,2)","v":0.05}]
[null,"COMPOSICAO",88288,"NIVELADOR COM ENCARGOS COMPLEMENTARES","H",2.5000000000000001E-3,26.99,0.06]
[null,"COMPOSICAO",88316,"SERVENTE COM ENCARGOS COMPLEMENTARES","H",7.4999999999999997E-3,19.760000000000002,0.14000000000000001]
[null,"COMPOSICAO",88597,"DESENHISTA DETALHISTA COM ENCARGOS COMPLEMENTARES ","H",2E-3,29.72,0.05]
[null,"COMPOSICAO",92145,"CAMINHONETE CABINE SIMPLES COM MOTOR 1.6 FLEX, CÂMBIO MANUAL, POTÊNCIA 101/104 CV, 2 PORTAS","CHP",5.0000000000000001E-4,72.790000000000006,0.03]
[{"$nulls":7},0]
[null,"PRODUÇÃO DA EQUIPE",null,null,1,"CUSTO ",null,{"$f":"SUM(H72:H77)","v":0.32999999999999996}]
[null,"TOTAL",{"$nulls":5},{"$f":"H78/E78","v":0.32999999999999996},"OK"]
[null,"BDI                %",{"$nulls":5},{"$f":"1+$M$1","v":1.2332000000000001}]
[null,"TOTAL DO SERVIÇO - R$",{"$nulls":5},{"$f":"ROUND(H79*H80,2)","v":0.41}]
[]
[{"$f":"A67+1","v":6},"CODEVASF",null,null," COMPOSIÇÃO DE PREÇO UNITÁRIO",null,null,null,{"$f":"H92","v":2.0300000000000002},{"$f":"H94","v":2.5}]
[null,"OBRA:  ",{"$f":"$C$2","v":" PAVIMENTAÇÃO ASFÁLTICA EM CBUQ – AVENIDA SANITÁRIA (BONFIM / MG) - LOTE 3"},null,null,null,"DATA: ",{"$f":"$H$2","v":" AGOSTO / 2023   "}]
[null,"SERVIÇO:  ",{"$f":"VLOOKUP(A83,ORÇAMENTO!$A$10:$I$31,3)","v":"ESCAVAÇÃO HORIZONTAL EM SOLO DE 1A CATEGORIA "},null,"SINAPI",{"$f":"VLOOKUP(A83,ORÇAMENTO!$A$10:$I$31,4)","v":101116},"UNIDADE: ",{"$f":"VLOOKUP(A83,ORÇAMENTO!$A$10:$I$31,5)","v":"M3"}]
[]
[null,"TIPO ITEM","CODIGO ITEM","DESCRIÇÃO ITEM","UNIDADE ITEM","COEFICIENTE","PRECO UNITARIO","CUSTO TOTAL"]
[null,"COMPOSICAO","5847","TRATOR DE ESTEIRAS, POTÊNCIA 170 HP, PESO OPERACIONAL 19 T, CAÇAMBA 5,2 M3","CHP","0,0048000",231.82,{"$f":"ROUNDDOWN(F88*G88,2)","v":1.1100000000000001}]
[null,"COMPOSICAO","5849","TRATOR DE ESTEIRAS, POTÊNCIA 170 HP, PESO OPERACIONAL 19 T, CAÇAMBA 5,2 M3","CHI","0,0082000",82.14,{"$f":"ROUNDDOWN(F89*G89,2)","v":0.67}]
[null,"COMPOSICAO","88316","SERVENTE COM ENCARGOS COMPLEMENTARES","H","0,0131000","19,76",{"$f":"ROUNDDOWN(F90*G90,2)","v":0.25}]
[null,"PRODUÇÃO DA EQUIPE",null,null,1,"CUSTO ",null,{"$f":"SUM(H88:H90)","v":2.0300000000000002}]
[null,"TOTAL",{"$nulls":5},{"$f":"H91/E91","v":2.0300000000000002},"OK"]
[null,"BDI                %",{"$nulls":5},{"$f":"1+$M$1","v":1.2332000000000001}]
[null,"TOTAL DO SERVIÇO - R$",{"$nulls":5},{"$f":"ROUND(H92*H93,2)","v":2.5}]
[]
[7,"CODEVASF",null,null," COMPOSIÇÃO DE PREÇO UNITÁRIO",null,null,null,{"$f":"H106","v":7.99},{"$f":"H108","v":9.85}]
[null,"OBRA:  ",{"$f":"$C$2","v":" PAVIMENTAÇÃO ASFÁLTICA EM CBUQ – AVENIDA SANITÁRIA (BONFIM / MG) - LOTE 3"},null,null,null,"DATA: ",{"$f":"$H$2","v":" AGOSTO / 2023   "}]
[null,"SERVIÇO:  ",{"$f":"VLOOKUP(A96,ORÇAMENTO!$A$10:$I$31,3)","v":"CARGA, MANOBRA E DESCARGA DE SOLOS E MATERIAIS GRANULARES EM CAMINHÃO BASCULANTE"},null,"SINAPI",{"$f":"VLOOKUP(A96,ORÇAMENTO!$A$10:$I$31,4)","v":100976},"UNIDADE: ",{"$f":"VLOOKUP(A96,ORÇAMENTO!$A$10:$I$31,5)","v":"M3"}]
[]
[null,"TIPO ITEM","CODIGO ITEM","DESCRIÇÃO ITEM","UNIDADE ITEM","COEFICIENTE","PRECO UNITARIO","CUSTO TOTAL"]
[null,"COMPOSICAO","5940","PÁ CARREGADEIRA SOBRE RODAS, POTÊNCIA LÍQUIDA 128 HP, CAPACIDADE DA CAÇAMBA 1,7 A 2,8 M3, PESO OPERACIONAL 11632 KG","CHP","0,0083000","205,93",{"$f":"ROUNDDOWN(F101*G101,2)","v":1.7}]
[null,"COMPOSICAO","5942","PÁ CARREGADEIRA SOBRE RODAS, POTÊNCIA LÍQUIDA 128 HP, CAPACIDADE DA CAÇAMBA 1,7 A 2,8 M3, PESO OPERACIONAL 11632 KG","CHI","0,0074000","90,02",{"$f":"ROUNDDOWN(F102*G102,2)","v":0.66}]
[null,"COMPOSICAO","89883","CAMINHÃO BASCULANTE 18 M3, COM CAVALO MECÂNICO DE CAPACIDADE MÁXIMA DE TRAÇÃO COMBINADO DE 45000 KG, POTÊNCIA 330 CV, INCLUSIVE SEMIREBOQUE COM CAÇAMBA METÁLICA","CHP","0,0153000","314,64",{"$f":"ROUNDDOWN(F103*G103,2)","v":4.8099999999999996}]
[null,"COMPOSICAO","89884","CAMINHÃO BASCULANTE 18 M3, COM CAVALO MECÂNICO DE CAPACIDADE MÁXIMA DE TRAÇÃO COMBINADO DE 45000 KG, POTÊNCIA 330 CV, INCLUSIVE SEMIREBOQUE COM CAÇAMBA METÁLICA","CHI","0,0095000","86,36",{"$f":"ROUNDDOWN(F104*G104,2)","v":0.82}]
[null,"PRODUÇÃO DA EQUIPE",null,null,1,"CUSTO ",null,{"$f":"SUM(H101:H104)","v":7.99}]
[null,"TOTAL",{"$nulls":5},{"$f":"H105/E105","v":7.99},"OK"]
[null,"BDI                %",{"$nulls":5},{"$f":"1+$M$1","v":1.2332000000000001}]
[null,"TOTAL DO SERVIÇO - R$",{"$nulls":5},{"$f":"ROUND(H106*H107,2)","v":9.85}]
[]
[7.5,"CODEVASF",null,null," COMPOSIÇÃO DE PREÇO UNITÁRIO",null,null,null,{"$f":"H124","v":11.54},{"$f":"H126","v":14.23}]
[null,"OBRA:  ",{"$f":"$C$2","v":" PAVIMENTAÇÃO ASFÁLTICA EM CBUQ – AVENIDA SANITÁRIA (BONFIM / MG) - LOTE 3"},null,null,null,"DATA: ",{"$f":"$H$2","v":" AGOSTO / 2023   "}]
[null,"SERVIÇO:  ",{"$f":"VLOOKUP(A110,ORÇAMENTO!$A$10:$I$31,3)","v":"EXECUÇÃO E COMPACTAÇÃO DE ATERRO COM SOLO PREDOMINANTEMENTE ARGILOSO - EXCLUSIVE SOLO, ESCAVAÇÃO, CARGA E TRANSPORTE"},null,"SINAPI",{"$f":"VLOOKUP(A110,ORÇAMENTO!$A$10:$I$31,4)","v":96385},"UNIDADE: ","M2"]
[]
[null,"TIPO ITEM","CODIGO ITEM","DESCRIÇÃO ITEM","UNIDADE ITEM","COEFICIENTE","PRECO UNITARIO","CUSTO TOTAL"]
[null,"COMPOSICAO","5901","CAMINHÃO PIPA 10.000 L TRUCADO, PESO BRUTO TOTAL 23.000 KG, CARGA ÚTIL MÁXIMA 15.935 KG, DISTÂNCIA ENTRE EIXOS 4,8 M, POTÊNCIA 230 CV, INCLUSIVE TANQUE DE AÇO PARA TRANSPORTE DE ÁGUA","CHP","0,0040000","264,71",{"$f":"ROUNDDOWN(F115*G115,2)","v":1.05}]
[null,"COMPOSICAO","5903","CAMINHÃO PIPA 10.000 L TRUCADO, PESO BRUTO TOTAL 23.000 KG, CARGA ÚTIL MÁXIMA 15.935 KG, DISTÂNCIA ENTRE EIXOS 4,8 M, POTÊNCIA 230 CV, INCLUSIVE TANQUE DE AÇO PARA TRANSPORTE DE ÁGUA","CHI","0,0300000","67,26",2.0099999999999998]
[null,"COMPOSICAO","5932","MOTONIVELADORA POTÊNCIA BÁSICA LÍQUIDA (PRIMEIRA MARCHA) 125 HP, PESO BRUTO 13032 KG, LARGURA DA LÂMINA DE 3,7 M ","CHP","0,0060000","244,89",1.46]
[null,"COMPOSICAO","5934","MOTONIVELADORA POTÊNCIA BÁSICA LÍQUIDA (PRIMEIRA MARCHA) 125 HP, PESO BRUTO 13032 KG, LARGURA DA LÂMINA DE 3,7 M ","CHI","0,0270000","101,62",2.74]
[null,"COMPOSICAO","73436","ROLO COMPACTADOR VIBRATÓRIO PÉ DE CARNEIRO PARA SOLOS, POTÊNCIA 80 HP, PESO OPERACIONAL SEM/COM LASTRO 7,4 / 8,8 T, LARGURA DE TRABALHO 1,68 M ","CHP","0,0100000","210,75",2.1]
[null,"COMPOSICAO","88316","SERVENTE COM ENCARGOS COMPLEMENTARES","H","0,0330000","19,76",0.65]
[null,"COMPOSICAO","93244","ROLO COMPACTADOR VIBRATÓRIO PÉ DE CARNEIRO PARA SOLOS, POTÊNCIA 80 HP, PESO OPERACIONAL SEM/COM LASTRO 7,4 / 8,8 T, LARGURA DE TRABALHO 1,68 M ","CHI","0,0230000","66,89",1.53]
[]
[null,"PRODUÇÃO DA EQUIPE",null,null,1,"CUSTO ",null,{"$f":"SUM(H115:H122)","v":11.54}]
[null,"TOTAL",{"$nulls":5},{"$f":"H123/E123","v":11.54},"OK"]
[null,"BDI                %",{"$nulls":5},{"$f":"1+$M$1","v":1.2332000000000001}]
[null,"TOTAL DO SERVIÇO - R$",{"$nulls":5},{"$f":"ROUND(H124*H125,2)","v":14.23}]
[]
[8,"CODEVASF",null,null," COMPOSIÇÃO DE PREÇO UNITÁRIO",null,null,null,{"$f":"H142","v":1.1299999999999999},{"$f":"H144","v":1.39}]
[null,"OBRA:  ",{"$f":"$C$2","v":" PAVIMENTAÇÃO ASFÁLTICA EM CBUQ – AVENIDA SANITÁRIA (BONFIM / MG) - LOTE 3"},null,null,null,"DATA: ",{"$f":"$H$2","v":" AGOSTO / 2023   "}]
[null,"SERVIÇO:  ",{"$f":"VLOOKUP(A128,ORÇAMENTO!$A$10:$I$31,3)","v":"REGULARIZAÇÃO E COMPACTAÇÃO DO SUBLEITO "},null,"SINAPI",{"$f":"VLOOKUP(A128,ORÇAMENTO!$A$10:$I$31,4)","v":100577},"UNIDADE: ","M2"]
[]
[null,"TIPO ITEM","CODIGO ITEM","DESCRIÇÃO ITEM","UNIDADE ITEM","COEFICIENTE","PRECO UNITARIO","CUSTO TOTAL"]
[null,"COMPOSICAO","5901","CAMINHÃO PIPA 10.000 L TRUCADO, PESO BRUTO TOTAL 23.000 KG, CARGA ÚTIL MÁXIMA 15.935 KG, DISTÂNCIA ENTRE EIXOS 4,8 M, POTÊNCIA 230 CV, INCLUSIVE TANQUE DE AÇO PARA TRANSPORTE DE ÁGUA","CHP","0,0010000","264,71",{"$f":"ROUNDDOWN(F133*G133,2)","v":0.26}]
[null,"COMPOSICAO","5903","CAMINHÃO PIPA 10.000 L TRUCADO, PESO BRUTO TOTAL 23.000 KG, CARGA ÚTIL MÁXIMA 15.935 KG, DISTÂNCIA ENTRE EIXOS 4,8 M, POTÊNCIA 230 CV, INCLUSIVE TANQUE DE AÇO PARA TRANSPORTE DE ÁGUA","CHI","0,0020000","67,26",0.13]
[null,"COMPOSICAO","5932","MOTONIVELADORA POTÊNCIA BÁSICA LÍQUIDA (PRIMEIRA MARCHA) 125 HP, PESO BRUTO 13032 KG, LARGURA DA LÂMINA DE 3,7 M","CHP","0,0001000","244,89",0.02]
[null,"COMPOSICAO","5934","MOTONIVELADORA POTÊNCIA BÁSICA LÍQUIDA (PRIMEIRA MARCHA) 125 HP, PESO BRUTO 13032 KG, LARGURA DA LÂMINA DE 3,7 M","CHI","0,0030000","101,62",0.3]
[null,"COMPOSICAO","88316","SERVENTE COM ENCARGOS COMPLEMENTARES","H","0,0030000","19,76",0.05]
[null,"COMPOSICAO","96463","ROLO COMPACTADOR DE PNEUS, ESTATICO, PRESSAO VARIAVEL, POTENCIA 110 HP, PESO SEM/COM LASTRO 10,8/27 T, LARGURA DE ROLAGEM 2,30 M","CHP","0,0010000","203,13",0.2]
[null,"COMPOSICAO","96464","ROLO COMPACTADOR DE PNEUS, ESTATICO, PRESSAO VARIAVEL, POTENCIA 110 HP, PESO SEM/COM LASTRO 10,8/27 T, LARGURA DE ROLAGEM 2,30 M","CHI","0,0020000","89,07",0.17]
[]
[null,"PRODUÇÃO DA EQUIPE",null,null,1,"CUSTO ",null,{"$f":"SUM(H133:H140)","v":1.1299999999999999}]
[null,"TOTAL",{"$nulls":5},{"$f":"H141/E141","v":1.1299999999999999},"OK"]
[null,"BDI                %",{"$nulls":5},{"$f":"1+$M$1","v":1.2332000000000001}]
[null,"TOTAL DO SERVIÇO - R$",{"$nulls":5},{"$f":"ROUND(H142*H143,2)","v":1.39}]
[]
[9,"CODEVASF",null,null," COMPOSIÇÃO DE PREÇO UNITÁRIO",null,null,null,{"$f":"H161","v":11.61},{"$f":"H163","v":14.32}]
[null,"OBRA:  ",{"$f":"$C$2","v":" PAVIMENTAÇÃO ASFÁLTICA EM CBUQ – AVENIDA SANITÁRIA (BONFIM / MG) - LOTE 3"},null,null,null,"DATA: ",{"$f":"$H$2","v":" AGOSTO / 2023   "}]
[null,"SERVIÇO:  ",{"$f":"VLOOKUP(A146,ORÇAMENTO!$A$10:$I$31,3)","v":"EXECUÇÃO E COMPACTAÇÃO DE BASE E/OU SUB BASE PARA PAVIMENTAÇÃO DE SOLOS DE COMPORTAMENTO LATERÍTICO - EXCLUSIVE SOLO, ESCAVAÇÃO, CARGA E TRANSPORTE"},null,"SINAPI",{"$f":"VLOOKUP(A146,ORÇAMENTO!$A$10:$I$31,4)","v":96388},"UNIDADE: ",{"$f":"VLOOKUP(A146,ORÇAMENTO!$A$10:$I$31,5)","v":"M3"}]
[]
[null,"TIPO ITEM","CODIGO ITEM","DESCRIÇÃO ITEM","UNIDADE ITEM","COEFICIENTE","PRECO UNITARIO","CUSTO TOTAL"]
[null,"COMPOSICAO","5684","ROLO COMPACTADOR VIBRATÓRIO DE UM CILINDRO AÇO LISO, POTÊNCIA 80 HP, PESO OPERACIONAL MÁXIMO 8,1 T, IMPACTO DINÂMICO 16,15 / 9,5 T, LARGURA DE TRABALHO 1,68 M","CHP","0,0030000","148,46",{"$f":"ROUNDDOWN(F151*G151,2)","v":0.44}]
[null,"COMPOSICAO","5685","ROLO COMPACTADOR VIBRATÓRIO DE UM CILINDRO AÇO LISO, POTÊNCIA 80 HP, PESO OPERACIONAL MÁXIMO 8,1 T, IMPACTO DINÂMICO 16,15 / 9,5 T, LARGURA DE TRABALHO 1,68 M","CHI","0,0230000","65,46",1.5]
[null,"COMPOSICAO","5901","CAMINHÃO PIPA 10.000 L TRUCADO, PESO BRUTO TOTAL 23.000 KG, CARGA ÚTIL MÁXIMA 15.935 KG, DISTÂNCIA ENTRE EIXOS 4,8 M, POTÊNCIA 230 CV, INCLUSIVE TANQUE DE AÇO PARA TRANSPORTE DE ÁGUA","CHP","0,0040000","264,71",1.05]
[null,"COMPOSICAO","5903","CAMINHÃO PIPA 10.000 L TRUCADO, PESO BRUTO TOTAL 23.000 KG, CARGA ÚTIL MÁXIMA 15.935 KG, DISTÂNCIA ENTRE EIXOS 4,8 M, POTÊNCIA 230 CV, INCLUSIVE TANQUE DE AÇO PARA TRANSPORTE DE ÁGUA","CHI","0,0220000","67,26",1.47]
[null,"COMPOSICAO","5932","MOTONIVELADORA POTÊNCIA BÁSICA LÍQUIDA (PRIMEIRA MARCHA) 125 HP, PESO BRUTO 13032 KG, LARGURA DA LÂMINA DE 3,7 M","CHP","0,0080000","244,89",1.95]
[null,"COMPOSICAO","5934","MOTONIVELADORA POTÊNCIA BÁSICA LÍQUIDA (PRIMEIRA MARCHA) 125 HP, PESO BRUTO 13032 KG, LARGURA DA LÂMINA DE 3,7 M","CHI","0,0190000","101,62",1.93]
[null,"COMPOSICAO","88316","SERVENTE COM ENCARGOS COMPLEMENTARES","H","0,0260000","19,76",0.51]
[null,"COMPOSICAO","96463","ROLO COMPACTADOR DE PNEUS, ESTATICO, PRESSAO VARIAVEL, POTENCIA 110 HP, PESO SEM/COM LASTRO 10,8/27 T, LARGURA DE ROLAGEM 2,30 M","CHP","0,0040000","203,13",0.81]
[null,"COMPOSICAO","96464","ROLO COMPACTADOR DE PNEUS, ESTATICO, PRESSAO VARIAVEL, POTENCIA 110 HP, PESO SEM/COM LASTRO 10,8/27 T, LARGURA DE ROLAGEM 2,30 M","CHI","0,0220000","89,07",1.95]
[null,"PRODUÇÃO DA EQUIPE",null,null,1,"CUSTO ",null,{"$f":"SUM(H151:H159)","v":11.61}]
[null,"TOTAL",{"$nulls":5},{"$f":"H160/E160","v":11.61},"OK"]
[null,"BDI                %",{"$nulls":5},{"$f":"1+$M$1","v":1.2332000000000001}]
[null,"TOTAL DO SERVIÇO - R$",{"$nulls":5},{"$f":"ROUND(H161*H162,2)","v":14.32}]
[]
[10,"CODEVASF",null,null," COMPOSIÇÃO DE PREÇO UNITÁRIO",null,null,null,{"$f":"H180","v":1.1200000000000001},{"$f":"H182","v":1.38}]
[null,"OBRA:  ",{"$f":"$C$2","v":" PAVIMENTAÇÃO ASFÁLTICA EM CBUQ – AVENIDA SANITÁRIA (BONFIM / MG) - LOTE 3"},null,null,null,"DATA: ",{"$f":"$H$2","v":" AGOSTO / 2023   "}]
[null,"SERVIÇO:  ",{"$f":"VLOOKUP(A165,ORÇAMENTO!$A$10:$I$31,3)","v":"IMPRIMAÇÃO COM EMULSÃO ASFÁLTICA (EAI)"},null,"SINAPI",{"$f":"VLOOKUP(A165,ORÇAMENTO!$A$10:$I$31,4)","v":96401},"UNIDADE: ",{"$f":"VLOOKUP(A165,ORÇAMENTO!$A$10:$I$31,5)","v":"M2"}]
[]
[null,"TIPO ITEM","CODIGO ITEM","DESCRIÇÃO ITEM","UNIDADE ITEM","COEFICIENTE","PRECO UNITARIO","CUSTO TOTAL"]
[null,"COMPOSICAO",5839,"VASSOURA MECÂNICA REBOCÁVEL COM ESCOVA CILÍNDRICA, LARGURA ÚTIL DE VARRIMENTO DE 2,44 M ","CHP","0,0020000",9.77,{"$f":"ROUNDDOWN(F170*G170,2)","v":0.01}]
[null,"COMPOSICAO",5841,"VASSOURA MECÂNICA REBOCÁVEL COM ESCOVA CILÍNDRICA, LARGURA ÚTIL DE VARRIMENTO DE 2,44 M ","CHI","0,0040000",4.6500000000000004,0.01]
[null,"INSUMO","ANP","EMULSÃO ASFÁLTICA PARA IMPRIMAÇÃO - EAI (FORNECIMENTO COM BDI DIFERENCIADO)","T",{"$f":"1.3/1000","v":1.2999999999999999E-3},null,0]
[null,"COMPOSICAO",83362,"ESPARGIDOR DE ASFALTO PRESSURIZADO, TANQUE 6 M3 COM ISOLAÇÃO TÉRMICA, AQUECIDO COM 2 MAÇARICOS, COM BARRA ESPARGIDORA 3,60 M, MONTADO SOBRE CAMINHÃO  TOCO, PBT 14.300 KG, POTÊNCIA 185 CV","CHP","0,0010000",232.92,0.23]
[null,"COMPOSICAO",88316,"SERVENTE COM ENCARGOS COMPLEMENTARES","H","0,0060000",19.760000000000002,0.11]
[null,"COMPOSICAO",89035,"TRATOR DE PNEUS, POTÊNCIA 85 CV, TRAÇÃO 4X4, PESO COM LASTRO DE 4.675 KG ","CHP","0,0020000",119.96,0.23]
[null,"COMPOSICAO",89036,"TRATOR DE PNEUS, POTÊNCIA 85 CV, TRAÇÃO 4X4, PESO COM LASTRO DE 4.675 KG ","CHI","0,0040000",52.19,0.2]
[null,"COMPOSICAO",91486,"ESPARGIDOR DE ASFALTO PRESSURIZADO, TANQUE 6 M3 COM ISOLAÇÃO TÉRMICA, AQUECIDO COM 2 MAÇARICOS, COM BARRA ESPARGIDORA 3,60 M, MONTADO SOBRE CAMINHÃO  TOCO, PBT 14.300 KG, POTÊNCIA 185 CV","CHI","0,0050000",66.180000000000007,0.33]
[{"$nulls":7},0]
[null,"PRODUÇÃO DA EQUIPE",null,null,1,"CUSTO ",null,{"$f":"SUM(H170:H178)","v":1.1200000000000001}]
[null,"TOTAL",{"$nulls":5},{"$f":"H179/E179","v":1.1200000000000001},"OK"]
[null,"BDI                %",{"$nulls":5},{"$f":"1+$M$1","v":1.2332000000000001}]
[null,"TOTAL DO SERVIÇO - R$",{"$nulls":5},{"$f":"ROUND(H180*H181,2)","v":1.38}]
[]
[11,"CODEVASF",null,null," COMPOSIÇÃO DE PREÇO UNITÁRIO",null,null,null,{"$f":"H199","v":0.93000000000000016},{"$f":"H201","v":1.1499999999999999}]
[null,"OBRA:  ",{"$f":"$C$2","v":" PAVIMENTAÇÃO ASFÁLTICA EM CBUQ – AVENIDA SANITÁRIA (BONFIM / MG) - LOTE 3"},null,null,null,"DATA: ",{"$f":"$H$2","v":" AGOSTO / 2023   "}]
[null,"SERVIÇO:  ",{"$f":"VLOOKUP(A184,ORÇAMENTO!$A$10:$I$31,3)","v":"PINTURA DE LIGAÇÃO COM EMULSÃO ASFÁLTICA RR-1C"},null,"SINAPI",{"$f":"VLOOKUP(A184,ORÇAMENTO!$A$10:$I$31,4)","v":96402},"UNIDADE: ","M2"]
[]
[null,"TIPO ITEM","CODIGO ITEM","DESCRIÇÃO ITEM","UNIDADE ITEM","COEFICIENTE","PRECO UNITARIO","CUSTO TOTAL"]
[null,"COMPOSICAO",5839,"VASSOURA MECÂNICA REBOCÁVEL COM ESCOVA CILÍNDRICA, LARGURA ÚTIL DE VARRIMENTO DE 2,44 M","CHP","0,0020000",9.77,{"$f":"ROUNDDOWN(F189*G189,2)","v":0.01}]
[null,"COMPOSICAO",5841,"VASSOURA MECÂNICA REBOCÁVEL COM ESCOVA CILÍNDRICA, LARGURA ÚTIL DE VARRIMENTO DE 2,44 M","CHI","0,0040000",4.6500000000000004,0.01]
[null,"INSUMO",41903,"EMULSAO ASFALTICA CATIONICA RR-1C PARA USO EM PAVIMENTACAO ASFALTICA (FORNECIMENTO COM BDI DIFERENCIADO)","KG","0,4500000",null,0]
[null,"COMPOSICAO",83362,"ESPARGIDOR DE ASFALTO PRESSURIZADO, TANQUE 6 M3 COM ISOLAÇÃO TÉRMICA, AQUECIDO COM 2 MAÇARICOS, COM BARRA ESPARGIDORA 3,60 M, MONTADO SOBRE CAMINHÃO  TOCO, PBT 14.300 KG, POTÊNCIA 185 CV","CHP","0,0004000",232.92,0.09]
[null,"COMPOSICAO",88316,"SERVENTE COM ENCARGOS COMPLEMENTARES","H","0,0055000",19.760000000000002,0.1]
[null,"COMPOSICAO",89035,"TRATOR DE PNEUS, POTÊNCIA 85 CV, TRAÇÃO 4X4, PESO COM LASTRO DE 4.675 KG","CHP","0,0017000",119.96,0.2]
[null,"COMPOSICAO",89036,"TRATOR DE PNEUS, POTÊNCIA 85 CV, TRAÇÃO 4X4, PESO COM LASTRO DE 4.675 KG","CHI","0,0038000",52.19,0.19]
[null,"COMPOSICAO",91486,"ESPARGIDOR DE ASFALTO PRESSURIZADO, TANQUE 6 M3 COM ISOLAÇÃO TÉRMICA, AQUECIDO COM 2 MAÇARICOS, COM BARRA ESPARGIDORA 3,60 M, MONTADO SOBRE CAMINHÃO  TOCO, PBT 14.300 KG, POTÊNCIA 185 CV","CHI","0,0051000",66.180000000000007,0.33]
[{"$nulls":7},0]
[null,"PRODUÇÃO DA EQUIPE",null,null,1,"CUSTO ",null,{"$f":"SUM(H189:H197)","v":0.93000000000000016}]
[null,"TOTAL",{"$nulls":5},{"$f":"H198/E198","v":0.93000000000000016},"OK"]
[null,"BDI                %",{"$nulls":5},{"$f":"1+$M$1","v":1.2332000000000001}]
[null,"TOTAL DO SERVIÇO - R$",{"$nulls":5},{"$f":"ROUND(H199*H200,2)","v":1.1499999999999999}]
[]
[12,"CODEVASF",null,null," COMPOSIÇÃO DE PREÇO UNITÁRIO",null,null,null,{"$f":"H221","v":121.32},{"$f":"H223","v":149.61000000000001}]
[null,"OBRA:  ",{"$f":"$C$2","v":" PAVIMENTAÇÃO ASFÁLTICA EM CBUQ – AVENIDA SANITÁRIA (BONFIM / MG) - LOTE 3"},null,null,null,"DATA: ",{"$f":"$H$2","v":" AGOSTO / 2023   "}]
[null,"SERVIÇO:  ",{"$f":"VLOOKUP(A203,ORÇAMENTO!$A$10:$I$31,3)","v":"EXECUÇÃO DE PAVIMENTO COM APLICAÇÃO DE CONCRETO ASFÁLTICO USINADO A QUENTE (CBUQ), CAMADA DE ROLAMENTO - EXCLUSIVE TRANSPORTE"},null,"SINAPI",{"$f":"VLOOKUP(A203,ORÇAMENTO!$A$10:$I$31,4)","v":95995},"UNIDADE: ",{"$f":"VLOOKUP(A203,ORÇAMENTO!$A$10:$I$31,5)","v":"M3"}]
[]
[null,"TIPO ITEM","CODIGO ITEM","DESCRIÇÃO ITEM","UNIDADE ITEM","COEFICIENTE","PRECO UNITARIO","CUSTO TOTAL"]
[null,"INSUMO","1518","CONCRETO BETUMINOSO USINADO A QUENTE (CBUQ) PARA PAVIMENTACAO ASFALTICA, PADRAO DNIT, FAIXA C, COM CAP 50/70 - AQUISICAO POSTO USINA","T","2,5548000",null,{"$f":"ROUNDDOWN(F208*G208,2)","v":0}]
[null,"COMPOSICAO","5835","VIBROACABADORA DE ASFALTO SOBRE ESTEIRAS, LARGURA DE PAVIMENTAÇÃO 1,90 M A 5,30 M, POTÊNCIA 105 HP CAPACIDADE 450 T/H","CHP","0,0464000","366,49",17]
[null,"COMPOSICAO","5837","VIBROACABADORA DE ASFALTO SOBRE ESTEIRAS, LARGURA DE PAVIMENTAÇÃO 1,90 M A 5,30 M, POTÊNCIA 105 HP CAPACIDADE 450 T/H","CHI","0,0949000","147,82",14.02]
[null,"COMPOSICAO","88314","RASTELEIRO COM ENCARGOS COMPLEMENTARES","H","1,1301000","26,52",29.97]
[null,"COMPOSICAO","91386","CAMINHÃO BASCULANTE 10 M3, TRUCADO CABINE SIMPLES, PESO BRUTO TOTAL 23.000 KG, CARGA ÚTIL MÁXIMA 15.935 KG, DISTÂNCIA ENTRE EIXOS 4,80 M, POTÊNCIA 230 CV INCLUSIVE CAÇAMBA METÁLICA ","CHP","0,0464000","228,50",10.6]
[null,"COMPOSICAO","95631","ROLO COMPACTADOR VIBRATORIO TANDEM, ACO LISO, POTENCIA 125 HP, PESO SEM/COM LASTRO 10,20/11,65 T, LARGURA DE TRABALHO 1,73 M","CHP","0,0805000","210,29",16.920000000000002]
[null,"COMPOSICAO","95632","ROLO COMPACTADOR VIBRATORIO TANDEM, ACO LISO, POTENCIA 125 HP, PESO SEM/COM LASTRO 10,20/11,65 T, LARGURA DE TRABALHO 1,73 M","CHI","0,0607000","83,23",5.05]
[null,"COMPOSICAO","96155","TRATOR DE PNEUS COM POTÊNCIA DE 85 CV, TRAÇÃO 4X4, COM VASSOURA MECÂNICA ACOPLADA","CHI","0,1071000","56,63",6.06]
[null,"COMPOSICAO","96157","TRATOR DE PNEUS COM POTÊNCIA DE 85 CV, TRAÇÃO 4X4, COM VASSOURA MECÂNICA ACOPLADA","CHP","0,0341000","128,67",4.38]
[null,"COMPOSICAO","96463","ROLO COMPACTADOR DE PNEUS, ESTATICO, PRESSAO VARIAVEL, POTENCIA 110 HP, PESO SEM/COM LASTRO 10,8/27 T, LARGURA DE ROLAGEM 2,30 M","CHP","0,0419000","203,13",8.51]
[null,"COMPOSICAO","96464","ROLO COMPACTADOR DE PNEUS, ESTATICO, PRESSAO VARIAVEL, POTENCIA 110 HP, PESO SEM/COM LASTRO 10,8/27 T, LARGURA DE ROLAGEM 2,30 M","CHI","0,0990000","89,07",8.81]
[{"$nulls":7},0]
[null,"PRODUÇÃO DA EQUIPE",null,null,1,"CUSTO ",null,{"$f":"SUM(H208:H219)","v":121.32}]
[null,"TOTAL",{"$nulls":5},{"$f":"H220/E220","v":121.32},"OK"]
[null,"BDI                %",{"$nulls":5},{"$f":"1+$M$1","v":1.2332000000000001}]
[null,"TOTAL DO SERVIÇO - R$",{"$nulls":5},{"$f":"ROUND(H221*H222,2)","v":149.61000000000001}]
[]
[13,"CODEVASF",null,null," COMPOSIÇÃO DE PREÇO UNITÁRIO",null,null,null,{"$f":"H234","v":1.6099999999999999},{"$f":"H236","v":1.99}]
[null,"OBRA:  ",{"$f":"$C$2","v":" PAVIMENTAÇÃO ASFÁLTICA EM CBUQ – AVENIDA SANITÁRIA (BONFIM / MG) - LOTE 3"},null,null,null,"DATA: ",{"$f":"$H$2","v":" AGOSTO / 2023   "}]
[null,"SERVIÇO:  ",{"$f":"VLOOKUP(A225,ORÇAMENTO!$A$10:$I$31,3)","v":"TRANSPORTE COM CAMINHÃO BASCULANTE, EM VIA URBANA PAVIMENTADA"},null,"SINAPI",{"$f":"VLOOKUP(A225,ORÇAMENTO!$A$10:$I$31,4)","v":95877},"UNIDADE: ",{"$f":"VLOOKUP(A225,ORÇAMENTO!$A$10:$I$31,5)","v":"M3XKM"}]
[]
[null,"TIPO ITEM","CODIGO ITEM","DESCRIÇÃO ITEM","UNIDADE ITEM","COEFICIENTE","PRECO UNITARIO","CUSTO TOTAL"]
[null,"COMPOSICAO","89883","CAMINHÃO BASCULANTE 18 M3, COM CAVALO MECÂNICO DE CAPACIDADE MÁXIMA DE TRAÇÃO COMBINADO DE 45000 KG, POTÊNCIA 330 CV, INCLUSIVE SEMIREBOQUE COM CAÇAMBA METÁLICA","CHP","0,0046000",314.64,{"$f":"ROUNDDOWN(F230*G230,2)","v":1.44}]
[null,"COMPOSICAO","89884","CAMINHÃO BASCULANTE 18 M3, COM CAVALO MECÂNICO DE CAPACIDADE MÁXIMA DE TRAÇÃO COMBINADO DE 45000 KG, POTÊNCIA 330 CV, INCLUSIVE SEMIREBOQUE COM CAÇAMBA METÁLICA","CHI","0,0020000","86,36",{"$f":"ROUNDDOWN(F231*G231,2)","v":0.17}]
[{"$nulls":7},{"$f":"ROUNDDOWN(F232*G232,2)","v":0}]
[null,"PRODUÇÃO DA EQUIPE",null,null,1,"CUSTO ",null,{"$f":"SUM(H230:H232)","v":1.6099999999999999}]
[null,"TOTAL",{"$nulls":5},{"$f":"H233/E233","v":1.6099999999999999},"OK"]
[null,"BDI                %",{"$nulls":5},{"$f":"1+$M$1","v":1.2332000000000001}]
[null,"TOTAL DO SERVIÇO - R$",{"$nulls":5},{"$f":"ROUND(H234*H235,2)","v":1.99}]
[]
[14,"CODEVASF",null,null," COMPOSIÇÃO DE PREÇO UNITÁRIO",null,null,null,{"$f":"H247","v":1.92},{"$f":"H249","v":2.37}]
[null,"OBRA:  ",{"$f":"$C$2","v":" PAVIMENTAÇÃO ASFÁLTICA EM CBUQ – AVENIDA SANITÁRIA (BONFIM / MG) - LOTE 3"},null,null,null,"DATA: ",{"$f":"$H$2","v":" AGOSTO / 2023   "}]
[null,"SERVIÇO:  ",{"$f":"VLOOKUP(A238,ORÇAMENTO!$A$10:$I$31,3)","v":"TRANSPORTE COM CAMINHÃO CARROCERIA 9T, EM VIA URBANA PAVIMENTADA"},null,"SINAPI",{"$f":"VLOOKUP(A238,ORÇAMENTO!$A$10:$I$31,4)","v":100947},"UNIDADE: ",{"$f":"VLOOKUP(A238,ORÇAMENTO!$A$10:$I$31,5)","v":"TXKM"}]
[]
[null,"TIPO ITEM","CODIGO ITEM","DESCRIÇÃO ITEM","UNIDADE ITEM","COEFICIENTE","PRECO UNITARIO","CUSTO TOTAL"]
[null,"COMPOSICAO","5824","CAMINHÃO TOCO, PBT 16.000 KG, CARGA ÚTIL MÁX. 10.685 KG, DIST. ENTRE EIXOS 4,8 M, POTÊNCIA 189 CV, INCLUSIVE CARROCERIA FIXA ABERTA DE MADEIRA P/ TRANSPORTE GERAL DE CARGA SECA, DIMEN. APROX. 2,5 X 7,00 X 0,50 M ","CHP","0,0093000",183.71,{"$f":"ROUNDDOWN(F243*G243,2)","v":1.7}]
[null,"COMPOSICAO","5826","CAMINHÃO TOCO, PBT 16.000 KG, CARGA ÚTIL MÁX. 10.685 KG, DIST. ENTRE EIXOS 4,8 M, POTÊNCIA 189 CV, INCLUSIVE CARROCERIA FIXA ABERTA DE MADEIRA P/ TRANSPORTE GERAL DE CARGA SECA, DIMEN. APROX. 2,5 X 7,00 X 0,50 M ","CHI","0,0040000",57,{"$f":"ROUNDDOWN(F244*G244,2)","v":0.22}]
[{"$nulls":7},{"$f":"ROUNDDOWN(F245*G245,2)","v":0}]
[null,"PRODUÇÃO DA EQUIPE",null,null,1,"CUSTO ",null,{"$f":"SUM(H243:H245)","v":1.92}]
[null,"TOTAL",{"$nulls":5},{"$f":"H246/E246","v":1.92},"OK"]
[null,"BDI                %",{"$nulls":5},{"$f":"1+$M$1","v":1.2332000000000001}]
[null,"TOTAL DO SERVIÇO - R$",{"$nulls":5},{"$f":"ROUND(H247*H248,2)","v":2.37}]
[]
[15,"CODEVASF",null,null," COMPOSIÇÃO DE PREÇO UNITÁRIO",null,null,null,{"$f":"H260","v":0.64999999999999991},{"$f":"H262","v":0.75}]
[null,"OBRA:  ",{"$f":"$C$2","v":" PAVIMENTAÇÃO ASFÁLTICA EM CBUQ – AVENIDA SANITÁRIA (BONFIM / MG) - LOTE 3"},null,null,null,"DATA: ",{"$f":"$H$2","v":" AGOSTO / 2023   "}]
[null,"SERVIÇO:  ",{"$f":"VLOOKUP(A251,ORÇAMENTO!$A$10:$I$31,3)","v":"TRANSPORTE DE MASSA ASFÁLTICA COM CAMINHÃO BASCULANTE, EM VIA URBANA PAVIMENTADA (BDI DIFERENCIADO)"},null,"SINAPI",{"$f":"VLOOKUP(A251,ORÇAMENTO!$A$10:$I$31,4)","v":95427},"UNIDADE: ",{"$f":"VLOOKUP(A251,ORÇAMENTO!$A$10:$I$31,5)","v":"TXKM"}]
[]
[null,"TIPO ITEM","CODIGO ITEM","DESCRIÇÃO ITEM","UNIDADE ITEM","COEFICIENTE","PRECO UNITARIO","CUSTO TOTAL"]
[null,"COMPOSICAO","89883","CAMINHÃO BASCULANTE 18 M3, COM CAVALO MECÂNICO DE CAPACIDADE MÁXIMA DE TRAÇÃO COMBINADO DE 45000 KG, POTÊNCIA 330 CV, INCLUSIVE SEMIREBOQUE COM CAÇAMBA METÁLICA - CHP DIURNO. AF_12/2014","CHP","0,0019000","314,64",{"$f":"ROUNDDOWN(F256*G256,2)","v":0.59}]
[null,"COMPOSICAO","89884","CAMINHÃO BASCULANTE 18 M3, COM CAVALO MECÂNICO DE CAPACIDADE MÁXIMA DE TRAÇÃO COMBINADO DE 45000 KG, POTÊNCIA 330 CV, INCLUSIVE SEMIREBOQUE COM CAÇAMBA METÁLICA - CHI DIURNO. AF_12/2014","CHI","0,0008000","86,36",{"$f":"ROUNDDOWN(F257*G257,2)","v":0.06}]
[{"$nulls":7},{"$f":"ROUNDDOWN(F258*G258,2)","v":0}]
[null,"PRODUÇÃO DA EQUIPE",null,null,1,"CUSTO ",null,{"$f":"SUM(H256:H258)","v":0.64999999999999991}]
[null,"TOTAL",{"$nulls":5},{"$f":"H259/E259","v":0.64999999999999991},"OK"]
[null,"BDI                %",{"$nulls":5},{"$f":"1+$M$2","v":1.1499999999999999}]
[null,"TOTAL DO SERVIÇO - R$",{"$nulls":5},{"$f":"ROUND(H260*H261,2)","v":0.75}]
[]
[16,"CODEVASF",null,null," COMPOSIÇÃO DE PREÇO UNITÁRIO",null,null,null,{"$f":"H272","v":0.47},{"$f":"H274","v":0.54}]
[null,"OBRA:  ",{"$f":"$C$2","v":" PAVIMENTAÇÃO ASFÁLTICA EM CBUQ – AVENIDA SANITÁRIA (BONFIM / MG) - LOTE 3"},null,null,null,"DATA: ",{"$f":"$H$2","v":" AGOSTO / 2023   "}]
[null,"SERVIÇO:  ",{"$f":"VLOOKUP(A264,ORÇAMENTO!$A$10:$I$31,3)","v":"TRANSPORTE COM CAMINHÃO TANQUE DE TRANSPORTE DE MATERIAL ASFÁLTICO DE 30000 L, EM VIA URBANA PAVIMENTADA (BDI DIFERENCIADO)"},null,"SINAPI",{"$f":"VLOOKUP(A264,ORÇAMENTO!$A$10:$I$31,4)","v":102331},"UNIDADE: ",{"$f":"VLOOKUP(A264,ORÇAMENTO!$A$10:$I$31,5)","v":"TXKM"}]
[]
[null,"TIPO ITEM","CODIGO ITEM","DESCRIÇÃO ITEM","UNIDADE ITEM","COEFICIENTE","PRECO UNITARIO","CUSTO TOTAL"]
[null,"COMPOSICAO","91645","CAMINHÃO DE TRANSPORTE DE MATERIAL ASFÁLTICO 30.000 L, COM CAVALO MECÂNICO DE CAPACIDADE MÁXIMA DE TRAÇÃO COMBINADO DE 66.000 KG, POTÊNCIA 360 CV, INCLUSIVE TANQUE DE ASFALTO COM SERPENTINA ","CHP","0,0011000",394.83,{"$f":"ROUNDDOWN(F269*G269,2)","v":0.43}]
[null,"COMPOSICAO","91646","CAMINHÃO DE TRANSPORTE DE MATERIAL ASFÁLTICO 30.000 L, COM CAVALO MECÂNICO DE CAPACIDADE MÁXIMA DE TRAÇÃO COMBINADO DE 66.000 KG, POTÊNCIA 360 CV, INCLUSIVE TANQUE DE ASFALTO COM SERPENTINA","CHI","0,0005000",90.79,{"$f":"ROUNDDOWN(F270*G270,2)","v":0.04}]
[null,"PRODUÇÃO DA EQUIPE",null,null,1,"CUSTO ",null,{"$f":"SUM(H269:H270)","v":0.47}]
[null,"TOTAL",{"$nulls":5},{"$f":"H271/E271","v":0.47},"OK"]
[null,"BDI                %",{"$nulls":5},{"$f":"1+$M$2","v":1.1499999999999999}]
[null,"TOTAL DO SERVIÇO - R$",{"$nulls":5},{"$f":"ROUND(H272*H273,2)","v":0.54}]
[]
[17,"CODEVASF",null,null," COMPOSIÇÃO DE PREÇO UNITÁRIO",null,null,null,{"$f":"H292","v":57.36999999999999},{"$f":"H294","v":70.75}]
[null,"OBRA:  ",{"$f":"$C$2","v":" PAVIMENTAÇÃO ASFÁLTICA EM CBUQ – AVENIDA SANITÁRIA (BONFIM / MG) - LOTE 3"},null,null,null,"DATA: ",{"$f":"$H$2","v":" AGOSTO / 2023   "}]
[null,"SERVIÇO:  ",{"$f":"VLOOKUP(A276,ORÇAMENTO!$A$10:$I$31,3)","v":"GUIA (MEIO-FIO) E SARJETA CONJUGADOS DE CONCRETO, MOLDADA  IN LOCO  EM TRECHO RETO COM EXTRUSORA, 45 CM BASE (15 CM BASE DA GUIA + 30 CM BASE DA SARJETA) X 22 CM ALTURA. AF_06/2016"},null,"SINAPI",{"$f":"VLOOKUP(A276,ORÇAMENTO!$A$10:$I$31,4)","v":94267},"UNIDADE: ",{"$f":"VLOOKUP(A276,ORÇAMENTO!$A$10:$I$31,5)","v":"M"}]
[]
[null,"TIPO ITEM","CODIGO ITEM","DESCRIÇÃO ITEM","UNIDADE ITEM","COEFICIENTE","PRECO UNITARIO","CUSTO TOTAL"]
[null,"INSUMO","370","AREIA MEDIA - POSTO JAZIDA/FORNECEDOR (RETIRADO NA JAZIDA, SEM TRANSPORTE)","M3","0,0150000","97,50",{"$f":"ROUNDDOWN(F281*G281,2)","v":1.46}]
[null,"INSUMO","34492","CONCRETO USINADO BOMBEAVEL, CLASSE DE RESISTENCIA C20, COM BRITA 0 E 1, SLUMP = 100 +/- 20 MM, EXCLUI SERVICO DE BOMBEAMENTO (NBR 8953)","M3","0,0630000","550,00",34.65]
[null,"COMPOSICAO","88243","AJUDANTE ESPECIALIZADO COM ENCARGOS COMPLEMENTARES","H","0,1090000","21,76",2.37]
[null,"COMPOSICAO","88309","PEDREIRO COM ENCARGOS COMPLEMENTARES","H","0,2440000","27,45",6.69]
[null,"COMPOSICAO","88316","SERVENTE COM ENCARGOS COMPLEMENTARES","H","0,4870000","19,76",9.6199999999999992]
[null,"COMPOSICAO","88631","ARGAMASSA TRAÇO 1:4 (EM VOLUME DE CIMENTO E AREIA MÉDIA ÚMIDA), PREPARO MANUAL. AF_08/2019","M3","0,0030000","575,87",1.72]
[null,"COMPOSICAO","92960","MÁQUINA EXTRUSORA DE CONCRETO PARA GUIAS E SARJETAS, MOTOR A DIESEL, POTÊNCIA 14 CV","CHP","0,0180000","18,74",0.33]
[null,"COMPOSICAO","92961","MÁQUINA EXTRUSORA DE CONCRETO PARA GUIAS E SARJETAS, MOTOR A DIESEL, POTÊNCIA 14 CV","CHI","0,0910000","5,89",0.53]
[{"$nulls":7},0]
[{"$nulls":7},0]
[null,"PRODUÇÃO DA EQUIPE",null,null,1,"CUSTO ",null,{"$f":"SUM(H281:H290)","v":57.36999999999999}]
[null,"TOTAL",{"$nulls":5},{"$f":"H291/E291","v":57.36999999999999},"OK"]
[null,"BDI                %",{"$nulls":5},{"$f":"1+$M$1","v":1.2332000000000001}]
[null,"TOTAL DO SERVIÇO - R$",{"$nulls":5},{"$f":"ROUND(H292*H293,2)","v":70.75}]
[]
[18,"CODEVASF",null,null," COMPOSIÇÃO DE PREÇO UNITÁRIO",null,null,null,{"$f":"H311","v":766.74},{"$f":"H313","v":945.54}]
[null,"OBRA:  ",{"$f":"$C$2","v":" PAVIMENTAÇÃO ASFÁLTICA EM CBUQ – AVENIDA SANITÁRIA (BONFIM / MG) - LOTE 3"},null,null,null,"DATA: ",{"$f":"$H$2","v":" AGOSTO / 2023   "}]
[null,"SERVIÇO:  ",{"$f":"VLOOKUP(A296,ORÇAMENTO!$A$10:$I$40,3)","v":"EXECUÇÃO DE PASSEIO (CALÇADA) OU PISO DE CONCRETO COM CONCRETO MOLDADO IN LOCO, ACABAMENTO CONVENCIONAL, NÃO ARMADO"},null,"SINAPI",{"$f":"VLOOKUP(A296,ORÇAMENTO!$A$10:$I$40,4)","v":94990},"UNIDADE: ",{"$f":"VLOOKUP(A296,ORÇAMENTO!$A$10:$I$40,5)","v":"M3"}]
[]
[null,"TIPO ITEM","CODIGO ITEM","DESCRIÇÃO ITEM","UNIDADE ITEM","COEFICIENTE","PRECO UNITARIO","CUSTO TOTAL"]
[null,"INSUMO","2692","DESMOLDANTE PROTETOR PARA FORMAS DE MADEIRA, DE BASE OLEOSA EMULSIONADA EM AGUA","L","0,0213000","5,86",{"$f":"ROUNDDOWN(F301*G301,2)","v":0.12}]
[null,"INSUMO","4509","SARRAFO *2,5 X 10* CM EM PINUS, MISTA OU EQUIVALENTE DA REGIAO - BRUTA","M","3,1250000","4,41",13.78]
[null,"INSUMO","4517","SARRAFO *2,5 X 7,5* CM EM PINUS, MISTA OU EQUIVALENTE DA REGIAO - BRUTA","M","2,5000000","3,04",7.6]
[null,"INSUMO","5068","PREGO DE ACO POLIDO COM CABECA 17 X 21 (2 X 11)","KG","0,2994000","19,23",5.75]
[null,"COMPOSICAO","88262","CARPINTEIRO DE FORMAS COM ENCARGOS COMPLEMENTARES","H","1,6268000","27,05",44]
[null,"COMPOSICAO","88309","PEDREIRO COM ENCARGOS COMPLEMENTARES","H","1,4149000","27,45",38.83]
[null,"COMPOSICAO","88316","SERVENTE COM ENCARGOS COMPLEMENTARES","H","3,0417000","19,76",60.1]
[null,"COMPOSICAO","94964","CONCRETO FCK = 20MPA, TRAÇO 1:2,7:3 (EM MASSA SECA DE CIMENTO/ AREIA MÉDIA/ BRITA 1)","M3","1,2315000","484,42",596.55999999999995]
[{"$nulls":7},0]
[null,"PRODUÇÃO DA EQUIPE",null,null,1,"CUSTO ",null,{"$f":"SUM(H301:H309)","v":766.74}]
[null,"TOTAL",{"$nulls":5},{"$f":"H310/E310","v":766.74},"OK"]
[null,"BDI                %",{"$nulls":5},{"$f":"1+$M$1","v":1.2332000000000001}]
[null,"TOTAL DO SERVIÇO - R$",{"$nulls":5},{"$f":"ROUND(H311*H312,2)","v":945.54}]
[]
[19,"CODEVASF",null,null," COMPOSIÇÃO DE PREÇO UNITÁRIO",null,null,null,{"$f":"H329","v":422.66},{"$f":"H331","v":521.22}]
[null,"OBRA:  ",{"$f":"$C$2","v":" PAVIMENTAÇÃO ASFÁLTICA EM CBUQ – AVENIDA SANITÁRIA (BONFIM / MG) - LOTE 3"},null,null,null,"DATA: ",{"$f":"$H$2","v":" AGOSTO / 2023   "}]
[null,"SERVIÇO:  ",{"$f":"VLOOKUP(A315,ORÇAMENTO!$A$10:$I$38,3)","v":"FORNECIMENTO E INSTALAÇÃO DE PLACA DE SINALIZAÇÃO VIÁRIA - REGULAMENTAÇÃO (FAIXA DE PEDESTRE E OUTROS)"},null,"SINAPI",{"$f":"VLOOKUP(A315,ORÇAMENTO!$A$10:$I$42,4)","v":"CPU.4"},"UNIDADE: ",{"$f":"VLOOKUP(A315,ORÇAMENTO!$A$10:$I$42,5)","v":"UN."}]
[]
[null,"TIPO ITEM","CODIGO ITEM","DESCRIÇÃO ITEM","UNIDADE ITEM","COEFICIENTE","PRECO UNITARIO","CUSTO TOTAL"]
[null,"COMPOSICAO",94962,"CONCRETO MAGRO PARA LASTRO, TRAÇO 1:4,5:4,5 (EM MASSA SECA DE CIMENTO/ AREIA MÉDIA/ BRITA 1)","M3",2.4E-2,397.46,{"$f":"ROUNDDOWN(F320*G320,2)","v":9.5299999999999994}]
[null,"COMPOSICAO",93358,"ESCAVAÇÃO MANUAL DE VALA COM PROFUNDIDADE MENOR OU IGUAL A 1,30 M","M3",2.4E-2,78.17,1.87]
[null,"COMPOSICAO",88309,"PEDREIRO COM ENCARGOS COMPLEMENTARES","H",0.2,27.45,5.49]
[null,"COMPOSICAO",88316,"SERVENTE COM ENCARGOS COMPLEMENTARES","H",1,19.760000000000002,19.760000000000002]
[null,"COMPOSICAO",103670,"LANÇAMENTO COM USO DE BALDES, ADENSAMENTO E ACABAMENTO DE CONCRETO EM ESTRUTURAS","M3",2.4E-2,281.66000000000003,6.75]
[null,"INSUMO",34723,"PLACA DE SINALIZACAO EM CHAPA DE ACO NUM 16 COM PINTURA REFLETIVA (CIRCULAR - D=50CM) ","M2",{"$f":"3.14*0.5*0.5/4","v":0.19625000000000001},577.5,113.33]
[null,"INSUMO",21013,"TUBO AÇO GALVANIZADO COM COSTURA, CLASSE LEVE, DN 50 MM ( 2\")E = 3,00 MM, *4,40* KG/M ","M",3.5,75.98,265.93]
[{"$nulls":7},0]
[null,"PRODUÇÃO DA EQUIPE",null,null,1,"CUSTO ",null,{"$f":"SUM(H320:H326)","v":422.66}]
[null,"TOTAL",{"$nulls":5},{"$f":"H328/E328","v":422.66},"OK"]
[null,"BDI                %",{"$nulls":5},{"$f":"1+$M$1","v":1.2332000000000001}]
[null,"TOTAL DO SERVIÇO - R$",{"$nulls":5},{"$f":"ROUND(H329*H330,2)","v":521.22}]
[]
[20,"CODEVASF",null,null," COMPOSIÇÃO DE PREÇO UNITÁRIO",null,null,null,{"$f":"H347","v":25.499999999999996},{"$f":"H349","v":31.45}]
[null,"OBRA:  ",{"$f":"$C$2","v":" PAVIMENTAÇÃO ASFÁLTICA EM CBUQ – AVENIDA SANITÁRIA (BONFIM / MG) - LOTE 3"},null,null,null,"DATA: ",{"$f":"$H$2","v":" AGOSTO / 2023   "}]
[null,"SERVIÇO:  ",{"$f":"VLOOKUP(A333,ORÇAMENTO!$A$10:$I$38,3)","v":"PINTURA DE FAIXA DE PEDESTRE OU ZEBRADA TINTA RETRORREFLETIVA A BASE DE RESINA ACRÍLICA COM MICROESFERAS DE VIDRO, E = 30 CM, APLICAÇÃO MANUAL"},null,"SINAPI",{"$f":"VLOOKUP(A333,ORÇAMENTO!$A$10:$I$42,4)","v":102509},"UNIDADE: ","UN."]
[]
[null,"TIPO ITEM","CODIGO ITEM","DESCRIÇÃO ITEM","UNIDADE ITEM","COEFICIENTE","PRECO UNITARIO","CUSTO TOTAL"]
[null,"INSUMO","5318","DILUENTE AGUARRAS","L","0,0210000","26,76",{"$f":"ROUNDDOWN(F338*G338,2)","v":0.56000000000000005}]
[null,"INSUMO","7343","TINTA ACRILICA A BASE DE SOLVENTE, PARA SINALIZACAO HORIZONTAL VIARIA (NBR 11862)","L","0,4270000","17,71",7.56]
[null,"INSUMO","12815","FITA CREPE ROLO DE 25 MM X 50 M","UN","0,0120000","9,31",0.11]
[null,"INSUMO","44477","MICROESFERAS DE VIDRO PARA SINALIZACAO HORIZONTAL VIARIA, TIPO II-A (DROP-ON)","KG","0,2500000","10,74",2.68]
[null,"INSUMO","44478","MICROESFERAS DE VIDRO PARA SINALIZACAO HORIZONTAL VIARIA, TIPO I-B (PREMIX) ","KG","0,1100000","10,74",1.18]
[null,"COMPOSICAO","88310","PINTOR COM ENCARGOS COMPLEMENTARES","H","0,3640000","28,66",10.43]
[null,"COMPOSICAO","88316","SERVENTE COM ENCARGOS COMPLEMENTARES","H","0,1510000","19,76",2.98]
[{"$nulls":7},0]
[null,"PRODUÇÃO DA EQUIPE",null,null,1,"CUSTO ",null,{"$f":"SUM(H338:H345)","v":25.499999999999996}]
[null,"TOTAL",{"$nulls":5},{"$f":"H346/E346","v":25.499999999999996},"OK"]
[null,"BDI                %",{"$nulls":5},{"$f":"1+$M$1","v":1.2332000000000001}]
[null,"TOTAL DO SERVIÇO - R$",{"$nulls":5},{"$f":"ROUND(H347*H348,2)","v":31.45}]
[]
[22,"CODEVASF",null,null," COMPOSIÇÃO DE PREÇO UNITÁRIO",null,null,null,{"$f":"H365","v":5.5500000000000007},{"$f":"H367","v":6.84}]
[null,"OBRA:  ",{"$f":"$C$2","v":" PAVIMENTAÇÃO ASFÁLTICA EM CBUQ – AVENIDA SANITÁRIA (BONFIM / MG) - LOTE 3"},null,null,null,"DATA: ",{"$f":"$H$2","v":" AGOSTO / 2023   "}]
[null,"SERVIÇO:  ",{"$f":"VLOOKUP(A351,ORÇAMENTO!$A$10:$I$38,3)","v":"PINTURA DE EIXO VIÁRIO SOBRE ASFALTO COM TINTA RETRORREFLETIVA A BASE DE RESINA ACRÍLICA COM MICROESFERAS DE VIDRO, APLICAÇÃO MECÂNICA COM DEMARCADORA AUTOPROPELIDA - ESPESSURA DE 0,10 MM"},null,"SINAPI",{"$f":"VLOOKUP(A351,ORÇAMENTO!$A$10:$I$42,4)","v":102512},"UNIDADE: ",{"$f":"VLOOKUP(A351,ORÇAMENTO!$A$10:$I$42,5)","v":"M"}]
[]
[null,"TIPO ITEM","CODIGO ITEM","DESCRIÇÃO ITEM","UNIDADE ITEM","COEFICIENTE","PRECO UNITARIO","CUSTO TOTAL"]
[null,"INSUMO","5318","DILUENTE AGUARRAS","L","0,0020000","26,76",{"$f":"ROUNDDOWN(F356*G356,2)","v":0.05}]
[null,"INSUMO","7343","TINTA ACRILICA A BASE DE SOLVENTE, PARA SINALIZACAO HORIZONTAL VIARIA (NBR 11862)","L","0,0430000","17,71",0.76]
[null,"INSUMO","44477","MICROESFERAS DE VIDRO PARA SINALIZACAO HORIZONTAL VIARIA, TIPO II-A (DROP-ON)","KG","0,0250000","10,74",0.26]
[null,"INSUMO","44478","MICROESFERAS DE VIDRO PARA SINALIZACAO HORIZONTAL VIARIA, TIPO I-B (PREMIX)","KG","0,0110000","10,74",0.11]
[null,"COMPOSICAO","88310","PINTOR COM ENCARGOS COMPLEMENTARES","H","0,0340000","28,66",0.97]
[null,"COMPOSICAO","88316","SERVENTE COM ENCARGOS COMPLEMENTARES","H","0,0140000","19,76",0.27]
[null,"COMPOSICAO","95133","MÁQUINA DEMARCADORA DE FAIXA DE TRÁFEGO À FRIO, AUTOPROPELIDA, POTÊNCIA 38 HP","CHP","0,0003000","173,43",0.05]
[null,"COMPOSICAO","96159","MÁQUINA DEMARCADORA DE FAIXA DE TRÁFEGO À FRIO, AUTOPROPELIDA, POTÊNCIA 38 HP","CHI","0,0334000","92,42",3.08]
[null,"PRODUÇÃO DA EQUIPE",null,null,1,"CUSTO ",null,{"$f":"SUM(H356:H363)","v":5.5500000000000007}]
[null,"TOTAL",{"$nulls":5},{"$f":"H364/E364","v":5.5500000000000007},"OK"]
[null,"BDI                %",{"$nulls":5},{"$f":"1+$M$1","v":1.2332000000000001}]
[null,"TOTAL DO SERVIÇO - R$",{"$nulls":5},{"$f":"ROUND(H365*H366,2)","v":6.84}]
[]
[23,"CODEVASF",null,null," COMPOSIÇÃO DE PREÇO UNITÁRIO",null,null,null,{"$f":"H376","v":2812.65},{"$f":"H378","v":3234.55}]
[null,"OBRA:  ",{"$f":"$C$2","v":" PAVIMENTAÇÃO ASFÁLTICA EM CBUQ – AVENIDA SANITÁRIA (BONFIM / MG) - LOTE 3"},null,null,null,"DATA: ",{"$f":"$H$2","v":" AGOSTO / 2023   "}]
[null,"SERVIÇO:  ",{"$f":"VLOOKUP(A369,ORÇAMENTO!$A$10:$I$47,3)","v":"AQUISIÇÃO DE EMULSÃO ASFÁLTICA PARA IMPRIMAÇÃO (EAI) - EXCLUSIVE TRANSPORTE"},null,"SEINFRA",{"$f":"VLOOKUP(A369,ORÇAMENTO!$A$10:$I$47,4)","v":"CPU.7"},"UNIDADE: ",{"$f":"VLOOKUP(A369,ORÇAMENTO!$A$10:$I$47,5)","v":"T"}]
[]
[null,"TIPO ITEM","CODIGO ITEM","DESCRIÇÃO ITEM","UNIDADE ITEM","COEFICIENTE","PRECO UNITARIO","CUSTO TOTAL"]
[null,"INSUMO","ANP","EMULSÃO ASFÁLTICA PARA SERVIÇO DE IMPRIMAÇÃO (CUSTO ANP, INCLUINDO ICMS 18%)","T",1,{"$f":"2.30638*1000*1.2195122","v":2812.6585478359998},{"$f":"ROUNDDOWN(F374*G374,2)","v":2812.65}]
[null,"PRODUÇÃO DA EQUIPE",null,null,1,"CUSTO ",null,{"$f":"SUM(H374:H374)","v":2812.65}]
[null,"TOTAL",{"$nulls":5},{"$f":"H375/E375","v":2812.65}]
[null,"BDI                %",{"$nulls":5},{"$f":"1+$M$2","v":1.1499999999999999}]
[null,"TOTAL DO SERVIÇO - R$",{"$nulls":5},{"$f":"ROUND(H376*H377,2)","v":3234.55},"OK"]
[]
[24,"CODEVASF",null,null," COMPOSIÇÃO DE PREÇO UNITÁRIO",null,null,null,{"$f":"H387","v":2736.39},{"$f":"H389","v":3146.85}]
[null,"OBRA:  ",{"$f":"$C$2","v":" PAVIMENTAÇÃO ASFÁLTICA EM CBUQ – AVENIDA SANITÁRIA (BONFIM / MG) - LOTE 3"},null,null,null,"DATA: ",{"$f":"$H$2","v":" AGOSTO / 2023   "}]
[null,"SERVIÇO:  ",{"$f":"VLOOKUP(A380,ORÇAMENTO!$A$10:$I$47,3)","v":"AQUISIÇÃO DE EMULSAO ASFALTICA CATIONICA RR-1C - EXCLUSIVE TRANSPORTE"},null,"SINAPI",{"$f":"VLOOKUP(A380,ORÇAMENTO!$A$10:$I$47,4)","v":"CPU.8"},"UNIDADE: ",{"$f":"VLOOKUP(A380,ORÇAMENTO!$A$10:$I$47,5)","v":"T"}]
[]
[null,"TIPO ITEM","CODIGO ITEM","DESCRIÇÃO ITEM","UNIDADE ITEM","COEFICIENTE","PRECO UNITARIO","CUSTO TOTAL"]
[null,"INSUMO","ANP","EMULSÃO ASFÁLTICA CATIÔNICA RR-1C(CUSTO ANP, INCLUINDO ICMS 18%)","T",1,{"$f":"2.24384*1.2195122*1000","v":2736.390254848},{"$f":"ROUNDDOWN(F385*G385,2)","v":2736.39}]
[null,"PRODUÇÃO DA EQUIPE",null,null,1,"CUSTO ",null,{"$f":"SUM(H385:H385)","v":2736.39}]
[null,"TOTAL",{"$nulls":5},{"$f":"H386/E386","v":2736.39},"OK"]
[null,"BDI                %",{"$nulls":5},{"$f":"1+$M$2","v":1.1499999999999999}]
[null,"TOTAL DO SERVIÇO - R$",{"$nulls":5},{"$f":"ROUND(H387*H388,2)","v":3146.85}]
[]
[25,"CODEVASF",null,null," COMPOSIÇÃO DE PREÇO UNITÁRIO",null,null,null,{"$f":"H398","v":535},{"$f":"H400","v":615.25}]
[null,"OBRA:  ",{"$f":"$C$2","v":" PAVIMENTAÇÃO ASFÁLTICA EM CBUQ – AVENIDA SANITÁRIA (BONFIM / MG) - LOTE 3"},null,null,null,"DATA: ",{"$f":"$H$2","v":" AGOSTO / 2023   "}]
[null,"SERVIÇO:  ",{"$f":"VLOOKUP(A391,ORÇAMENTO!$A$10:$I$47,3)","v":"AQUISIÇÃO DE CONCRETO BETUMINOSO USINADO A QUENTE (CBUQ) PARA PAVIMENTACAO ASFALTICA, PADRAO DNIT, FAIXA C, COM CAP 50/70 - EXCLUSIVE TRANSPORTE"},null,"SINAPI",{"$f":"VLOOKUP(A391,ORÇAMENTO!$A$10:$I$47,4)","v":"CPU.9"},"UNIDADE: ",{"$f":"VLOOKUP(A391,ORÇAMENTO!$A$10:$I$47,5)","v":"T"}]
[]
[null,"TIPO ITEM","CODIGO ITEM","DESCRIÇÃO ITEM","UNIDADE ITEM","COEFICIENTE","PRECO UNITARIO","CUSTO TOTAL"]
[null,"INSUMO",1518,"CONCRETO BETUMINOSO USINADO A QUENTE (CBUQ) PARA PAVIMENTACAO ASFALTICA, PADRAO DNIT, FAIXA C, COM CAP 50/70 - AQUISICAO POSTO USINA","T",1,535,{"$f":"ROUNDDOWN(F396*G396,2)","v":535}]
[null,"PRODUÇÃO DA EQUIPE",null,null,1,"CUSTO ",null,{"$f":"SUM(H396:H396)","v":535}]
[null,"TOTAL",{"$nulls":5},{"$f":"H397/E397","v":535},"OK"]
[null,"BDI                %",{"$nulls":5},{"$f":"1+$M$2","v":1.1499999999999999}]
[null,"TOTAL DO SERVIÇO - R$",{"$nulls":5},{"$f":"ROUND(H398*H399,2)","v":615.25}]

{"sheet":"BDI SERV","index":2,"n_rows":37,"n_cols":20,"rows_kept":37,"cut":false,"hidden":false,"merged":[[31,1,31,2],[32,0,34,5],[36,0,36,5],[0,1,2,4],[3,1,4,1],[3,2,4,2],[28,0,28,5],[30,1,30,2]]}
[null,"DETALHAMENTO DO BDI - SERVIÇOS"]
[]
[]
[null,"Item","Descrição dos Serviços","%","%"]
[null,null,null,"PV","CD"]
[]
[null,1,"ADMINISTRAÇÃO CENTRAL"," ",4.01]
[null,"1.1","ESCRITÓRIO CENTRAL"," "," "]
[null,"1.2","VIAGENS"," "," "]
[null,"1.3","OUTROS"," "," "]
[null," "," "," "," "]
[null,2,"IMPOSTOS E TAXAS",{"$f":"SUM(D13:D16)","v":7.65},{"$f":"SUM(E13:E16)","v":9.57}]
[null,"2.1","ISS (*)",{"$f":"5*0.8","v":4},{"$f":"ROUND(D13*1.2515,2)","v":5.01}]
[null,"2.2","PIS",0.65,{"$f":"ROUND(D14*1.2515,2)","v":0.81}]
[null,"2.3","Cofins",3,{"$f":"ROUND(D15*1.2515,2)","v":3.75}]
[null,"2.4","CONTRIBUIÇÃO PREVIDENCIÁRIA SOBRE A RENDA BRUTA",0,{"$f":"ROUND(D16*1.2515,2)","v":0}]
[]
[null,3,"TAXA DE RISCO"," ",{"$f":"SUM(E19:E22)","v":0.96}]
[null,"3.1","SEGURO",null,0.2]
[null,"3.2","RISCO",null,0.56000000000000005]
[null,"3.3","GARANTIA",null,0.2]
[{"$nulls":19},{"$f":"1/0.82","v":1.2195121951219512}]
[null,4,"DESPESAS FINANCEIRAS"," ",1.1100000000000001]
[]
[null,5,"LUCRO",null,7.3]
[]
[null," ","BDI - CALCULADO"," ",{"$f":"ROUND((((1+(E7+E18)/100)*(1+E23/100)*(1+E25/100)/(1-D12/100)-1)*100),2)","v":23.32}]
[]
["BDI = ((1+((AC+S+R+G)/100))x(1+DF/100)x(1+L/100)/(1-I/100)-1)*100"]
[]
[null,"BDI (CALCULADO):",null,{"$f":"ROUND((((1+((E7+E18)/100))*(1+E23/100)*(1+E25/100))/(1-D12/100)-1)*100,2)","v":23.32},"%"]
[null," "]
["(*) ISS CONFORME LEI COMPLEMENTAR Nº 016/2005 - CONSIDERANDO A DEDUÇÃO DOS MATERIAIS PREVISTOS NO ART. 115 (QUANT. ESTIMADA: 20%)"]
[]
[]
[]
["BDI EM CONFORMIDADE COM OS ACÓRDÃOS Nº 2369/2011 e ACÓRDÃO Nº 2.622/2013 - TCU - PLENÁRIO"]

{"sheet":"BDI FORN","index":3,"n_rows":37,"n_cols":5,"rows_kept":37,"cut":false,"hidden":false,"merged":[[31,1,31,2],[32,0,34,5],[36,0,36,5],[0,1,2,4],[3,1,4,1],[3,2,4,2],[28,0,28,5],[30,1,30,2]]}
[null,"DETALHAMENTO DO BDI - FORNECIMENTO \n(MATERIAL ASFÁLTICO)"]
[]
[]
[null,"Item","Descrição dos Serviços","%","%"]
[null,null,null,"PV","CD"]
[]
[null,1,"ADMINISTRAÇÃO CENTRAL"," ",3.72]
[null,"1.1","ESCRITÓRIO CENTRAL"," "," "]
[null,"1.2","VIAGENS"," "," "]
[null,"1.3","OUTROS"," "," "]
[null," "," "," "," "]
[null,2,"IMPOSTOS E TAXAS",{"$f":"SUM(D13:D16)","v":3.65},{"$f":"SUM(E13:E16)","v":4.5600000000000005}]
[null,"2.1","ISS (*)",null,{"$f":"ROUND(D13*1.2515,2)","v":0}]
[null,"2.2","PIS",0.65,{"$f":"ROUND(D14*1.2515,2)","v":0.81}]
[null,"2.3","Cofins",3,{"$f":"ROUND(D15*1.2515,2)","v":3.75}]
[null,"2.4","CONTRIBUIÇÃO PREVIDENCIÁRIA SOBRE A RENDA BRUTA",0,{"$f":"ROUND(D16*1.2515,2)","v":0}]
[]
[null,3,"TAXA DE RISCO"," ",{"$f":"SUM(E19:E22)","v":0.82000000000000006}]
[null,"3.1","SEGURO",null,0.16]
[null,"3.2","RISCO",null,0.5]
[null,"3.3","GARANTIA",null,0.16]
[]
[null,4,"DESPESAS FINANCEIRAS"," ",0.94]
[]
[null,5,"LUCRO",null,5]
[]
[null," ","BDI - CALCULADO"," ",{"$f":"ROUND((((1+(E7+E18)/100)*(1+E23/100)*(1+E25/100)/(1-D12/100)-1)*100),2)","v":15}]
[]
["BDI = ((1+((AC+S+R+G)/100))x(1+DF/100)x(1+L/100)/(1-I/100)-1)*100"]
[]
[null,"BDI (CALCULADO):",null,{"$f":"ROUND((((1+((E7+E18)/100))*(1+E23/100)*(1+E25/100))/(1-D12/100)-1)*100,2)","v":15},"%"]
[null," "]
[]
[]
[]
[]
["BDI EM CONFORMIDADE COM OS ACÓRDÃOS Nº 2369/2011 e ACÓRDÃO Nº 2.622/2013 - TCU - PLENÁRIO"]

{"sheet":"CRONOGRAMA","index":4,"n_rows":21,"n_cols":10,"rows_kept":21,"cut":false,"hidden":false,"merged":[[0,1,0,9],[1,1,2,1],[1,2,2,4],[1,6,1,9],[2,6,2,9],[3,1,3,8],[5,0,6,0],[5,1,6,1],[5,2,6,2],[7,0,8,0],[7,1,8,1],[7,2,8,2],[9,0,10,0],[9,1,10,1],[9,2,10,2],[11,0,12,0],[11,1,12,1],[11,2,12,2],[17,1,18,2],[20,1,24,9],[13,0,14,0],[13,1,14,1],[13,2,14,2],[15,0,16,0],[15,1,16,1],[15,2,16,2]]}
[null,"CRONOGRAMA FÍSICO-FINANCEIRO"]
[null,"OBRA: ",{"$f":"ORÇAMENTO!C5","v":" PAVIMENTAÇÃO ASFÁLTICA EM CBUQ – AVENIDA SANITÁRIA (BONFIM / MG) - LOTE 3"},null,null,"VALOR:",{"$f":"ORÇAMENTO!I40","v":982418.29}]
[{"$nulls":5},"PRAZO: ","120 DIAS "]
[]
[null,"ITEM","ETAPAS/DESCRIÇAO","FISICO/  FINANCEIRO","TOTAL    ETAPAS","MÊS 1","MÊS 2","MÊS 3","MÊS 4","TOTAL"]
["A",{"$f":"VLOOKUP(A6,ORÇAMENTO!$A$9:$I$40,2)","v":1},{"$f":"VLOOKUP(A6,ORÇAMENTO!$A$9:$I$40,3)","v":"SERVIÇOS PRELIMINARES "},"FISICO ",{"$f":"ROUND(E7/$G$2,4)","v":0.12720000000000001},0.25,0.25,0.25,0.25,{"$f":"SUM(F6:I6)","v":1}]
[null,null,null,"FINANCEIRO",{"$f":"ORÇAMENTO!I9","v":125004.35},{"$f":"ROUND($E$7*F6,2)","v":31251.09},31251.09,31251.09,31251.09,{"$f":"SUM(F7:I7)","v":125004.36}]
["B",{"$f":"VLOOKUP(A8,ORÇAMENTO!$A$9:$I$40,2)","v":2},{"$f":"VLOOKUP(A8,ORÇAMENTO!$A$9:$I$40,3)","v":"TERRAPLANAGEM E PAVIMENTAÇÃO"},"FISICO ",{"$f":"ROUND(E9/$G$2,4)","v":0.27689999999999998},0.2,0.4,0.4,0,{"$f":"SUM(F8:I8)","v":1}]
[null,null,null,"FINANCEIRO",{"$f":"ORÇAMENTO!I15","v":272070.69},{"$f":"ROUND($E$9*F8,2)","v":54414.14},108828.28,108828.28,0,{"$f":"SUM(F9:I9)","v":272070.69999999995}]
["C",{"$f":"VLOOKUP(A10,ORÇAMENTO!$A$9:$I$40,2)","v":3},{"$f":"VLOOKUP(A10,ORÇAMENTO!$A$9:$I$40,3)","v":"TRANSPORTE DE MATERIAIS"},"FISICO ",{"$f":"ROUND(E11/$G$2,4)","v":0.1065},0.2,0.3,0.3,0.2,{"$f":"SUM(F10:I10)","v":1}]
[null,null,null,"FINANCEIRO",{"$f":"ORÇAMENTO!I24","v":104665},{"$f":"ROUND($E$11*F10,2)","v":20933},31399.5,31399.5,20933,{"$f":"SUM(F11:I11)-0.04","v":104664.96000000001}]
["D",{"$f":"VLOOKUP(A12,ORÇAMENTO!$A$9:$I$40,2)","v":4},{"$f":"VLOOKUP(A12,ORÇAMENTO!$A$9:$I$40,3)","v":"TRANSPORTE DE MATERIAL ASFÁLTICO (BDI DIFERENCIADO)"},"FISICO ",{"$f":"ROUND(E13/$G$2,4)","v":2.3199999999999998E-2},0.2,0.4,0.4,0,{"$f":"SUM(F12:I12)","v":1}]
[null,null,null,"FINANCEIRO",{"$f":"ORÇAMENTO!I27","v":22824},{"$f":"ROUND($E$13*F12,2)","v":4564.8},9129.6,9129.6,0,{"$f":"SUM(F13:I13)-0.02","v":22823.98}]
["E",{"$f":"VLOOKUP(A14,ORÇAMENTO!$A$9:$I$40,2)","v":5},{"$f":"VLOOKUP(A14,ORÇAMENTO!$A$9:$I$40,3)","v":"OBRAS COMPLEMENTARES"},"FISICO ",{"$f":"ROUND(E15/$G$2,4)","v":0.21870000000000001},0,0.2,0.4,0.4,{"$f":"SUM(F14:I14)","v":1}]
[null,null,null,"FINANCEIRO",{"$f":"ORÇAMENTO!I30","v":214881.32},{"$f":"ROUND($E$15*F14,2)","v":0},42976.26,85952.53,85952.53,{"$f":"SUM(F15:I15)-0.02","v":214881.30000000002}]
["F",{"$f":"VLOOKUP(A16,ORÇAMENTO!$A$9:$I$40,2)","v":6},{"$f":"VLOOKUP(A16,ORÇAMENTO!$A$9:$I$40,3)","v":"FORNECIMENTOS - MATERIAL ASFÁLTICO (BDI DIFERENCIADO)"},"FISICO ",{"$f":"ROUND(E17/$G$2,4)","v":0.24729999999999999},0.2,0.4,0.4,0,{"$f":"SUM(F16:I16)","v":1}]
[null,null,null,"FINANCEIRO",{"$f":"ORÇAMENTO!I36","v":242972.93},{"$f":"ROUND($E$17*F16,2)","v":48594.59},97189.17,97189.17,0,{"$f":"SUM(F17:I17)-0.02","v":242972.91}]
[null,"TOTAL",null,"FISICO ",{"$f":"SUM(F18:I18)","v":1.0000000203579273},{"$f":"F19/$E$19","v":0.16261669965448219},0.32651458473966322,0.37025997347830325,0.14060876248547854,{"$f":"SUM(F18:I18)","v":1.0000000203579273}]
[null,null,null,"FINANCEIRO",{"$f":"E11+E9+E7+E13+E17+E15","v":982418.29},159757.62,320773.90000000002,363750.17000000004,138136.62,{"$f":"SUM(F19:I19)-0.02","v":982418.29}]
[]
[null,"OBSERVAÇÕES:"]