{"text_format":"2","workbook":"xlsx","n_sheets":5,"sheets":["ORÇAMENTO","CPU","BDI SERV","BDI FORN","CRONOGRAMA"],"not_rendered":{"charts":0,"images":4,"macros":0,"external_links":0,"defined_names":5,"comments":1,"pivot_tables":0},"unopened":[],"bounds":{"document_bytes":16777216,"sheet_cells":100000,"run_cost":"one","rows_first":2000,"rows_last":500,"rows_between":2000,"halvings":0,"cell_chars":16384,"cell_head_chars":4096},"cells_cut":0,"cells_raw":0,"read":"whole","date_system":"1900"}

{"sheet":"ORÇAMENTO","index":0,"n_rows":38,"n_cols":15,"rows_kept":38,"cut":false,"hidden":false,"merged":[[36,1,36,2],[0,0,7,0],[0,2,0,8],[1,2,1,8],[2,2,2,8],[4,2,4,8],[5,6,5,7],[6,1,6,2],[6,6,6,7]]}
["<---- NUMERAR SERVIÇOS PARA CPU",null,"Ministério do Desenvolvimento Regional"]
[null,null,"Companhia de Desenvolvimento dos Vales do São Francisco e do Parnaíba"]
[null,null,"1ª Superintendência Regional"]
[]
[null,"OBRA: "," PAVIMENTAÇÃO ASFÁLTICA EM CBUQ - VIAS DIVERSAS – BAIRRO MAJOR SALVO (CORINTO / MG)"]
[null,"DATA:"," SETEMBRO / 2023   ",null,null,null,"BDI Serviços:",null,{"$f":"'BDI SERV'!D31/100","v":0.23319999999999999}]
[null,"PRAZO DE EXECUÇÃO:     180 DIAS",{"$nulls":4},"BDI Serviços:",null,{"$f":"'BDI FORN'!D31/100","v":0.15}]
[null,"ITEM","DESCRIÇÃO","REFER.","UNID.","QUANT.","P. UNITÁRIO","P.UNIT.C/ BDI","P. TOTAL"]
["A",1,"SERVIÇOS PRELIMINARES ",{"$nulls":5},{"$f":"SUM(I10:I14)","v":331226.01}]
[1,"1.1","MOBILIZAÇÃO E DESMOBILIZAÇÃO","CPU.1","GL",1,{"$f":"VLOOKUP(A10,CPU!$A$1:$N$4668,9)","v":17758.32},{"$f":"VLOOKUP(A10,CPU!$A$1:$N$4668,10)","v":21899.56},{"$f":"ROUND(F10*H10,2)","v":21899.56},{"$nulls":5},{"$f":"I10-K10","v":21899.56}]
[2,"1.2","ADMINISTRAÇÃO LOCAL","CPU.2","GL",1,{"$f":"VLOOKUP(A11,CPU!$A$1:$N$4668,9)","v":193404.12},{"$f":"VLOOKUP(A11,CPU!$A$1:$N$4668,10)","v":238505.96},{"$f":"ROUND(F11*H11,2)","v":238505.96},{"$nulls":5},238505.96]
[3,"1.3","CANTEIRO DE OBRAS","CPU.3","GL",3,{"$f":"VLOOKUP(A12,CPU!$A$1:$N$4668,9)","v":13801.5},{"$f":"VLOOKUP(A12,CPU!$A$1:$N$4668,10)","v":17020.009999999998},{"$f":"ROUND(F12*H12,2)","v":51060.03},{"$nulls":5},51060.03]
[4,"1.4","PLACA DE OBRA EM CHAPA DE AÇO GALVANIZADO",103689,"M2",9,{"$f":"VLOOKUP(A13,CPU!$A$1:$N$4668,9)","v":339.72},{"$f":"VLOOKUP(A13,CPU!$A$1:$N$4668,10)","v":418.94},{"$f":"ROUND(F13*H13,2)","v":3770.46},{"$nulls":5},3770.46]
[5,"1.5","SERVIÇOS TOPOGRÁFICOS PARA PAVIMENTAÇÃO, INCLUSIVE NOTA DE SERVIÇO, ACOMPANHAMENTO E GREIDE",78472,"M2",39000,{"$f":"VLOOKUP(A14,CPU!$A$1:$N$4668,9)","v":0.32999999999999996},{"$f":"VLOOKUP(A14,CPU!$A$1:$N$4668,10)","v":0.41},{"$f":"ROUND(F14*H14,2)","v":15990},{"$nulls":5},15990]
["B",2,"TERRAPLANAGEM E PAVIMENTAÇÃO",{"$nulls":5},{"$f":"SUM(I16:I22)","v":621389.30000000005},{"$nulls":5},621389.30000000005]
[6,"2.1","ESCAVAÇÃO HORIZONTAL EM SOLO DE 1A CATEGORIA ",101116,"M3",5850.0000000000009,{"$f":"VLOOKUP(A16,CPU!$A$1:$N$4668,9)","v":2.0300000000000002},{"$f":"VLOOKUP(A16,CPU!$A$1:$N$4668,10)","v":2.5},{"$f":"ROUND(F16*H16,2)","v":14625},{"$nulls":5},14625]
[7,"2.2","CARGA, MANOBRA E DESCARGA DE SOLOS E MATERIAIS GRANULARES EM CAMINHÃO BASCULANTE",100976,"M3",5850.0000000000009,{"$f":"VLOOKUP(A17,CPU!$A$1:$N$4668,9)","v":7.99},{"$f":"VLOOKUP(A17,CPU!$A$1:$N$4668,10)","v":9.85},57622.5,{"$nulls":5},57622.5]
[8,"2.3","REGULARIZAÇÃO E COMPACTAÇÃO DO SUBLEITO ",100576,"M2",39000,{"$f":"VLOOKUP(A18,CPU!$A$1:$N$4668,9)","v":2.5299999999999998},{"$f":"VLOOKUP(A18,CPU!$A$1:$N$4668,10)","v":3.12},121680,{"$nulls":5},121680]
[9,"2.4","EXECUÇÃO E COMPACTAÇÃO DE BASE E OU SUB BASE PARA PAVIMENTAÇÃO DE SOLOS DE COMPORTAMENTO LATERÍTICO - EXCLUSIVE SOLO, ESCAVAÇÃO, CARGA E TRANSPORTE",96388,"M3",5850.0000000000009,{"$f":"VLOOKUP(A19,CPU!$A$1:$N$4668,9)","v":11.61},{"$f":"VLOOKUP(A19,CPU!$A$1:$N$4668,10)","v":14.32},83772,{"$nulls":5},83772]
[10,"2.5","IMPRIMAÇÃO COM EMULSÃO ASFÁLTICA (EAI)",96401,"M2",39000,{"$f":"VLOOKUP(A20,CPU!$A$1:$N$4668,9)","v":1.1200000000000001},{"$f":"VLOOKUP(A20,CPU!$A$1:$N$4668,10)","v":1.38},53820,{"$nulls":5},53820]
[11,"2.6","PINTURA DE LIGAÇÃO COM EMULSÃO ASFÁLTICA RR-1C",96402,"M2",33500,{"$f":"VLOOKUP(A21,CPU!$A$1:$N$4668,9)","v":0.93000000000000016},{"$f":"VLOOKUP(A21,CPU!$A$1:$N$4668,10)","v":1.1499999999999999},38525,{"$nulls":5},38525]
[12,"2.7","EXECUÇÃO DE PAVIMENTO COM APLICAÇÃO DE CONCRETO ASFÁLTICO USINADO A QUENTE (CBUQ), CAMADA DE ROLAMENTO - EXCLUSIVE TRANSPORTE",95995,"M3",1680.0000000000002,{"$f":"VLOOKUP(A22,CPU!$A$1:$N$4668,9)","v":121.32},{"$f":"VLOOKUP(A22,CPU!$A$1:$N$4668,10)","v":149.61000000000001},251344.8,{"$nulls":5},251344.8]
["C",3,"TRANSPORTE DE MATERIAIS",{"$nulls":5},{"$f":"SUM(I24:I27)","v":171736.99},{"$nulls":5},171736.99]
[13,"3.1","TRANSPORTE COM CAMINHÃO BASCULANTE, EM VIA URBANA PAVIMENTADA",95427,"M3XKM",140000.00159999999,{"$f":"VLOOKUP(A24,CPU!$A$1:$N$4668,9)","v":0.64999999999999991},{"$f":"VLOOKUP(A24,CPU!$A$1:$N$4668,10)","v":0.8},{"$f":"ROUND(F24*H24,2)","v":112000},{"$nulls":5},112000]
[13.5,"3.2","TRANSPORTE COM CAMINHÃO BASCULANTE, EM VIA URBANA EM REVESTIMENTO PRIMÁRIO",95426,"M3XKM",40000.000000000007,{"$f":"VLOOKUP(A25,CPU!$A$1:$N$4668,9)","v":0.96},{"$f":"VLOOKUP(A25,CPU!$A$1:$N$4668,10)","v":1.18},{"$f":"ROUND(F25*H25,2)","v":47200}]
[14,"3.3","TRANSPORTE COM CAMINHÃO CARROCERIA 9T, EM VIA URBANA PAVIMENTADA",100947,"TXKM",2099.9960223999997,{"$f":"VLOOKUP(A26,CPU!$A$1:$N$4668,9)","v":1.92},{"$f":"VLOOKUP(A26,CPU!$A$1:$N$4668,10)","v":2.37},{"$f":"ROUND(F26*H26,2)","v":4976.99},{"$nulls":5},{"$f":"I26-K26","v":4976.99}]
[15,"3.4","TRANSPORTE COM CAMINHÃO TANQUE DE TRANSPORTE DE MATERIAL ASFÁLTICO DE 30000 L, EM VIA URBANA PAVIMENTADA (BDI DIFERENCIADO)",102331,"TXKM",14000,{"$f":"VLOOKUP(A27,CPU!$A$1:$N$4668,9)","v":0.47},{"$f":"VLOOKUP(A27,CPU!$A$1:$N$4668,10)","v":0.54},{"$f":"ROUND(F27*H27,2)","v":7560},{"$nulls":5},7560]
["D",4,"OBRAS COMPLEMENTARES",{"$nulls":5},{"$f":"SUM(I29:I32)","v":956198.17},{"$nulls":5},956198.17]
[16,"4.1","GUIA (MEIO-FIO) E SARJETA CONJUGADOS DE CONCRETO, MOLDADA IN LOCO COM EXTRUSORA, 45 CM BASE (15 CM BASE DA GUIA + 30 CM BASE DA SARJETA) X 22 CM ALTURA",94267,"M",11200,{"$f":"VLOOKUP(A29,CPU!$A$1:$N$4668,9)","v":57.36999999999999},{"$f":"VLOOKUP(A29,CPU!$A$1:$N$4668,10)","v":70.75},{"$f":"ROUND(F29*H29,2)","v":792400},{"$nulls":5},792400]
[17,"4.2","FORNECIMENTO E INSTALAÇÃO DE PLACA DE SINALIZAÇÃO VIÁRIA - REGULAMENTAÇÃO OCTOGONAL (PARE) 0,60MX0,60M","CPU.4","UN.",45,{"$f":"VLOOKUP(A30,CPU!$A$1:$N$4668,9)","v":444.59000000000003},{"$f":"VLOOKUP(A30,CPU!$A$1:$N$4668,10)","v":548.27},{"$f":"ROUND(F30*H30,2)","v":24672.15},{"$nulls":5},24672.15]
[18,"4.3","FORNECIMENTO E INSTALAÇÃO DE PLACA DE IDENTIFICACAO DE RUA EM CHAPA DE AÇO PINTADA COM PELÍCULA DE ALTA INTENSIDADE, 45 CM X 20 CM - INCLUSIVE SUPORTE DE MADEIRA, CONFORME PROJETO (02 PLACAS POR SUPORTE)","CPU.5","UN.",45,{"$f":"VLOOKUP(A31,CPU!$A$1:$N$4668,9)","v":436.34000000000003},{"$f":"VLOOKUP(A31,CPU!$A$1:$N$4668,10)","v":538.09},{"$f":"ROUND(F31*H31,2)","v":24214.05},{"$nulls":5},24214.05]
[19,"4.4","PINTURA DE EIXO VIÁRIO SOBRE ASFALTO COM TINTA RETRORREFLETIVA A BASE DE RESINA ACRÍLICA COM MICROESFERAS DE VIDRO, APLICAÇÃO MECÂNICA COM DEMARCADORA AUTOPROPELIDA",102512,"M",16799.995714285717,{"$f":"VLOOKUP(A32,CPU!$A$1:$N$4668,9)","v":5.5500000000000007},{"$f":"VLOOKUP(A32,CPU!$A$1:$N$4668,10)","v":6.84},{"$f":"ROUND(F32*H32,2)","v":114911.97},{"$nulls":5},114911.97]
["E",5,"FORNECIMENTOS - MATERIAL ASFÁLTICO (BDI DIFERENCIADO)",{"$nulls":5},{"$f":"SUM(I34:I36)","v":2863937.77},{"$nulls":5},2863937.77]
[20,"5.1","AQUISIÇÃO DE EMULSÃO ASFÁLTICA PARA IMPRIMAÇÃO (EAI) - EXCLUSIVE TRANSPORTE","CPU.6","T",54,{"$f":"VLOOKUP(A34,CPU!$A$1:$N$4668,9)","v":2307.59},{"$f":"VLOOKUP(A34,CPU!$A$1:$N$4668,10)","v":2653.73},{"$f":"ROUND(F34*H34,2)","v":143301.42000000001},{"$nulls":5},143301.42000000001]
[21,"5.2","AQUISIÇÃO DE EMULSAO ASFALTICA CATIONICA RR-1C - EXCLUSIVE TRANSPORTE","CPU.7","T",15.995000000000001,{"$f":"VLOOKUP(A35,CPU!$A$1:$N$4668,9)","v":2736.39},{"$f":"VLOOKUP(A35,CPU!$A$1:$N$4668,10)","v":3146.85},{"$f":"ROUND(F35*H35,2)","v":50333.87},{"$nulls":5},50333.87]
[22,"5.3","AQUISIÇÃO DE CONCRETO BETUMINOSO USINADO A QUENTE (CBUQ) PARA PAVIMENTACAO ASFALTICA, PADRAO DNIT, FAIXA C, COM CAP 50/70 - EXCLUSIVE TRANSPORTE","CPU.8","T",4300.0040000000008,{"$f":"VLOOKUP(A36,CPU!$A$1:$N$4668,9)","v":540},{"$f":"VLOOKUP(A36,CPU!$A$1:$N$4668,10)","v":621},{"$f":"ROUND(F36*H36,2)","v":2670302.48},{"$nulls":5},2670302.48]
[null,"TOTAL GERAL DA OBRA COM BDI ",{"$nulls":6},{"$f":"SUM(I9,I15,I23,I28,I33)","v":4944488.24},{"$nulls":5},4944488.24]
[{"$nulls":14},0]

{"sheet":"CPU","index":1,"n_rows":365,"n_cols":13,"rows_kept":365,"cut":false,"hidden":false,"merged":[[0,0,13,0],[0,1,0,3],[0,4,0,7],[0,10,0,11],[1,2,1,5],[1,10,1,11],[2,2,2,3],[3,1,3,7],[9,1,9,3],[9,5,9,6],[10,1,10,6],[11,1,11,6],[12,1,12,6],[14,0,32,0],[14,1,14,3],[14,4,14,7],[14,10,14,11],[15,2,15,5],[15,8,16,9],[16,2,16,3],[17,1,17,7],[28,1,28,3],[28,5,28,6],[29,1,29,6],[30,1,30,6],[31,1,31,6],[33,0,46,0],[33,1,33,3],[33,4,33,7],[33,10,33,11],[34,2,34,5],[34,8,35,9],[35,2,35,3],[36,1,36,7],[42,1,42,3],[42,5,42,6],[43,1,43,6],[44,1,44,6],[45,1,45,6],[47,0,64,0],[47,1,47,3],[47,4,47,7],[47,10,47,11],[48,2,48,5],[49,2,49,3],[50,1,50,7],[60,1,60,3],[60,5,60,6],[61,1,61,6],[62,1,62,6],[63,1,63,6],[65,0,80,0],[65,1,65,3],[65,4,65,7],[65,10,65,11],[66,2,66,5],[67,2,67,3],[68,1,68,7],[76,1,76,3],[76,5,76,6],[77,1,77,6],[78,1,78,6],[79,1,79,6],[81,0,93,0],[81,1,81,3],[81,4,81,7],[81,10,81,11],[82,2,82,5],[83,2,83,3],[84,1,84,7],[89,1,89,3],[89,5,89,6],[90,1,90,6],[91,1,91,6],[92,1,92,6],[94,0,106,0],[94,1,94,3],[94,4,94,7],[95,2,95,5],[96,2,96,3],[97,1,97,7],[103,1,103,3],[103,5,103,6],[104,1,104,6],[105,1,105,6],[106,1,106,6],[108,0,125,0],[108,1,108,3],[108,4,108,7],[108,10,108,11],[109,2,109,5],[110,2,110,3],[111,1,111,7],[121,1,121,3],[121,5,121,6],[122,1,122,6],[123,1,123,6],[124,1,124,6],[126,0,144,0],[126,1,126,3],[126,4,126,7],[127,2,127,5],[128,2,128,3],[129,1,129,7],[141,1,141,3],[141,5,141,6],[142,1,142,6],[143,1,143,6],[144,1,144,6],[146,0,164,0],[146,1,146,3],[146,4,146,7],[146,10,146,11],[147,2,147,5],[148,2,148,3],[149,1,149,7],[160,1,160,3],[160,5,160,6],[161,1,161,6],[162,1,162,6],[163,1,163,6],[165,0,183,0],[165,1,165,3],[165,4,165,7],[165,10,165,11],[166,2,166,5],[167,2,167,3],[168,1,168,7],[179,1,179,3],[179,5,179,6],[180,1,180,6],[181,1,181,6],[182,1,182,6],[184,0,205,0],[184,1,184,3],[184,4,184,7],[184,10,184,11],[185,2,185,5],[186,2,186,3],[187,1,187,7],[189,8,189,9],[201,1,201,3],[201,5,201,6],[202,1,202,6],[203,1,203,6],[204,1,204,6],[206,0,217,0],[206,1,206,3],[206,4,206,7],[206,10,206,11],[207,2,207,5],[208,2,208,3],[209,1,209,7],[214,1,214,3],[214,5,214,6],[215,1,215,6],[216,1,216,6],[217,1,217,6],[219,0,230,0],[219,1,219,3],[219,4,219,7],[219,10,219,11],[220,2,220,5],[221,2,221,3],[222,1,222,7],[227,1,227,3],[227,5,227,6],[228,1,228,6],[229,1,229,6],[230,1,230,6],[232,0,243,0],[232,1,232,3],[232,4,232,7],[233,2,233,5],[234,2,234,3],[235,1,235,7],[240,1,240,3],[240,5,240,6],[241,1,241,6],[242,1,242,6],[243,1,243,6],[245,0,256,0],[245,1,245,3],[245,4,245,7],[245,10,245,11],[246,2,246,5],[247,2,247,3],[248,1,248,7],[252,1,252,3],[252,5,252,6],[253,1,253,6],[254,1,254,6],[255,1,255,6],[257,0,274,0],[257,1,257,3],[257,4,257,7],[257,10,257,11],[258,2,258,5],[259,2,259,3],[260,1,260,7],[271,1,271,3],[271,5,271,6],[272,1,272,6],[273,1,273,6],[274,1,274,6],[276,0,292,0],[276,1,276,3],[276,4,276,7],[277,2,277,5],[278,2,278,3],[279,1,279,7],[289,1,289,3],[289,5,289,6],[290,1,290,6],[291,1,291,6],[292,1,292,6],[294,0,310,0],[294,1,294,3],[294,4,294,7],[295,2,295,5],[296,2,296,3],[297,1,297,7],[307,1,307,3],[307,5,307,6],[308,1,308,6],[309,1,309,6],[310,1,310,6],[312,0,328,0],[312,1,312,3],[312,4,312,7],[313,2,313,5],[314,2,314,3],[315,1,315,7],[325,1,325,3],[325,5,325,6],[326,1,326,6],[327,1,327,6],[328,1,328,6],[330,0,340,0],[330,1,330,3],[330,4,330,7],[331,2,331,5],[332,2,332,3],[333,1,333,7],[337,1,337,3],[337,5,337,6],[338,1,338,6],[339,1,339,6],[340,1,340,6],[342,0,352,0],[342,1,342,3],[342,4,342,7],[343,2,343,5],[344,2,344,3],[345,1,345,7],[349,1,349,3],[349,5,349,6],[350,1,350,6],[351,1,351,6],[352,1,352,6],[354,0,364,0],[354,1,354,3],[354,4,354,7],[355,2,355,5],[356,2,356,3],[357,1,357,7],[361,1,361,3],[361,5,361,6],[362,1,362,6],[363,1,363,6],[364,1,364,6]]}
[1,"CODEVASF",null,null," COMPOSIÇÃO DE PREÇO UNITÁRIO",null,null,null,{"$f":"H11","v":17758.32},{"$f":"H13","v":21899.56},"BDI CALCULADO:",null,{"$f":"ORÇAMENTO!I6","v":0.23319999999999999}]
[null,"OBRA:  ",{"$f":"ORÇAMENTO!C5","v":" PAVIMENTAÇÃO ASFÁLTICA EM CBUQ - VIAS DIVERSAS – BAIRRO MAJOR SALVO (CORINTO / MG)"},null,null,null,"DATA: ",{"$f":"ORÇAMENTO!C6","v":" SETEMBRO / 2023   "},null,null,"BDI DIFERENCIADO:",null,{"$f":"'BDI FORN'!D31/100","v":0.15}]
[null,"SERVIÇO:  ",{"$f":"VLOOKUP(A1,ORÇAMENTO!A10:I29,3)","v":"MOBILIZAÇÃO E DESMOBILIZAÇÃO"},null,"Referência:","CPU.1","UNIDADE: ",{"$f":"VLOOKUP(A1,ORÇAMENTO!A10:I29,5)","v":"GL"}]
[]
[null,"TIPO ITEM","CODIGO ITEM","DESCRIÇÃO ITEM","UNIDADE ITEM","COEFICIENTE","PRECO UNITARIO","CUSTO TOTAL"]
[null,"COMPOSICAO",89876,"CAMINHÃO BASCULANTE 14 M3, COM CAVALO MECÂNICO DE CAPACIDADE MÁXIMA DE TRAÇÃO COMBINADO DE 36000 KG, POTÊNCIA 286 CV, INCLUSIVE SEMIREBOQUE COM CAÇAMBA METÁLICA ","CHP DIURNO.",8,286.2,{"$f":"ROUNDDOWN(F6*G6,2)","v":2289.6}]
[null,"COMPOSICAO",89877,"CAMINHÃO BASCULANTE 14 M3, COM CAVALO MECÂNICO DE CAPACIDADE MÁXIMA DE TRAÇÃO COMBINADO DE 36000 KG, POTÊNCIA 286 CV, INCLUSIVE SEMIREBOQUE TRAÇÃO ","CHI DIURNO.",8,82.81,{"$f":"ROUNDDOWN(F7*G7,2)","v":662.48}]
[null,"COMPOSICAO",5914640,"TRANSPORTE COM CAVALO MECÂNICO COM SEMIRREBOQUE COM CAPACIDADE DE 30 T - RODOVIA PAVIMENTADA","T.KM",9674,0.57999999999999996,{"$f":"ROUNDDOWN(F8*G8,2)","v":5610.92}]
[null,"COMPOSIÇÃO",88316,"SERVENTE COM ENCARGOS COMPLEMENTARES","H",16,19.760000000000002,{"$f":"ROUNDDOWN(F9*G9,2)","v":316.16000000000003}]
[null,"PRODUÇÃO DA EQUIPE",null,null,0.5,"CUSTO ",null,{"$f":"SUM(H6:H9)","v":8879.16}]
[null,"TOTAL",{"$nulls":5},{"$f":"H10/E10","v":17758.32},"OK"]
[null,"BDI                %",{"$nulls":5},{"$f":"1+$M$1","v":1.2332000000000001}]
[null,"TOTAL DO SERVIÇO - R$",{"$nulls":5},{"$f":"ROUND(H11*H12,2)","v":21899.56}]
[]
[{"$f":"A1+1","v":2},"CODEVASF",null,null," COMPOSIÇÃO DE PREÇO UNITÁRIO",null,null,null,{"$f":"H30","v":193404.12},{"$f":"H32","v":238505.96}]
[null,"OBRA:  ",{"$f":"$C$2","v":" PAVIMENTAÇÃO ASFÁLTICA EM CBUQ - VIAS DIVERSAS – BAIRRO MAJOR SALVO (CORINTO / MG)"},null,null,null,"DATA: ",{"$f":"$H$2","v":" SETEMBRO / 2023   "}]
[null,"SERVIÇO:  ",{"$f":"VLOOKUP(A15,ORÇAMENTO!$A$10:$I$29,3)","v":"ADMINISTRAÇÃO LOCAL"},null,"SINAPI","CPU.2","UNIDADE: ",{"$f":"VLOOKUP(A15,ORÇAMENTO!$A$10:$I$29,5)","v":"GL"}]
[]
[null,"TIPO ITEM","CODIGO ITEM","DESCRIÇÃO ITEM","UNIDADE ITEM","COEFICIENTE","PRECO UNITARIO","CUSTO TOTAL"]
[null,"INSUMO",14250,"ENERGIA ELÉTRICA","kwh",60,0.95,{"$f":"ROUNDDOWN(F20*G20,2)","v":57}]
[null,"INSUMO",44480,"TARIFA FORNECIMENTO DE ÁGUA/ESGOTO ","M3",6,17.97,107.82]
[null,"COTAÇÃO","MERC.","TELEFONE (PLANO CONTROLE)","UNID",2,59.9,119.8]
[null,"INSUMO","ED-50155 SEINFRA","BANHEIRO QUÍMICO 110 X 120 X 230 CM COM MANUTENÇÃO (CONSIDERANDO OBRAS SIMULTÂNEAS)","MÊS",2,820,1640]
[null,"COMPOSICAO",90777,"Engenheiro Civil Júnior com encargos complementares","H",55,114.12,6276.6]
[null,"COMPOSICAO",90776,"Encarregado Geral com encargos complementares","H",220,57.73,12700.6]
[null,"COMPOSICAO",88321,"Tecnico de Laboratório com encargos complementares","H",110,45.45,4999.5]
[null,"COMPOSICAO",100309,"Tecnico em Segurança do Trabalho com encargos complementares","H",110,45.71,5028.1000000000004]
[null,"COMPOSICAO",90772,"Auxiliar de escritório com encargos complementares","H",55,23.72,1304.5999999999999]
[null,"PRODUÇÃO DA EQUIPE",null,null,{"$f":"1/6","v":0.16666666666666666},"CUSTO ",null,{"$f":"SUM(H20:H28)","v":32234.019999999997}]
[null,"TOTAL",{"$nulls":5},{"$f":"ROUND(H29/E29,2)","v":193404.12},"OK"]
[null,"BDI                %",{"$nulls":5},{"$f":"1+$M$1","v":1.2332000000000001}]
[null,"TOTAL DO SERVIÇO - R$",{"$nulls":5},{"$f":"ROUND(H30*H31,2)","v":238505.96}]
[]
[{"$f":"A15+1","v":3},"CODEVASF",null,null," COMPOSIÇÃO DE PREÇO UNITÁRIO",null,null,null,{"$f":"H44","v":13801.5},{"$f":"H46","v":17020.009999999998}]
[null,"OBRA:  ",{"$f":"$C$2","v":" PAVIMENTAÇÃO ASFÁLTICA EM CBUQ - VIAS DIVERSAS – BAIRRO MAJOR SALVO (CORINTO / MG)"},null,null,null,"DATA: ",{"$f":"$H$2","v":" SETEMBRO / 2023   "}]
[null,"SERVIÇO:  ",{"$f":"VLOOKUP(A34,ORÇAMENTO!$A$10:$I$29,3)","v":"CANTEIRO DE OBRAS"},null,"SINAPI",{"$f":"VLOOKUP(A34,ORÇAMENTO!$A$10:$I$29,4)","v":"CPU.3"},"UNIDADE: ",{"$f":"VLOOKUP(A34,ORÇAMENTO!$A$10:$I$29,5)","v":"GL"}]
[]
[null,"TIPO ITEM","CODIGO ITEM","DESCRIÇÃO ITEM","UNIDADE ITEM","COEFICIENTE","PRECO UNITARIO","CUSTO TOTAL"]
[null,"INSUMO",10775,"LOCACAO DE CONTAINER COM 1 SANITARIO, PARA ESCRITORIO,COMPLETO, SEM DIVISORIAS INTERNAS","MÊS",6,995,{"$f":"ROUNDDOWN(F39*G39,2)","v":5970}]
[null,"INSUMO",10779,"LOCACAO DE CONTAINER P/ SANITARIO, C/ 5 BACIAS, 1 LAVATORIO E 4 MICTORIOS","MÊS",6,1243.75,7462.5]
{"$rows_left_out":326}
{"sheet":"BDI SERV","index":2,"n_rows":37,"n_cols":5,"rows_kept":37,"cut":false,"hidden":false,"merged":[[31,1,31,2],[32,0,34,5],[32,6,35,8],[36,0,36,5],[0,1,2,4],[3,1,4,1],[3,2,4,2],[28,0,28,5],[30,1,30,2]]}
[null,"DETALHAMENTO DO BDI - SERVIÇOS"]
[]
[]
[null,"Item","Descrição dos Serviços","%","%"]
[null,null,null,"PV","CD"]
[]
[null,1,"ADMINISTRAÇÃO CENTRAL"," ",4.01]
[null,"1.1","ESCRITÓRIO CENTRAL"," "," "]
[null,"1.2","VIAGENS"," "," "]
[null,"1.3","OUTROS"," "," "]
[null," "," "," "," "]
[null,2,"IMPOSTOS E TAXAS",{"$f":"SUM(D13:D16)","v":7.65},{"$f":"SUM(E13:E16)","v":9.57}]
[null,"2.1","ISS (*)",{"$f":"5*0.8","v":4},{"$f":"ROUND(D13*1.2515,2)","v":5.01}]
[null,"2.2","PIS",0.65,{"$f":"ROUND(D14*1.2515,2)","v":0.81}]
[null,"2.3","Cofins",3,{"$f":"ROUND(D15*1.2515,2)","v":3.75}]
[null,"2.4","CONTRIBUIÇÃO PREVIDENCIÁRIA SOBRE A RENDA BRUTA",0,{"$f":"ROUND(D16*1.2515,2)","v":0}]
[]
[null,3,"TAXA DE RISCO"," ",{"$f":"SUM(E19:E22)","v":0.96}]
[null,"3.1","SEGURO",null,0.2]
[null,"3.2","RISCO",null,0.56000000000000005]
[null,"3.3","GARANTIA",null,0.2]
[]
[null,4,"DESPESAS FINANCEIRAS"," ",1.1100000000000001]
[]
[null,5,"LUCRO",null,7.3]
[]
[null," ","BDI - CALCULADO"," ",{"$f":"ROUND((((1+(E7+E18)/100)*(1+E23/100)*(1+E25/100)/(1-D12/100)-1)*100),2)","v":23.32}]
[]
["BDI = ((1+((AC+S+R+G)/100))x(1+DF/100)x(1+L/100)/(1-I/100)-1)*100"]
[]
[null,"BDI (CALCULADO):",null,{"$f":"ROUND((((1+((E7+E18)/100))*(1+E23/100)*(1+E25/100))/(1-D12/100)-1)*100,2)","v":23.32},"%"]
[null," "]
["(*) ISS CONFORME LEI MUNICIPAL Nº 1.576 / 2009 e Lei Complementar nº 01/2019 - \nConsiderando as deduções previstas no Art. 89 - § 1º (Dedução Simplificada de 20% sem necessidade de comprovação)"]
[]
[]
[]
["BDI EM CONFORMIDADE COM OS ACÓRDÃOS Nº 2369/2011 e ACÓRDÃO Nº 2.622/2013 - TCU - PLENÁRIO"]

{"sheet":"BDI FORN","index":3,"n_rows":37,"n_cols":5,"rows_kept":37,"cut":false,"hidden":false,"merged":[[31,1,31,2],[32,0,34,5],[36,0,36,5],[0,1,2,4],[3,1,4,1],[3,2,4,2],[28,0,28,5],[30,1,30,2]]}
[null,"DETALHAMENTO DO BDI - FORNECIMENTO \n(MATERIAL ASFÁLTICO)"]
[]
[]
[null,"Item","Descrição dos Serviços","%","%"]
[null,null,null,"PV","CD"]
[]
[null,1,"ADMINISTRAÇÃO CENTRAL"," ",3.72]
[null,"1.1","ESCRITÓRIO CENTRAL"," "," "]
[null,"1.2","VIAGENS"," "," "]
[null,"1.3","OUTROS"," "," "]
[null," "," "," "," "]
[null,2,"IMPOSTOS E TAXAS",{"$f":"SUM(D13:D16)","v":3.65},{"$f":"SUM(E13:E16)","v":4.5600000000000005}]
[null,"2.1","ISS (*)",null,{"$f":"ROUND(D13*1.2515,2)","v":0}]
[null,"2.2","PIS",0.65,{"$f":"ROUND(D14*1.2515,2)","v":0.81}]
[null,"2.3","Cofins",3,{"$f":"ROUND(D15*1.2515,2)","v":3.75}]
[null,"2.4","CONTRIBUIÇÃO PREVIDENCIÁRIA SOBRE A RENDA BRUTA",0,{"$f":"ROUND(D16*1.2515,2)","v":0}]
[]
[null,3,"TAXA DE RISCO"," ",{"$f":"SUM(E19:E22)","v":0.82000000000000006}]
[null,"3.1","SEGURO",null,0.16]
[null,"3.2","RISCO",null,0.5]
[null,"3.3","GARANTIA",null,0.16]
[]
[null,4,"DESPESAS FINANCEIRAS"," ",0.94]
[]
[null,5,"LUCRO",null,5]
[]
[null," ","BDI - CALCULADO"," ",{"$f":"ROUND((((1+(E7+E18)/100)*(1+E23/100)*(1+E25/100)/(1-D12/100)-1)*100),2)","v":15}]
[]
["BDI = ((1+((AC+S+R+G)/100))x(1+DF/100)x(1+L/100)/(1-I/100)-1)*100"]
[]
[null,"BDI (CALCULADO):",null,{"$f":"ROUND((((1+((E7+E18)/100))*(1+E23/100)*(1+E25/100))/(1-D12/100)-1)*100,2)","v":15},"%"]
[null," "]
[]
[]
[]
[]
["BDI EM CONFORMIDADE COM OS ACÓRDÃOS Nº 2369/2011 e ACÓRDÃO Nº 2.622/2013 - TCU - PLENÁRIO"]

{"sheet":"CRONOGRAMA","index":4,"n_rows":19,"n_cols":12,"rows_kept":19,"cut":false,"hidden":false,"merged":[[0,1,0,11],[1,1,2,1],[1,2,2,4],[1,6,1,11],[2,6,2,11],[3,1,3,9],[5,0,6,0],[5,1,6,1],[5,2,6,2],[7,0,8,0],[7,1,8,1],[7,2,8,2],[9,0,10,0],[9,1,10,1],[9,2,10,2],[11,0,12,0],[11,1,12,1],[11,2,12,2],[13,0,14,0],[13,1,14,1],[13,2,14,2],[15,1,16,2],[18,1,22,11]]}
[null,"CRONOGRAMA FÍSICO-FINANCEIRO"]
[null,"OBRA: ",{"$f":"ORÇAMENTO!C5","v":" PAVIMENTAÇÃO ASFÁLTICA EM CBUQ - VIAS DIVERSAS – BAIRRO MAJOR SALVO (CORINTO / MG)"},null,null,"VALOR:",{"$f":"ORÇAMENTO!I37","v":4944488.24}]
[{"$nulls":5},"PRAZO: ","180 DIAS "]
[]
[null,"ITEM","ETAPAS/DESCRIÇAO","FISICO/  FINANCEIRO","TOTAL    ETAPAS","MÊS 1","MÊS 2","MÊS 3","MÊS 4","MÊS 5","MÊS 6","TOTAL"]
["A",{"$f":"VLOOKUP(A6,ORÇAMENTO!$A$9:$I$37,2)","v":1},{"$f":"VLOOKUP(A6,ORÇAMENTO!$A$9:$I$37,3)","v":"SERVIÇOS PRELIMINARES "},"FISICO ",{"$f":"ROUND(E7/$G$2,4)","v":6.7000000000000004E-2},0.1,0.2,0.2,0.2,0.2,0.1,{"$f":"SUM(F6:K6)","v":0.99999999999999989}]
[null,null,null,"FINANCEIRO",{"$f":"ORÇAMENTO!I9","v":331226.01},{"$f":"ROUND($E$7*F6,2)","v":33122.6},66245.2,66245.2,66245.2,66245.2,33122.6,{"$f":"SUM(F7:K7)","v":331226}]
["B",{"$f":"VLOOKUP(A8,ORÇAMENTO!$A$9:$I$37,2)","v":2},{"$f":"VLOOKUP(A8,ORÇAMENTO!$A$9:$I$37,3)","v":"TERRAPLANAGEM E PAVIMENTAÇÃO"},"FISICO ",{"$f":"ROUND(E9/$G$2,4)","v":0.12570000000000001},0.1,0.2,0.2,0.2,0.2,0.1,{"$f":"SUM(F8:K8)","v":0.99999999999999989}]
[null,null,null,"FINANCEIRO",{"$f":"ORÇAMENTO!I15","v":621389.30000000005},{"$f":"ROUND($E$9*F8,2)","v":62138.93},124277.86,124277.86,124277.86,124277.86,62138.93,{"$f":"SUM(F9:K9)","v":621389.30000000005}]
["C",{"$f":"VLOOKUP(A10,ORÇAMENTO!$A$9:$I$37,2)","v":3},{"$f":"VLOOKUP(A10,ORÇAMENTO!$A$9:$I$37,3)","v":"TRANSPORTE DE MATERIAIS"},"FISICO ",{"$f":"ROUND(E11/$G$2,4)","v":3.4700000000000002E-2},0.1,0.2,0.2,0.2,0.2,0.1,{"$f":"SUM(F10:K10)","v":0.99999999999999989}]
[null,null,null,"FINANCEIRO",{"$f":"ORÇAMENTO!I23","v":171736.99},{"$f":"ROUND($E$11*F10,2)","v":17173.7},34347.4,34347.4,34347.4,34347.4,17173.7,{"$f":"SUM(F11:K11)-0.04","v":171736.95999999999}]
["D",{"$f":"VLOOKUP(A12,ORÇAMENTO!$A$9:$I$37,2)","v":4},{"$f":"VLOOKUP(A12,ORÇAMENTO!$A$9:$I$37,3)","v":"OBRAS COMPLEMENTARES"},"FISICO ",{"$f":"ROUND(E13/$G$2,4)","v":0.19339999999999999},0,0.2,0.2,0.2,0.2,0.2,{"$f":"SUM(F12:K12)","v":1}]
[null,null,null,"FINANCEIRO",{"$f":"ORÇAMENTO!I28","v":956198.17},{"$f":"ROUND($E$13*F12,2)","v":0},191239.63,191239.63,191239.63,191239.63,191239.63,{"$f":"SUM(F13:K13)-0.02","v":956198.13}]
["E",{"$f":"VLOOKUP(A14,ORÇAMENTO!$A$9:$I$37,2)","v":5},{"$f":"VLOOKUP(A14,ORÇAMENTO!$A$9:$I$37,3)","v":"FORNECIMENTOS - MATERIAL ASFÁLTICO (BDI DIFERENCIADO)"},"FISICO ",{"$f":"ROUND(E15/$G$2,4)","v":0.57920000000000005},0.1,0.2,0.2,0.2,0.2,0.1,{"$f":"SUM(F14:K14)","v":0.99999999999999989}]
[null,null,null,"FINANCEIRO",{"$f":"ORÇAMENTO!I33","v":2863937.77},{"$f":"ROUND($E$15*F14,2)","v":286393.78000000003},572787.55000000005,572787.55000000005,572787.55000000005,572787.55000000005,286393.78000000003,{"$f":"SUM(F15:K15)-0.02","v":2863937.7400000007}]
[null,"TOTAL",null,"FISICO ",{"$f":"SUM(F16:K16)","v":0.99999999393263816},{"$f":"F17/$E$17","v":8.0661332506273692E-2},0.19999999838203683,0.19999999838203683,0.19999999838203683,0.19999999838203683,0.11933866789821711,{"$f":"SUM(F16:K16)","v":0.99999999393263816}]
[null,null,null,"FINANCEIRO",{"$f":"E11+E9+E7+E13+E15","v":4944488.24},398829.01,988897.64000000013,988897.64000000013,988897.64000000013,988897.64000000013,590068.64,{"$f":"SUM(F17:K17)+0.03","v":4944488.24}]
[]
[null,"OBSERVAÇÕES:"]