{"text_format":"2","workbook":"xlsx","n_sheets":5,"sheets":["ORÇAMENTO","CPU","BDI SERV","BDI FORN","CRONOGRAMA"],"not_rendered":{"charts":0,"images":8,"macros":0,"external_links":0,"defined_names":5,"comments":1,"pivot_tables":0},"unopened":[],"bounds":{"document_bytes":16777216,"sheet_cells":100000,"run_cost":"one","rows_first":2000,"rows_last":500,"rows_between":2000,"halvings":0,"cell_chars":16384,"cell_head_chars":4096},"cells_cut":0,"cells_raw":0,"read":"whole","date_system":"1900"}

{"sheet":"ORÇAMENTO","index":0,"n_rows":48,"n_cols":9,"rows_kept":48,"cut":false,"hidden":false,"merged":[[47,1,47,2],[0,0,7,0],[0,2,0,8],[1,2,1,8],[2,2,2,8],[4,2,4,8],[5,6,5,7],[6,1,6,2],[6,6,6,7]]}
["<---- NUMERAR SERVIÇOS PARA CPU",null,"Ministério do Desenvolvimento Regional"]
[null,null,"Companhia de Desenvolvimento dos Vales do São Francisco e do Parnaíba"]
[null,null,"1ª Superintendência Regional"]
[]
[null,"OBRA: "," PAVIMENTAÇÃO ASFÁLTICA EM CBUQ – BAIRRO MARINGÁ ( FORMIGA / MG ) - ITEM 2"]
[null,"DATA:"," SETEMBRO / 2023   ",null,null,null,"BDI Serviços:",null,{"$f":"'BDI SERV'!D31/100","v":0.22010000000000002}]
[null,"PRAZO DE EXECUÇÃO:   90  DIAS",{"$nulls":4},"BDI Serviços:",null,{"$f":"'BDI FORN'!D31/100","v":0.15}]
[null,"ITEM","DISCRIMINAÇÃO","REFER.","UNID.","QUANT.","P. UNITÁRIO","P.UNIT.C/ BDI","P. TOTAL"]
["A",1,"SERVIÇOS PRELIMINARES ",{"$nulls":5},{"$f":"SUM(I10:I14)","v":100988.5}]
[1,"1.1","MOBILIZAÇÃO E DESMOBILIZAÇÃO","CPU.1","GL",1,{"$f":"VLOOKUP(A10,CPU!$A$1:$N$4838,9)","v":8191.7599999999993},{"$f":"VLOOKUP(A10,CPU!$A$1:$N$4838,10)","v":9994.77},{"$f":"ROUND(F10*H10,2)","v":9994.77}]
[2,"1.2","ADMINISTRAÇÃO LOCAL","CPU.2","GL",1,{"$f":"VLOOKUP(A11,CPU!$A$1:$N$4838,9)","v":64365.81},{"$f":"VLOOKUP(A11,CPU!$A$1:$N$4838,10)","v":78532.72},{"$f":"ROUND(F11*H11,2)","v":78532.72}]
[3,"1.3","CANTEIRO DE OBRAS","CPU.3","GL",1,{"$f":"VLOOKUP(A12,CPU!$A$1:$N$4838,9)","v":7325.25},{"$f":"VLOOKUP(A12,CPU!$A$1:$N$4838,10)","v":8937.5400000000009},{"$f":"ROUND(F12*H12,2)","v":8937.5400000000009}]
[4,"1.4","PLACA DE OBRA EM CHAPA DE AÇO GALVANIZADO",103689,"M2",3,{"$f":"VLOOKUP(A13,CPU!$A$1:$N$4838,9)","v":339.72},{"$f":"VLOOKUP(A13,CPU!$A$1:$N$4838,10)","v":414.49},{"$f":"ROUND(F13*H13,2)","v":1243.47}]
[5,"1.5","SERVIÇOS TOPOGRÁFICOS PARA PAVIMENTAÇÃO, INCLUSIVE NOTA DE SERVIÇO, ACOMPANHAMENTO E GREIDE",78472,"M2",5700,{"$f":"VLOOKUP(A14,CPU!$A$1:$N$4838,9)","v":0.32999999999999996},{"$f":"VLOOKUP(A14,CPU!$A$1:$N$4838,10)","v":0.4},{"$f":"ROUND(F14*H14,2)","v":2280}]
["B",2,"PAVIMENTAÇÃO",{"$nulls":5},{"$f":"SUM(I16:I22)","v":201779.8}]
[6,"2.1","ESCAVAÇÃO HORIZONTAL EM SOLO DE 1A CATEGORIA ",101116,"M3",1140,{"$f":"VLOOKUP(A16,CPU!$A$1:$N$4838,9)","v":2.0300000000000002},{"$f":"VLOOKUP(A16,CPU!$A$1:$N$4838,10)","v":2.48},{"$f":"ROUND(F16*H16,2)","v":2827.2}]
[7,"2.2","CARGA, MANOBRA E DESCARGA DE SOLOS E MATERIAIS GRANULARES EM CAMINHÃO BASCULANTE",100976,"M3",1140,{"$f":"VLOOKUP(A17,CPU!$A$1:$N$4838,9)","v":7.99},{"$f":"VLOOKUP(A17,CPU!$A$1:$N$4838,10)","v":9.75},11115]
[8,"2.3","REGULARIZAÇÃO E COMPACTAÇÃO DO SUBLEITO ",100576,"M2",5700,{"$f":"VLOOKUP(A18,CPU!$A$1:$N$4838,9)","v":2.5299999999999998},{"$f":"VLOOKUP(A18,CPU!$A$1:$N$4838,10)","v":3.09},17613]
[9,"2.4","EXECUÇÃO E COMPACTAÇÃO DE BASE E OU SUB BASE PARA PAVIMENTAÇÃO DE BICA CORRIDA - EXCLUSIVE TRANSPORTE",96396,"M3",860,{"$f":"VLOOKUP(A19,CPU!$A$1:$N$4838,9)","v":110.99000000000001},{"$f":"VLOOKUP(A19,CPU!$A$1:$N$4838,10)","v":135.41999999999999},116461.2]
[10,"2.5","IMPRIMAÇÃO COM EMULSÃO ASFÁLTICA (EAI)",96401,"M2",5700,{"$f":"VLOOKUP(A20,CPU!$A$1:$N$4838,9)","v":1.1200000000000001},{"$f":"VLOOKUP(A20,CPU!$A$1:$N$4838,10)","v":1.37},7809]
[11,"2.6","PINTURA DE LIGAÇÃO COM EMULSÃO ASFÁLTICA RR-1C",96402,"M2",5300,{"$f":"VLOOKUP(A21,CPU!$A$1:$N$4838,9)","v":0.93000000000000016},{"$f":"VLOOKUP(A21,CPU!$A$1:$N$4838,10)","v":1.1299999999999999},5989]
[12,"2.7","EXECUÇÃO DE PAVIMENTO COM APLICAÇÃO DE CONCRETO ASFÁLTICO USINADO A QUENTE (CBUQ), CAMADA DE ROLAMENTO - EXCLUSIVE TRANSPORTE",95995,"M3",270,{"$f":"VLOOKUP(A22,CPU!$A$1:$N$4838,9)","v":121.32},{"$f":"VLOOKUP(A22,CPU!$A$1:$N$4838,10)","v":148.02000000000001},39965.4]
["C",3,"TRANSPORTE DE MATERIAIS",{"$nulls":5},{"$f":"SUM(I24:I25)","v":76581.740000000005}]
[13,"3.1","TRANSPORTE COM CAMINHÃO BASCULANTE, EM VIA URBANA PAVIMENTADA",95427,"M3XKM",86844.996675000002,{"$f":"VLOOKUP(A24,CPU!$A$1:$N$4838,9)","v":0.64999999999999991},{"$f":"VLOOKUP(A24,CPU!$A$1:$N$4838,10)","v":0.79},{"$f":"ROUND(F24*H24,2)","v":68607.55}]
[14,"3.3","TRANSPORTE COM CAMINHÃO CARROCERIA 9T, EM VIA URBANA PAVIMENTADA",100947,"TXKM",7056.8021250000002,{"$f":"VLOOKUP(A25,CPU!$A$1:$N$4838,9)","v":0.92999999999999994},{"$f":"VLOOKUP(A25,CPU!$A$1:$N$4838,10)","v":1.1299999999999999},{"$f":"ROUND(F25*H25,2)","v":7974.19}]
["D",4,"TRANSPORTE DE MATERIAL ASFÁLTICO (BDI DIFERENCIADO)",{"$nulls":5},{"$f":"SUM(I27:I28)","v":30200.560000000001}]
[15,"4.1","TRANSPORTE DE MASSA ASFÁLTICA COM CAMINHÃO BASCULANTE, EM VIA URBANA PAVIMENTADA (BDI DIFERENCIADO)",95430,"TXKM",62230.84,{"$f":"VLOOKUP(A27,CPU!$A$1:$N$4838,9)","v":0.41},{"$f":"VLOOKUP(A27,CPU!$A$1:$N$4838,10)","v":0.47},{"$f":"ROUND(F27*H27,2)","v":29248.49}]
[16,"4.2","TRANSPORTE COM CAMINHÃO TANQUE DE TRANSPORTE DE MATERIAL ASFÁLTICO, EM VIA URBANA PAVIMENTADA  (BDI DIFERENCIADO)",102331,"TXKM",1763.1,{"$f":"VLOOKUP(A28,CPU!$A$1:$N$4838,9)","v":0.47},{"$f":"VLOOKUP(A28,CPU!$A$1:$N$4838,10)","v":0.54},{"$f":"ROUND(F28*H28,2)","v":952.07}]
["E",5,"DRENAGEM E OBRAS COMPLEMENTARES",{"$nulls":5},{"$f":"SUM(I30:I43)","v":230927.21}]
[17,"5.1","GUIA (MEIO-FIO) E SARJETA CONJUGADOS DE CONCRETO, MOLDADA IN LOCO COM EXTRUSORA, 45 CM BASE (15 CM BASE DA GUIA + 30 CM BASE DA SARJETA) X 22 CM ALTURA.",94267,"M",1350,{"$f":"VLOOKUP(A30,CPU!$A$1:$N$4838,9)","v":57.36999999999999},{"$f":"VLOOKUP(A30,CPU!$A$1:$N$4838,10)","v":70},{"$f":"ROUND(F30*H30,2)","v":94500}]
[17.100000000000001,"5.2","LOCAÇÃO DE REDE DE ÁGUA OU ESGOTO",99063,"M",160,{"$f":"VLOOKUP(A31,CPU!$A$1:$N$4838,9)","v":6.02},{"$f":"VLOOKUP(A31,CPU!$A$1:$N$4838,10)","v":7.35},1176]
[17.2,"5.3","ESCAVAÇÃO MECANIZADA DE VALA COM PROFUNDIDADE ATÉ 1,5 M, EM SOLO DE 1A CATEGORIA",90105,"M3",290.00000000000006,{"$f":"VLOOKUP(A32,CPU!$A$1:$N$4838,9)","v":8.870000000000001},{"$f":"VLOOKUP(A32,CPU!$A$1:$N$4838,10)","v":10.82},3137.8]
[17.3,"5.4","PREPARO DE FUNDO DE VALA COM LARGURA MENOR QUE 1,5 M (ACERTO DO SOLO NATURAL)",101616,"M2",200,{"$f":"VLOOKUP(A33,CPU!$A$1:$N$4838,9)","v":6.07},{"$f":"VLOOKUP(A33,CPU!$A$1:$N$4838,10)","v":7.41},1482]
[17.399999999999999,"5.5","ESCORAMENTO DE VALA, TIPO PONTALETEAMENTO",101570,"M2",480,{"$f":"VLOOKUP(A34,CPU!$A$1:$N$4838,9)","v":26.669999999999998},{"$f":"VLOOKUP(A34,CPU!$A$1:$N$4838,10)","v":32.54},15619.2]
[17.5,"5.6","TUBO DE CONCRETO PARA REDES COLETORAS DE ÁGUAS PLUVIAIS, DIÂMETRO DE 400 MM, JUNTA RÍGIDA - FORNECIMENTO E ASSENTAMENTO",92210,"M",30,{"$f":"VLOOKUP(A35,CPU!$A$1:$N$4838,9)","v":186.7},{"$f":"VLOOKUP(A35,CPU!$A$1:$N$4838,10)","v":227.79},6833.7]
[17.600000000000001,"5.7","TUBO DE CONCRETO PARA REDES COLETORAS DE ÁGUAS PLUVIAIS, DIÂMETRO DE 600 MM, JUNTA RÍGIDA - FORNECIMENTO E ASSENTAMENTO",92212,"M",130,{"$f":"VLOOKUP(A36,CPU!$A$1:$N$4838,9)","v":338.24},{"$f":"VLOOKUP(A36,CPU!$A$1:$N$4838,10)","v":412.69},53649.7]
[17.7,"5.8","REATERRO MANUAL DE VALAS COM COMPACTAÇÃO MECANIZADA",93382,"M3",290.00000000000006,{"$f":"VLOOKUP(A37,CPU!$A$1:$N$4838,9)","v":34.64},{"$f":"VLOOKUP(A37,CPU!$A$1:$N$4838,10)","v":42.26},12255.4]
[18,"5.9","CAIXA PARA BOCA DE LOBO SIMPLES RETANGULAR, EM CONCRETO PRÉ-MOLDADO, DIMENSÕES INTERNAS: 0,6X1,0X1,2 M, INCLUSIVE GRELHA EM CONCRETO","97935a","UNID",6,{"$f":"VLOOKUP(A38,CPU!$A$1:$N$4838,9)","v":1503.23},{"$f":"VLOOKUP(A38,CPU!$A$1:$N$4838,10)","v":1834.09},11004.54]
[18.100000000000001,"5.10","POÇO DE VISITA RETANGULAR PARA DRENAGEM, EM ALVENARIA COM BLOCOS DE CONCRETO, DIMENSÕES INTERNAS = 1,2X1,2 M, PROF. DE 1,50M, INCLUSIVE TAMPÃO EM FERRO FUNDIDO D=600MM","99241a","UNID",3,{"$f":"VLOOKUP(A39,CPU!$A$1:$N$4838,9)","v":1932.11},{"$f":"VLOOKUP(A39,CPU!$A$1:$N$4838,10)","v":2357.37},7072.11]
[19,"5.11","FORNECIMENTO E INSTALAÇÃO DE PLACA DE SINALIZAÇÃO VIÁRIA - REGULAMENTAÇÃO CIRCULAR ","CPU.4","UN.",4,{"$f":"VLOOKUP(A40,CPU!$A$1:$N$4838,9)","v":384.67},{"$f":"VLOOKUP(A40,CPU!$A$1:$N$4838,10)","v":469.34},1877.36]
{"$rows_left_out":9}
{"sheet":"CPU","index":1,"n_rows":535,"n_cols":13,"rows_kept":535,"cut":false,"hidden":false,"merged":[[334,1,334,6],[335,1,335,6],[336,1,336,6],[293,0,305,0],[318,1,318,6],[319,1,319,6],[320,1,320,6],[322,1,322,3],[322,4,322,7],[323,2,323,5],[324,2,324,3],[325,1,325,7],[333,1,333,3],[333,5,333,6],[303,1,303,6],[304,1,304,6],[305,1,305,6],[307,1,307,3],[307,4,307,7],[308,2,308,5],[309,2,309,3],[310,1,310,7],[317,1,317,3],[317,5,317,6],[291,1,291,6],[275,0,291,0],[293,1,293,3],[293,4,293,7],[294,2,294,5],[295,2,295,3],[296,1,296,7],[302,1,302,3],[302,5,302,6],[275,1,275,3],[275,4,275,7],[276,2,276,5],[277,2,277,3],[278,1,278,7],[288,1,288,3],[288,5,288,6],[289,1,289,6],[290,1,290,6],[525,0,534,0],[525,1,525,3],[525,4,525,7],[526,2,526,5],[527,2,527,3],[528,1,528,7],[531,1,531,3],[531,5,531,6],[532,1,532,6],[533,1,533,6],[534,1,534,6],[514,0,523,0],[514,1,514,3],[514,4,514,7],[515,2,515,5],[516,2,516,3],[517,1,517,7],[520,1,520,3],[520,5,520,6],[521,1,521,6],[522,1,522,6],[523,1,523,6],[503,0,512,0],[503,1,503,3],[503,4,503,7],[504,2,504,5],[505,2,505,3],[506,1,506,7],[509,1,509,3],[509,5,509,6],[510,1,510,6],[511,1,511,6],[512,1,512,6],[485,0,501,0],[485,1,485,3],[485,4,485,7],[486,2,486,5],[487,2,487,3],[488,1,488,7],[498,1,498,3],[498,5,498,6],[499,1,499,6],[500,1,500,6],[501,1,501,6],[467,0,483,0],[467,1,467,3],[467,4,467,7],[468,2,468,5],[469,2,469,3],[470,1,470,7],[480,1,480,3],[480,5,480,6],[481,1,481,6],[482,1,482,6],[483,1,483,6],[449,0,465,0],[449,1,449,3],[449,4,449,7],[450,2,450,5],[451,2,451,3],[452,1,452,7],[462,1,462,3],[462,5,462,6],[463,1,463,6],[464,1,464,6],[465,1,465,6],[431,0,447,0],[431,1,431,3],[431,4,431,7],[432,2,432,5],[433,2,433,3],[434,1,434,7],[444,1,444,3],[444,5,444,6],[445,1,445,6],[446,1,446,6],[447,1,447,6],[256,0,273,0],[256,1,256,3],[256,4,256,7],[256,10,256,11],[257,2,257,5],[258,2,258,3],[259,1,259,7],[261,12,263,15],[270,1,270,3],[270,5,270,6],[271,1,271,6],[272,1,272,6],[273,1,273,6],[244,0,255,0],[244,1,244,3],[244,4,244,7],[244,10,244,11],[245,2,245,5],[246,2,246,3],[247,1,247,7],[251,1,251,3],[251,5,251,6],[252,1,252,6],[253,1,253,6],[254,1,254,6],[239,1,239,3],[239,5,239,6],[240,1,240,6],[241,1,241,6],[242,1,242,6],[218,0,229,0],[218,1,218,3],[218,4,218,7],[219,2,219,5],[220,2,220,3],[221,1,221,7],[226,1,226,3],[226,5,226,6],[227,1,227,6],[228,1,228,6],[229,1,229,6],[231,0,242,0],[231,1,231,3],[231,4,231,7],[232,2,232,5],[233,2,233,3],[234,1,234,7],[205,0,216,0],[205,1,205,3],[205,4,205,7],[205,10,205,11],[206,2,206,5],[207,2,207,3],[208,1,208,7],[213,1,213,3],[213,5,213,6],[214,1,214,6],[215,1,215,6],[216,1,216,6],[183,0,204,0],[183,1,183,3],[183,4,183,7],[183,10,183,11],[184,2,184,5],[185,2,185,3],[186,1,186,7],[188,8,188,9],[200,1,200,3],[200,5,200,6],[201,1,201,6],[202,1,202,6],[203,1,203,6],[164,0,182,0],[164,1,164,3],[164,4,164,7],[164,10,164,11],[165,2,165,5],[166,2,166,3],[167,1,167,7],[178,1,178,3],[178,5,178,6],[179,1,179,6],[180,1,180,6],[181,1,181,6],[145,0,163,0],[145,1,145,3],[145,4,145,7],[145,10,145,11],[146,2,146,5],[147,2,147,3],[148,1,148,7],[159,1,159,3],[159,5,159,6],[160,1,160,6],[161,1,161,6],[162,1,162,6],[125,0,143,0],[125,1,125,3],[125,4,125,7],[126,2,126,5],[127,2,127,3],[128,1,128,7],[140,1,140,3],[140,5,140,6],[141,1,141,6],[142,1,142,6],[143,1,143,6],[107,0,124,0],[107,1,107,3],[107,4,107,7],[107,10,107,11],[108,2,108,5],[109,2,109,3],[110,1,110,7],[120,1,120,3],[120,5,120,6],[121,1,121,6],[122,1,122,6],[123,1,123,6],[93,0,105,0],[93,1,93,3],[93,4,93,7],[94,2,94,5],[95,2,95,3],[96,1,96,7],[102,1,102,3],[102,5,102,6],[103,1,103,6],[104,1,104,6],[105,1,105,6],[80,0,92,0],[80,1,80,3],[80,4,80,7],[80,10,80,11],[81,2,81,5],[82,2,82,3],[83,1,83,7],[88,1,88,3],[88,5,88,6],[89,1,89,6],[90,1,90,6],[91,1,91,6],[64,0,79,0],[64,1,64,3],[64,4,64,7],[64,10,64,11],[65,2,65,5],[66,2,66,3],[67,1,67,7],[75,1,75,3],[75,5,75,6],[76,1,76,6],[77,1,77,6],[78,1,78,6],[46,0,63,0],[46,1,46,3],[46,4,46,7],[46,10,46,11],[47,2,47,5],[48,2,48,3],[49,1,49,7],[59,1,59,3],[59,5,59,6],[60,1,60,6],[61,1,61,6],[62,1,62,6],[32,0,45,0],[32,1,32,3],[32,4,32,7],[32,10,32,11],[33,2,33,5],[33,8,34,9],[34,2,34,3],[35,1,35,7],[41,1,41,3],[41,5,41,6],[42,1,42,6],[43,1,43,6],[44,1,44,6],[14,0,31,0],[14,1,14,3],[14,4,14,7],[14,10,14,11],[15,2,15,5],[15,8,16,9],[16,2,16,3],[17,1,17,7],[27,1,27,3],[27,5,27,6],[28,1,28,6],[29,1,29,6],[30,1,30,6],[0,0,13,0],[0,1,0,3],[0,4,0,7],[0,10,0,11],[1,2,1,5],[1,10,1,11],[2,2,2,3],[3,1,3,7],[9,1,9,3],[9,5,9,6],[10,1,10,6],[11,1,11,6],[12,1,12,6],[338,1,338,3],[338,4,338,7],[339,2,339,5],[340,2,340,3],[341,1,341,7],[350,1,350,3],[350,5,350,6],[351,1,351,6],[352,1,352,6],[367,1,367,3],[367,5,367,6],[368,1,368,6],[369,1,369,6],[370,1,370,6],[372,1,372,3],[372,4,372,7],[353,1,353,6],[355,1,355,3],[355,4,355,7],[356,2,356,5],[357,2,357,3],[358,1,358,7],[405,1,405,6],[406,1,406,6],[407,1,407,6],[373,2,373,5],[374,2,374,3],[375,1,375,7],[382,1,382,3],[382,5,382,6],[383,1,383,6],[384,1,384,6],[385,1,385,6],[427,1,427,6],[428,1,428,6],[429,1,429,6],[409,0,429,0],[307,0,320,0],[322,0,336,0],[338,0,353,0],[355,0,370,0],[372,0,385,0],[387,0,407,0],[409,1,409,3],[409,4,409,7],[410,2,410,5],[411,2,411,3],[412,1,412,7],[426,1,426,3],[426,5,426,6],[387,1,387,3],[387,4,387,7],[388,2,388,5],[389,2,389,3],[390,1,390,7],[404,1,404,3],[404,5,404,6]]}
[1,"CODEVASF",null,null," COMPOSIÇÃO DE PREÇO UNITÁRIO",null,null,null,{"$f":"H11","v":8191.7599999999993},{"$f":"H13","v":9994.77},"BDI CALCULADO:",null,{"$f":"ORÇAMENTO!I6","v":0.22010000000000002}]
[null,"OBRA:  ",{"$f":"ORÇAMENTO!C5","v":" PAVIMENTAÇÃO ASFÁLTICA EM CBUQ – BAIRRO MARINGÁ ( FORMIGA / MG ) - ITEM 2"},null,null,null,"DATA: ",{"$f":"ORÇAMENTO!C6","v":" SETEMBRO / 2023   "},null,null,"BDI DIFERENCIADO:",null,{"$f":"'BDI FORN'!D31/100","v":0.15}]
[null,"SERVIÇO:  ",{"$f":"VLOOKUP(A1,ORÇAMENTO!A10:I30,3)","v":"MOBILIZAÇÃO E DESMOBILIZAÇÃO"},null,"Referência:",{"$f":"VLOOKUP(A1,ORÇAMENTO!$A$10:$I$30,4)","v":"CPU.1"},"UNIDADE: ",{"$f":"VLOOKUP(A1,ORÇAMENTO!A10:I30,5)","v":"GL"}]
[]
[null,"TIPO ITEM","CODIGO ITEM","DESCRIÇÃO ITEM","UNIDADE ITEM","COEFICIENTE","PRECO UNITARIO","CUSTO TOTAL"]
[null,"COMPOSICAO",89876,"CAMINHÃO BASCULANTE 14 M3, COM CAVALO MECÂNICO DE CAPACIDADE MÁXIMA DE TRAÇÃO COMBINADO DE 36000 KG, POTÊNCIA 286 CV, INCLUSIVE SEMIREBOQUE COM CAÇAMBA METÁLICA","CHP DIURNO.",8,286.2,{"$f":"ROUNDDOWN(F6*G6,2)","v":2289.6}]
[null,"COMPOSICAO",89877,"CAMINHÃO BASCULANTE 14 M3, COM CAVALO MECÂNICO DE CAPACIDADE MÁXIMA DE TRAÇÃO COMBINADO DE 36000 KG, POTÊNCIA 286 CV, INCLUSIVE SEMIREBOQUE COM CAÇAMBA METÁLICA","CHI DIURNO.",8,82.81,{"$f":"ROUNDDOWN(F7*G7,2)","v":662.48}]
[null,"COMPOSICAO",5914640,"TRANSPORTE COM CAVALO MECÂNICO COM SEMIRREBOQUE COM CAPACIDADE DE 30 T - RODOVIA PAVIMENTADA","T.KM",1452,0.56999999999999995,{"$f":"ROUNDDOWN(F8*G8,2)","v":827.64}]
[null,"COMPOSIÇÃO",88316,"SERVENTE COM ENCARGOS COMPLEMENTARES","H",16,19.760000000000002,{"$f":"ROUNDDOWN(F9*G9,2)","v":316.16000000000003}]
[null,"PRODUÇÃO DA EQUIPE",null,null,0.5,"CUSTO ",null,{"$f":"SUM(H6:H9)","v":4095.8799999999997}]
[null,"TOTAL",{"$nulls":5},{"$f":"H10/E10","v":8191.7599999999993},"OK"]
[null,"BDI                %",{"$nulls":5},{"$f":"1+$M$1","v":1.2201}]
[null,"TOTAL DO SERVIÇO - R$",{"$nulls":5},{"$f":"ROUND(H11*H12,2)","v":9994.77}]
[]
[{"$f":"A1+1","v":2},"CODEVASF",null,null," COMPOSIÇÃO DE PREÇO UNITÁRIO",null,null,null,{"$f":"H29","v":64365.81},{"$f":"H31","v":78532.72}]
[null,"OBRA:  ",{"$f":"$C$2","v":" PAVIMENTAÇÃO ASFÁLTICA EM CBUQ – BAIRRO MARINGÁ ( FORMIGA / MG ) - ITEM 2"},null,null,null,"DATA: ",{"$f":"$H$2","v":" SETEMBRO / 2023   "}]
[null,"SERVIÇO:  ",{"$f":"VLOOKUP(A15,ORÇAMENTO!$A$10:$I$30,3)","v":"ADMINISTRAÇÃO LOCAL"},null,"SINAPI",{"$f":"VLOOKUP(A15,ORÇAMENTO!$A$10:$I$30,4)","v":"CPU.2"},"UNIDADE: ",{"$f":"VLOOKUP(A15,ORÇAMENTO!$A$10:$I$30,5)","v":"GL"}]
[]
[null,"TIPO ITEM","CODIGO ITEM","DESCRIÇÃO ITEM","UNIDADE ITEM","COEFICIENTE","PRECO UNITARIO","CUSTO TOTAL"]
[null,"INSUMO",14250,"ENERGIA ELÉTRICA","kwh",60,0.95,{"$f":"ROUNDDOWN(F20*G20,2)","v":57}]
[null,"INSUMO",44480,"TARIFA \"A\" - ÁGUA/ESGOTO ","m³",6,17.97,107.82]
[null,"COTAÇÃO","MERC.","TELEFONE (PLANO CONTROLE)","UNID",2,60,120]
[null,"INSUMO","ED-50155 SEINFRA","BANHEIRO QUÍMICO 110 X 120 X 230 CM COM MANUTENÇÃO (CONSIDERANDO OBRAS SIMULTÂNEAS)","MÊS",2,515,1030]
[null,"COMPOSICAO",90777,"Engenheiro Civil Júnior com encargos complementares","H",55,114.12,6276.6]
[null,"COMPOSICAO",90776,"Encarregado Geral com encargos complementares","H",110,57.73,6350.3]
[null,"COMPOSICAO",88321,"Tecnico de Laboratório com encargos complementares","H",110,45.45,4999.5]
[null,"COMPOSICAO",100309,"Tecnico de Segurança do Trabalho com encargos complementares","H",55,45.71,2514.0500000000002]
[null,"PRODUÇÃO DA EQUIPE",null,null,{"$f":"1/3","v":0.33333333333333331},"CUSTO ",null,{"$f":"SUM(H20:H27)","v":21455.27}]
[null,"TOTAL",{"$nulls":5},{"$f":"ROUND(H28/E28,2)","v":64365.81},"OK"]
[null,"BDI                %",{"$nulls":5},{"$f":"1+$M$1","v":1.2201}]
[null,"TOTAL DO SERVIÇO - R$",{"$nulls":5},{"$f":"ROUND(H29*H30,2)","v":78532.72}]
[]
[{"$f":"A15+1","v":3},"CODEVASF",null,null," COMPOSIÇÃO DE PREÇO UNITÁRIO",null,null,null,{"$f":"H43","v":7325.25},{"$f":"H45","v":8937.5400000000009}]
[null,"OBRA:  ",{"$f":"$C$2","v":" PAVIMENTAÇÃO ASFÁLTICA EM CBUQ – BAIRRO MARINGÁ ( FORMIGA / MG ) - ITEM 2"},null,null,null,"DATA: ",{"$f":"$H$2","v":" SETEMBRO / 2023   "}]
[null,"SERVIÇO:  ",{"$f":"VLOOKUP(A33,ORÇAMENTO!$A$10:$I$30,3)","v":"CANTEIRO DE OBRAS"},null,"SINAPI",{"$f":"VLOOKUP(A33,ORÇAMENTO!$A$10:$I$30,4)","v":"CPU.3"},"UNIDADE: ",{"$f":"VLOOKUP(A33,ORÇAMENTO!$A$10:$I$30,5)","v":"GL"}]
[]
[null,"TIPO ITEM","CODIGO ITEM","DESCRIÇÃO ITEM","UNIDADE ITEM","COEFICIENTE","PRECO UNITARIO","CUSTO TOTAL"]
[null,"INSUMO",10775,"ALUGUEL DE IMÓVEL OU CONTEINER QUE ATENDA AOS REQUISITOS MÍNIMOS PARA INSTALAÇÃO DO CANTEIRO DE OBRAS","MÊS",3,995,{"$f":"ROUNDDOWN(F38*G38,2)","v":2985}]
[null,"INSUMO",10779,"LOCACAO DE CONTAINER 2,30 X 4,30 M, ALT. 2,50 M, P/ SANITARIO, C/ 5 BACIAS, 1 LAVATORIO E 4 MICTORIOS","MÊS",3,1243.75,{"$f":"ROUNDDOWN(F39*G39,2)","v":3731.25}]
[null,"INSUMO","37525","TELA PLASTICA TECIDA LISTRADA BRANCA E LARANJA, TIPO GUARDA CORPO, EM POLIETILENO MONOFILADO, ROLO 1,20 X 50 M (L X C)","M",100,3.69,{"$f":"ROUNDDOWN(F40*G40,2)","v":369}]
{"$rows_left_out":496}
{"sheet":"BDI SERV","index":2,"n_rows":37,"n_cols":20,"rows_kept":37,"cut":false,"hidden":false,"merged":[[31,1,31,2],[32,0,34,5],[36,0,36,5],[0,1,2,4],[3,1,4,1],[3,2,4,2],[28,0,28,5],[30,1,30,2]]}
[null,"DETALHAMENTO DO BDI - SERVIÇOS"]
[]
[]
[null,"Item","Descrição dos Serviços","%","%"]
[null,null,null,"PV","CD"]
[]
[null,1,"ADMINISTRAÇÃO CENTRAL"," ",4.01]
[null,"1.1","ESCRITÓRIO CENTRAL"," "," "]
[null,"1.2","VIAGENS"," "," "]
[null,"1.3","OUTROS"," "," "]
[null," "," "," "," "]
[null,2,"IMPOSTOS E TAXAS",{"$f":"SUM(D13:D16)","v":6.0500000000000007},{"$f":"SUM(E13:E16)","v":7.5600000000000005}]
[null,"2.1","ISS (*)",{"$f":"3*0.8","v":2.4000000000000004},{"$f":"ROUND(D13*1.2515,2)","v":3}]
[null,"2.2","PIS",0.65,{"$f":"ROUND(D14*1.2515,2)","v":0.81}]
[null,"2.3","Cofins",3,{"$f":"ROUND(D15*1.2515,2)","v":3.75}]
[null,"2.4","CONTRIBUIÇÃO PREVIDENCIÁRIA SOBRE A RENDA BRUTA",0,{"$f":"ROUND(D16*1.2515,2)","v":0}]
[]
[null,3,"TAXA DE RISCO"," ",{"$f":"SUM(E19:E22)","v":0.96}]
[null,"3.1","SEGURO",null,0.2]
[null,"3.2","RISCO",null,0.56000000000000005]
[null,"3.3","GARANTIA",null,0.2]
[{"$nulls":19},{"$f":"1/0.82","v":1.2195121951219512}]
[null,4,"DESPESAS FINANCEIRAS"," ",1.1100000000000001]
[]
[null,5,"LUCRO",null,8]
[]
[null," ","BDI - CALCULADO"," ",{"$f":"ROUND((((1+(E7+E18)/100)*(1+E23/100)*(1+E25/100)/(1-D12/100)-1)*100),2)","v":22.01}]
[]
["BDI = ((1+((AC+S+R+G)/100))x(1+DF/100)x(1+L/100)/(1-I/100)-1)*100"]
[]
[null,"BDI (CALCULADO):",null,{"$f":"ROUND((((1+((E7+E18)/100))*(1+E23/100)*(1+E25/100))/(1-D12/100)-1)*100,2)","v":22.01},"%"]
[null," "]
["(*) ISS CONFORME LEI COMPLEMENTAR Nº 1 / 2002 E DECRETO Nº 8.170 / 2020\nDEDUÇÃO DE MATERIAIS - QUANT. ESTIMADA = 20%"]
[]
[]
[]
["BDI EM CONFORMIDADE COM OS ACÓRDÃOS Nº 2369/2011 e ACÓRDÃO Nº 2.622/2013 - TCU - PLENÁRIO"]

{"sheet":"BDI FORN","index":3,"n_rows":37,"n_cols":5,"rows_kept":37,"cut":false,"hidden":false,"merged":[[31,1,31,2],[32,0,34,5],[36,0,36,5],[0,1,2,4],[3,1,4,1],[3,2,4,2],[28,0,28,5],[30,1,30,2]]}
[null,"DETALHAMENTO DO BDI - FORNECIMENTO \n(MATERIAL ASFÁLTICO)"]
[]
[]
[null,"Item","Descrição dos Serviços","%","%"]
[null,null,null,"PV","CD"]
[]
[null,1,"ADMINISTRAÇÃO CENTRAL"," ",3.72]
[null,"1.1","ESCRITÓRIO CENTRAL"," "," "]
[null,"1.2","VIAGENS"," "," "]
[null,"1.3","OUTROS"," "," "]
[null," "," "," "," "]
[null,2,"IMPOSTOS E TAXAS",{"$f":"SUM(D13:D16)","v":3.65},{"$f":"SUM(E13:E16)","v":4.5600000000000005}]
[null,"2.1","ISS (*)",null,{"$f":"ROUND(D13*1.2515,2)","v":0}]
[null,"2.2","PIS",0.65,{"$f":"ROUND(D14*1.2515,2)","v":0.81}]
[null,"2.3","Cofins",3,{"$f":"ROUND(D15*1.2515,2)","v":3.75}]
[null,"2.4","CONTRIBUIÇÃO PREVIDENCIÁRIA SOBRE A RENDA BRUTA",0,{"$f":"ROUND(D16*1.2515,2)","v":0}]
[]
[null,3,"TAXA DE RISCO"," ",{"$f":"SUM(E19:E22)","v":0.82000000000000006}]
[null,"3.1","SEGURO",null,0.16]
[null,"3.2","RISCO",null,0.5]
[null,"3.3","GARANTIA",null,0.16]
[]
[null,4,"DESPESAS FINANCEIRAS"," ",0.94]
[]
[null,5,"LUCRO",null,5]
[]
[null," ","BDI - CALCULADO"," ",{"$f":"ROUND((((1+(E7+E18)/100)*(1+E23/100)*(1+E25/100)/(1-D12/100)-1)*100),2)","v":15}]
[]
["BDI = ((1+((AC+S+R+G)/100))x(1+DF/100)x(1+L/100)/(1-I/100)-1)*100"]
[]
[null,"BDI (CALCULADO):",null,{"$f":"ROUND((((1+((E7+E18)/100))*(1+E23/100)*(1+E25/100))/(1-D12/100)-1)*100,2)","v":15},"%"]
[null," "]
[]
[]
[]
[]
["BDI EM CONFORMIDADE COM OS ACÓRDÃOS Nº 2369/2011 e ACÓRDÃO Nº 2.622/2013 - TCU - PLENÁRIO"]

{"sheet":"CRONOGRAMA","index":4,"n_rows":21,"n_cols":9,"rows_kept":21,"cut":false,"hidden":false,"merged":[[17,1,18,2],[20,1,24,8],[13,0,14,0],[13,1,14,1],[13,2,14,2],[15,0,16,0],[15,1,16,1],[15,2,16,2],[9,0,10,0],[9,1,10,1],[9,2,10,2],[11,0,12,0],[11,1,12,1],[11,2,12,2],[3,1,3,7],[5,0,6,0],[5,1,6,1],[5,2,6,2],[7,0,8,0],[7,1,8,1],[7,2,8,2],[0,1,0,8],[1,1,2,1],[1,2,2,4],[1,6,1,8],[2,6,2,8]]}
[null,"CRONOGRAMA FÍSICO-FINANCEIRO"]
[null,"OBRA: ",{"$f":"ORÇAMENTO!C5","v":" PAVIMENTAÇÃO ASFÁLTICA EM CBUQ – BAIRRO MARINGÁ ( FORMIGA / MG ) - ITEM 2"},null,null,"VALOR:",{"$f":"ORÇAMENTO!I48","v":1100299.07}]
[{"$nulls":5},"PRAZO: ","90 DIAS "]
[]
[null,"ITEM","ETAPAS/DESCRIÇAO","FISICO/  FINANCEIRO","TOTAL    ETAPAS","MÊS 1","MÊS 2","MÊS 3","TOTAL"]
["A",{"$f":"VLOOKUP(A6,ORÇAMENTO!$A$9:$I$48,2)","v":1},{"$f":"VLOOKUP(A6,ORÇAMENTO!$A$9:$I$48,3)","v":"SERVIÇOS PRELIMINARES "},"FISICO ",{"$f":"ROUND(E7/$G$2,4)","v":9.1800000000000007E-2},0.35,0.35,0.3,{"$f":"SUM(F6:H6)","v":1}]
[null,null,null,"FINANCEIRO",{"$f":"ORÇAMENTO!I9","v":100988.5},{"$f":"ROUND($E$7*F6,2)","v":35345.980000000003},35345.980000000003,30296.55,{"$f":"SUM(F7:H7)","v":100988.51000000001}]
["B",{"$f":"VLOOKUP(A8,ORÇAMENTO!$A$9:$I$48,2)","v":2},{"$f":"VLOOKUP(A8,ORÇAMENTO!$A$9:$I$48,3)","v":"PAVIMENTAÇÃO"},"FISICO ",{"$f":"ROUND(E9/$G$2,4)","v":0.18340000000000001},0.1,0.45,0.45,{"$f":"SUM(F8:H8)","v":1}]
[null,null,null,"FINANCEIRO",{"$f":"ORÇAMENTO!I15","v":201779.8},{"$f":"ROUND($E$9*F8,2)","v":20177.98},90800.91,90800.91,{"$f":"SUM(F9:H9)","v":201779.8}]
["C",{"$f":"VLOOKUP(A10,ORÇAMENTO!$A$9:$I$48,2)","v":3},{"$f":"VLOOKUP(A10,ORÇAMENTO!$A$9:$I$48,3)","v":"TRANSPORTE DE MATERIAIS"},"FISICO ",{"$f":"ROUND(E11/$G$2,4)","v":6.9599999999999995E-2},0.1,0.45,0.45,{"$f":"SUM(F10:H10)","v":1}]
[null,null,null,"FINANCEIRO",{"$f":"ORÇAMENTO!I23","v":76581.740000000005},{"$f":"ROUND($E$11*F10,2)","v":7658.17},34461.78,34461.78,{"$f":"SUM(F11:H11)-0.04","v":76581.69}]
["D",{"$f":"VLOOKUP(A12,ORÇAMENTO!$A$9:$I$48,2)","v":4},{"$f":"VLOOKUP(A12,ORÇAMENTO!$A$9:$I$48,3)","v":"TRANSPORTE DE MATERIAL ASFÁLTICO (BDI DIFERENCIADO)"},"FISICO ",{"$f":"ROUND(E13/$G$2,4)","v":2.7400000000000001E-2},0.1,0.45,0.45,{"$f":"SUM(F12:H12)","v":1}]
[null,null,null,"FINANCEIRO",{"$f":"ORÇAMENTO!I26","v":30200.560000000001},{"$f":"ROUND($E$13*F12,2)","v":3020.06},13590.25,13590.25,{"$f":"SUM(F13:H13)-0.02","v":30200.54}]
["E",{"$f":"VLOOKUP(A14,ORÇAMENTO!$A$9:$I$48,2)","v":5},{"$f":"VLOOKUP(A14,ORÇAMENTO!$A$9:$I$48,3)","v":"DRENAGEM E OBRAS COMPLEMENTARES"},"FISICO ",{"$f":"ROUND(E15/$G$2,4)","v":0.2099},0.1,0.5,0.4,{"$f":"SUM(F14:H14)","v":1}]
[null,null,null,"FINANCEIRO",{"$f":"ORÇAMENTO!I29","v":230927.21},{"$f":"ROUND($E$15*F14,2)","v":23092.720000000001},115463.61,92370.880000000005,{"$f":"SUM(F15:H15)-0.02","v":230927.19000000003}]
["F",{"$f":"VLOOKUP(A16,ORÇAMENTO!$A$9:$I$48,2)","v":6},{"$f":"VLOOKUP(A16,ORÇAMENTO!$A$9:$I$48,3)","v":"FORNECIMENTOS - MATERIAL ASFÁLTICO (BDI DIFERENCIADO)"},"FISICO ",{"$f":"ROUND(E17/$G$2,4)","v":0.41789999999999999},0.1,0.45,0.45,{"$f":"SUM(F16:H16)","v":1}]
[null,null,null,"FINANCEIRO",{"$f":"ORÇAMENTO!I44","v":459821.26},{"$f":"ROUND($E$17*F16,2)","v":45982.13},206919.57,206919.57,{"$f":"SUM(F17:H17)-0.02","v":459821.25}]
[null,"TOTAL",null,"FISICO ",{"$f":"SUM(F18:H18)","v":1.000000009088438},{"$f":"F19/$E$19","v":0.12294570057211809},0.45131556823000857,0.42573874028631142,{"$f":"SUM(F18:H18)","v":1.000000009088438}]
[null,null,null,"FINANCEIRO",{"$f":"E11+E9+E7+E13+E17+E15","v":1100299.07},135277.04,496582.1,468439.94,{"$f":"SUM(F19:H19)-0.01","v":1100299.07}]
[]
[null,"OBSERVAÇÕES:"]