{"text_format":"2","workbook":"xlsx","n_sheets":5,"sheets":["ORÇAMENTO","CPU","BDI SERV","BDI FORN","CRONOGRAMA"],"not_rendered":{"charts":0,"images":2,"macros":0,"external_links":0,"defined_names":5,"comments":1,"pivot_tables":0},"unopened":[],"bounds":{"document_bytes":16777216,"sheet_cells":100000,"run_cost":"one","rows_first":2000,"rows_last":500,"rows_between":2000,"halvings":0,"cell_chars":16384,"cell_head_chars":4096},"cells_cut":0,"cells_raw":0,"read":"whole","date_system":"1900"}

{"sheet":"ORÇAMENTO","index":0,"n_rows":33,"n_cols":9,"rows_kept":33,"cut":false,"hidden":false,"merged":[[32,1,32,2],[0,0,7,0],[0,2,0,8],[1,2,1,8],[2,2,2,8],[4,2,4,8],[5,6,5,7],[6,1,6,2],[6,6,6,7]]}
["<---- NUMERAR SERVIÇOS PARA CPU",null,"Ministério do Desenvolvimento Regional"]
[null,null,"Companhia de Desenvolvimento dos Vales do São Francisco e do Parnaíba"]
[null,null,"1ª Superintendência Regional"]
[]
[null,"OBRA: ","RECAPEAMENTO DE VIAS URBANAS - BAIRRO GERALDO XAVIER E RESIDENCIAL ZÉ DO NATO (SÃO JOSÉ DA VARGINHA / MG) - ITEM 3"]
[null,"DATA:"," SETEMBRO / 2023   ",null,null,null,"BDI Serviços:",null,{"$f":"'BDI SERV'!D31/100","v":0.22010000000000002}]
[null,"PRAZO DE EXECUÇÃO:     120 DIAS",{"$nulls":4},"BDI Serviços:",null,{"$f":"'BDI FORN'!D31/100","v":0.15}]
[null,"ITEM","DISCRIMINAÇÃO","REFER.","UNID.","QUANT.","P. UNITÁRIO","P.UNIT.C/ BDI","P. TOTAL"]
["A",1,"SERVIÇOS PRELIMINARES ",{"$nulls":5},{"$f":"SUM(I10:I13)","v":139908.1}]
[1,"1.1","MOBILIZAÇÃO E DESMOBILIZAÇÃO","CPU.1","GL",1,{"$f":"VLOOKUP(A10,CPU!$A$1:$N$4577,9)","v":8742.3799999999992},{"$f":"VLOOKUP(A10,CPU!$A$1:$N$4577,10)","v":10666.58},{"$f":"ROUND(F10*H10,2)","v":10666.58}]
[2,"1.2","ADMINISTRAÇÃO LOCAL","CPU.2","GL",1,{"$f":"VLOOKUP(A11,CPU!$A$1:$N$4577,9)","v":94324.68},{"$f":"VLOOKUP(A11,CPU!$A$1:$N$4577,10)","v":115085.54},{"$f":"ROUND(F11*H11,2)","v":115085.54}]
[3,"1.3","CANTEIRO DE OBRAS","CPU.3","GL",1,{"$f":"VLOOKUP(A12,CPU!$A$1:$N$4577,9)","v":9564},{"$f":"VLOOKUP(A12,CPU!$A$1:$N$4577,10)","v":11669.04},{"$f":"ROUND(F12*H12,2)","v":11669.04}]
[4,"1.4","PLACA DE OBRA EM CHAPA DE AÇO GALVANIZADO",103689,"M2",6,{"$f":"VLOOKUP(A13,CPU!$A$1:$N$4577,9)","v":339.72},{"$f":"VLOOKUP(A13,CPU!$A$1:$N$4577,10)","v":414.49},{"$f":"ROUND(F13*H13,2)","v":2486.94}]
["B",2,"PAVIMENTAÇÃO",{"$nulls":5},{"$f":"SUM(I15:I17)","v":261660.76}]
[10,"2.1","RECOMPOSIÇÃO DE BASE E OU SUB-BASE PARA REMENDO PROFUNDO DE BICA CORRIDA - INCLUSO RETIRADA E COLOCAÇÃO DO MATERIAL","101835a","M3",39.97999999999999,{"$f":"VLOOKUP(A15,CPU!$A$1:$N$4577,9)","v":214.74},{"$f":"VLOOKUP(A15,CPU!$A$1:$N$4577,10)","v":262},{"$f":"ROUND(F15*H15,2)","v":10474.76}]
[11,"2.6","PINTURA DE LIGAÇÃO COM EMULSÃO ASFÁLTICA RR-1C",96402,"M2",52000,{"$f":"VLOOKUP(A16,CPU!$A$1:$N$4577,9)","v":0.93000000000000016},{"$f":"VLOOKUP(A16,CPU!$A$1:$N$4577,10)","v":1.1299999999999999},58760]
[12,"2.7","EXECUÇÃO DE PAVIMENTO COM APLICAÇÃO DE CONCRETO ASFÁLTICO USINADO A QUENTE (CBUQ), CAMADA DE ROLAMENTO - EXCLUSIVE TRANSPORTE",95995,"M3",1300,{"$f":"VLOOKUP(A17,CPU!$A$1:$N$4577,9)","v":121.32},{"$f":"VLOOKUP(A17,CPU!$A$1:$N$4577,10)","v":148.02000000000001},192426]
["C",3,"TRANSPORTE DE MATERIAIS",{"$nulls":5},{"$f":"SUM(I19:I20)","v":2596}]
[13,"3.1","TRANSPORTE COM CAMINHÃO BASCULANTE, EM VIA URBANA PAVIMENTADA",95427,"M3XKM",2999.9999999999995,{"$f":"VLOOKUP(A19,CPU!$A$1:$N$4577,9)","v":0.64999999999999991},{"$f":"VLOOKUP(A19,CPU!$A$1:$N$4577,10)","v":0.79},{"$f":"ROUND(F19*H19,2)","v":2370}]
[14,"3.2","TRANSPORTE COM CAMINHÃO CARROCERIA 9T, EM VIA URBANA PAVIMENTADA",100947,"TXKM",200,{"$f":"VLOOKUP(A20,CPU!$A$1:$N$4577,9)","v":0.92999999999999994},{"$f":"VLOOKUP(A20,CPU!$A$1:$N$4577,10)","v":1.1299999999999999},{"$f":"ROUND(F20*H20,2)","v":226}]
["D",4,"TRANSPORTE DE MATERIAL ASFÁLTICO (BDI DIFERENCIADO)",{"$nulls":5},{"$f":"SUM(I22:I23)","v":48296}]
[15,"4.1","TRANSPORTE DE MASSA ASFÁLTICA COM CAMINHÃO BASCULANTE, EM VIA URBANA PAVIMENTADA (BDI DIFERENCIADO)",95430,"TXKM",100000,{"$f":"VLOOKUP(A22,CPU!$A$1:$N$4577,9)","v":0.41},{"$f":"VLOOKUP(A22,CPU!$A$1:$N$4577,10)","v":0.47},{"$f":"ROUND(F22*H22,2)","v":47000}]
[16,"4.2","TRANSPORTE COM CAMINHÃO TANQUE DE TRANSPORTE DE MATERIAL ASFÁLTICO DE 30000 L, EM VIA URBANA PAVIMENTADA (BDI DIFERENCIADO)",102331,"TXKM",2400,{"$f":"VLOOKUP(A23,CPU!$A$1:$N$4577,9)","v":0.47},{"$f":"VLOOKUP(A23,CPU!$A$1:$N$4577,10)","v":0.54},{"$f":"ROUND(F23*H23,2)","v":1296}]
["E",5,"DRENAGEM E OBRAS COMPLEMENTARES",{"$nulls":5},{"$f":"SUM(I25:I29)","v":142413.4}]
[17,"5.1","ALTEAMENTO DE TAMPAO DE PV EM ATE 20 CM","19.22.04","UN.",34,{"$f":"VLOOKUP(A25,CPU!$A$1:$N$4577,9)","v":136},{"$f":"VLOOKUP(A25,CPU!$A$1:$N$4577,10)","v":165.93},{"$f":"ROUND(F25*H25,2)","v":5641.62}]
[18,"5.2","FORNECIMENTO E INSTALAÇÃO DE PLACA DE SINALIZAÇÃO VIÁRIA - REGULAMENTAÇÃO ","CPU.4","UN.",22,{"$f":"VLOOKUP(A26,CPU!$A$1:$N$4577,9)","v":384.67},{"$f":"VLOOKUP(A26,CPU!$A$1:$N$4577,10)","v":469.34},10325.48]
[19,"5.3","PINTURA DE SÍMBOLOS E TEXTOS COM TINTA ACRÍLICA, DEMARCAÇÃO COM FITA ADESIVA E APLICAÇÃO COM ROLO (PARE, ETC.)",102513,"UN.",33,{"$f":"VLOOKUP(A27,CPU!$A$1:$N$4577,9)","v":44.83},{"$f":"VLOOKUP(A27,CPU!$A$1:$N$4577,10)","v":54.7},1805.1]
[20,"5.4","FORNECIMENTO E INSTALAÇÃO DE PLACA DE AÇO PARA IDENTIFICACAO DE RUA, *45 CM X 20* CM, INCLUSIVE SUPORTE EM TUBO DE AÇO GALVANIZADO (02 PLACAS POR SUPORTE)                                  ","CPU.5","UN.",80,{"$f":"VLOOKUP(A28,CPU!$A$1:$N$4577,9)","v":375.29},{"$f":"VLOOKUP(A28,CPU!$A$1:$N$4577,10)","v":457.89},36631.199999999997]
[21,"5.5","PINTURA DE EIXO VIÁRIO SOBRE ASFALTO COM TINTA RETRORREFLETIVA A BASE DE RESINA ACRÍLICA COM MICROESFERAS DE VIDRO, APLICAÇÃO MECÂNICA COM DEMARCADORA AUTOPROPELIDA",102512,"M",13000,{"$f":"VLOOKUP(A29,CPU!$A$1:$N$4577,9)","v":5.5500000000000007},{"$f":"VLOOKUP(A29,CPU!$A$1:$N$4577,10)","v":6.77},88010]
["F",6,"FORNECIMENTOS - MATERIAL ASFÁLTICO (BDI DIFERENCIADO)",{"$nulls":5},{"$f":"SUM(I31:I32)","v":2121230.65}]
[26,"6.1","AQUISIÇÃO DE EMULSAO ASFALTICA CATIONICA RR-1C - EXCLUSIVE TRANSPORTE","CPU.6","T",24.000000000000004,{"$f":"VLOOKUP(A31,CPU!$A$1:$N$4577,9)","v":2736.39},{"$f":"VLOOKUP(A31,CPU!$A$1:$N$4577,10)","v":3146.85},{"$f":"ROUND(F31*H31,2)","v":75524.399999999994}]
[27,"6.2","AQUISIÇÃO DE CONCRETO BETUMINOSO USINADO A QUENTE (CBUQ) PARA PAVIMENTACAO ASFALTICA, PADRAO DNIT, FAIXA C, COM CAP 50/70 - EXCLUSIVE TRANSPORTE","CPU.7","T",3325.0000000000005,{"$f":"VLOOKUP(A32,CPU!$A$1:$N$4577,9)","v":535},{"$f":"VLOOKUP(A32,CPU!$A$1:$N$4577,10)","v":615.25},{"$f":"ROUND(F32*H32,2)","v":2045706.25}]
[null,"TOTAL GERAL DA OBRA COM BDI ",{"$nulls":6},{"$f":"SUM(I9,I14,I18,I24,I30,I21)","v":2716104.91}]

{"sheet":"CPU","index":1,"n_rows":274,"n_cols":13,"rows_kept":274,"cut":false,"hidden":false,"merged":[[0,0,13,0],[0,1,0,3],[0,4,0,7],[0,10,0,11],[1,2,1,5],[1,10,1,11],[2,2,2,3],[3,1,3,7],[9,1,9,3],[9,5,9,6],[10,1,10,6],[11,1,11,6],[12,1,12,6],[14,0,31,0],[14,1,14,3],[14,4,14,7],[14,10,14,11],[15,2,15,5],[15,8,16,9],[16,2,16,3],[17,1,17,7],[27,1,27,3],[27,5,27,6],[28,1,28,6],[29,1,29,6],[30,1,30,6],[32,0,45,0],[32,1,32,3],[32,4,32,7],[32,10,32,11],[33,2,33,5],[33,8,34,9],[34,2,34,3],[35,1,35,7],[41,1,41,3],[41,5,41,6],[42,1,42,6],[43,1,43,6],[44,1,44,6],[46,0,63,0],[46,1,46,3],[46,4,46,7],[46,10,46,11],[47,2,47,5],[48,2,48,3],[49,1,49,7],[59,1,59,3],[59,5,59,6],[60,1,60,6],[61,1,61,6],[62,1,62,6],[64,0,79,0],[64,1,64,3],[64,4,64,7],[64,10,64,11],[65,2,65,5],[66,2,66,3],[67,1,67,7],[75,1,75,3],[75,5,75,6],[76,1,76,6],[77,1,77,6],[78,1,78,6],[80,0,98,0],[80,1,80,3],[80,4,80,7],[80,10,80,11],[81,2,81,5],[82,2,82,3],[83,1,83,7],[94,1,94,3],[94,5,94,6],[95,1,95,6],[96,1,96,6],[97,1,97,6],[99,0,120,0],[99,1,99,3],[99,4,99,7],[99,10,99,11],[100,2,100,5],[101,2,101,3],[102,1,102,7],[104,8,104,9],[116,1,116,3],[116,5,116,6],[117,1,117,6],[118,1,118,6],[119,1,119,6],[121,0,132,0],[121,1,121,3],[121,4,121,7],[121,10,121,11],[122,2,122,5],[123,2,123,3],[124,1,124,7],[129,1,129,3],[129,5,129,6],[130,1,130,6],[131,1,131,6],[132,1,132,6],[134,0,145,0],[134,1,134,3],[134,4,134,7],[135,2,135,5],[136,2,136,3],[137,1,137,7],[142,1,142,3],[142,5,142,6],[143,1,143,6],[144,1,144,6],[145,1,145,6],[147,0,158,0],[147,1,147,3],[147,4,147,7],[148,2,148,5],[149,2,149,3],[150,1,150,7],[155,1,155,3],[155,5,155,6],[156,1,156,6],[157,1,157,6],[158,1,158,6],[160,0,171,0],[160,1,160,3],[160,4,160,7],[160,10,160,11],[161,2,161,5],[162,2,162,3],[163,1,163,7],[167,1,167,3],[167,5,167,6],[168,1,168,6],[169,1,169,6],[170,1,170,6],[172,0,184,0],[172,1,172,3],[172,4,172,7],[172,10,172,11],[173,2,173,5],[174,2,174,3],[175,1,175,7],[181,1,181,3],[181,5,181,6],[182,1,182,6],[183,1,183,6],[184,1,184,6],[186,0,201,0],[186,1,186,3],[186,4,186,7],[187,2,187,5],[188,2,188,3],[189,1,189,7],[198,1,198,3],[198,5,198,6],[199,1,199,6],[200,1,200,6],[201,1,201,6],[203,0,216,0],[203,1,203,3],[203,4,203,7],[204,2,204,5],[205,2,205,3],[206,1,206,7],[213,1,213,3],[213,5,213,6],[214,1,214,6],[215,1,215,6],[216,1,216,6],[218,0,233,0],[218,1,218,3],[218,4,218,7],[219,2,219,5],[220,2,220,3],[221,1,221,7],[230,1,230,3],[230,5,230,6],[231,1,231,6],[232,1,232,6],[233,1,233,6],[235,0,251,0],[235,1,235,3],[235,4,235,7],[236,2,236,5],[237,2,237,3],[238,1,238,7],[248,1,248,3],[248,5,248,6],[249,1,249,6],[250,1,250,6],[251,1,251,6],[253,0,262,0],[253,1,253,3],[253,4,253,7],[254,2,254,5],[255,2,255,3],[256,1,256,7],[259,1,259,3],[259,5,259,6],[260,1,260,6],[261,1,261,6],[262,1,262,6],[264,0,273,0],[264,1,264,3],[264,4,264,7],[265,2,265,5],[266,2,266,3],[267,1,267,7],[270,1,270,3],[270,5,270,6],[271,1,271,6],[272,1,272,6],[273,1,273,6]]}
[1,"CODEVASF",null,null," COMPOSIÇÃO DE PREÇO UNITÁRIO",null,null,null,{"$f":"H11","v":8742.3799999999992},{"$f":"H13","v":10666.58},"BDI CALCULADO:",null,{"$f":"ORÇAMENTO!I6","v":0.22010000000000002}]
[null,"OBRA:  ",{"$f":"ORÇAMENTO!C5","v":"RECAPEAMENTO DE VIAS URBANAS - BAIRRO GERALDO XAVIER E RESIDENCIAL ZÉ DO NATO (SÃO JOSÉ DA VARGINHA / MG) - ITEM 3"},null,null,null,"DATA: ",{"$f":"ORÇAMENTO!C6","v":" SETEMBRO / 2023   "},null,null,"BDI DIFERENCIADO:",null,{"$f":"'BDI FORN'!D31/100","v":0.15}]
[null,"SERVIÇO:  ",{"$f":"VLOOKUP(A1,ORÇAMENTO!A10:I25,3)","v":"MOBILIZAÇÃO E DESMOBILIZAÇÃO"},null,"Referência:",{"$f":"VLOOKUP(A1,ORÇAMENTO!$A$10:$I$25,4)","v":"CPU.1"},"UNIDADE: ",{"$f":"VLOOKUP(A1,ORÇAMENTO!A10:I25,5)","v":"GL"}]
[]
[null,"TIPO ITEM","CODIGO ITEM","DESCRIÇÃO ITEM","UNIDADE ITEM","COEFICIENTE","PRECO UNITARIO","CUSTO TOTAL"]
[null,"COMPOSICAO",89876,"CAMINHÃO BASCULANTE 14 M3, COM CAVALO MECÂNICO DE CAPACIDADE MÁXIMA DE TRAÇÃO COMBINADO DE 36000 KG, POTÊNCIA 286 CV, INCLUSIVE SEMIREBOQUE COM CAÇAMBA METÁLICA","CHP DIURNO.",8,286.2,{"$f":"ROUNDDOWN(F6*G6,2)","v":2289.6}]
[null,"COMPOSICAO",89877,"CAMINHÃO BASCULANTE 14 M3, COM CAVALO MECÂNICO DE CAPACIDADE MÁXIMA DE TRAÇÃO COMBINADO DE 36000 KG, POTÊNCIA 286 CV, INCLUSIVE SEMIREBOQUE COM CAÇAMBA METÁLICA","CHI DIURNO.",8,82.81,{"$f":"ROUNDDOWN(F7*G7,2)","v":662.48}]
[null,"COMPOSICAO",5914640,"TRANSPORTE COM CAVALO MECÂNICO COM SEMIRREBOQUE COM CAPACIDADE DE 30 T - RODOVIA PAVIMENTADA","T.KM",1935,0.56999999999999995,{"$f":"ROUNDDOWN(F8*G8,2)","v":1102.95}]
[null,"COMPOSIÇÃO",88316,"SERVENTE COM ENCARGOS COMPLEMENTARES","H",16,19.760000000000002,{"$f":"ROUNDDOWN(F9*G9,2)","v":316.16000000000003}]
[null,"PRODUÇÃO DA EQUIPE",null,null,0.5,"CUSTO ",null,{"$f":"SUM(H6:H9)","v":4371.1899999999996}]
[null,"TOTAL",{"$nulls":5},{"$f":"H10/E10","v":8742.3799999999992},"OK"]
[null,"BDI                %",{"$nulls":5},{"$f":"1+$M$1","v":1.2201}]
[null,"TOTAL DO SERVIÇO - R$",{"$nulls":5},{"$f":"ROUND(H11*H12,2)","v":10666.58}]
[]
[{"$f":"A1+1","v":2},"CODEVASF",null,null," COMPOSIÇÃO DE PREÇO UNITÁRIO",null,null,null,{"$f":"H29","v":94324.68},{"$f":"H31","v":115085.54}]
[null,"OBRA:  ",{"$f":"$C$2","v":"RECAPEAMENTO DE VIAS URBANAS - BAIRRO GERALDO XAVIER E RESIDENCIAL ZÉ DO NATO (SÃO JOSÉ DA VARGINHA / MG) - ITEM 3"},null,null,null,"DATA: ",{"$f":"$H$2","v":" SETEMBRO / 2023   "}]
[null,"SERVIÇO:  ",{"$f":"VLOOKUP(A15,ORÇAMENTO!$A$10:$I$25,3)","v":"ADMINISTRAÇÃO LOCAL"},null,"SINAPI",{"$f":"VLOOKUP(A15,ORÇAMENTO!$A$10:$I$25,4)","v":"CPU.2"},"UNIDADE: ",{"$f":"VLOOKUP(A15,ORÇAMENTO!$A$10:$I$25,5)","v":"GL"}]
[]
[null,"TIPO ITEM","CODIGO ITEM","DESCRIÇÃO ITEM","UNIDADE ITEM","COEFICIENTE","PRECO UNITARIO","CUSTO TOTAL"]
[null,"INSUMO",14250,"ENERGIA ELÉTRICA","kwh",60,0.95,{"$f":"ROUNDDOWN(F20*G20,2)","v":57}]
[null,"INSUMO",44480,"TARIFA \"A\" - ÁGUA/ESGOTO ","m³",6,17.97,107.82]
[null,"COTAÇÃO","MERC.","TELEFONE (PLANO CONTROLE)","UNID",2,59.9,119.8]
[null,"INSUMO","ED-50155 SEINFRA","BANHEIRO QUÍMICO 110 X 120 X 230 CM COM MANUTENÇÃO (CONSIDERANDO OBRAS SIMULTÂNEAS)","MÊS",1,515,515]
[null,"COMPOSICAO",90777,"Engenheiro Civil Júnior com encargos complementares","H",55,114.12,6276.6]
[null,"COMPOSICAO",90776,"Encarregado Geral com encargos complementares","H",220,57.73,12700.6]
[null,"COMPOSICAO",88321,"Tecnico de Laboratório com encargos complementares","H",55,45.45,2499.75]
[null,"COMPOSICAO",90772,"Auxiliar de escritório com encargos complementares","H",55,23.72,1304.5999999999999]
[null,"PRODUÇÃO DA EQUIPE",null,null,0.25,"CUSTO ",null,{"$f":"SUM(H20:H27)","v":23581.17}]
[null,"TOTAL",{"$nulls":5},{"$f":"ROUND(H28/E28,2)","v":94324.68},"OK"]
[null,"BDI                %",{"$nulls":5},{"$f":"1+$M$1","v":1.2201}]
[null,"TOTAL DO SERVIÇO - R$",{"$nulls":5},{"$f":"ROUND(H29*H30,2)","v":115085.54}]
[]
[{"$f":"A15+1","v":3},"CODEVASF",null,null," COMPOSIÇÃO DE PREÇO UNITÁRIO",null,null,null,{"$f":"H43","v":9564},{"$f":"H45","v":11669.04}]
[null,"OBRA:  ",{"$f":"$C$2","v":"RECAPEAMENTO DE VIAS URBANAS - BAIRRO GERALDO XAVIER E RESIDENCIAL ZÉ DO NATO (SÃO JOSÉ DA VARGINHA / MG) - ITEM 3"},null,null,null,"DATA: ",{"$f":"$H$2","v":" SETEMBRO / 2023   "}]
[null,"SERVIÇO:  ",{"$f":"VLOOKUP(A33,ORÇAMENTO!$A$10:$I$25,3)","v":"CANTEIRO DE OBRAS"},null,"SINAPI",{"$f":"VLOOKUP(A33,ORÇAMENTO!$A$10:$I$25,4)","v":"CPU.3"},"UNIDADE: ",{"$f":"VLOOKUP(A33,ORÇAMENTO!$A$10:$I$25,5)","v":"GL"}]
[]
[null,"TIPO ITEM","CODIGO ITEM","DESCRIÇÃO ITEM","UNIDADE ITEM","COEFICIENTE","PRECO UNITARIO","CUSTO TOTAL"]
[null,"INSUMO",10775,"LOCACAO DE CONTAINER 2,30 X 6,00 M, ALT. 2,50 M, COM 1 SANITARIO, PARA ESCRITORIO, COMPLETO, SEM DIVISORIAS INTERNAS","MÊS",4,995,{"$f":"ROUNDDOWN(F38*G38,2)","v":3980}]
[null,"INSUMO",10779,"LOCACAO DE CONTAINER 2,30 X 4,30 M, ALT. 2,50 M, P/ SANITARIO, C/ 5 BACIAS, 1 LAVATORIO E 4 MICTORIOS","MÊS",4,1243.75,{"$f":"ROUNDDOWN(F39*G39,2)","v":4975}]
[null,"INSUMO","37525","TELA PLASTICA TECIDA LISTRADA BRANCA E LARANJA, TIPO GUARDA CORPO, EM POLIETILENO MONOFILADO, ROLO 1,20 X 50 M (L X C)","M",100,3.69,{"$f":"ROUNDDOWN(F40*G40,2)","v":369}]
[null,"COMPOSICAO"," - ","PLACA DE SINALIZAÇÃO - \"PERIGO - OBRAS A FRENTE\" - FORNECIMENTO E MOVIMENTAÇÃO","UNID.",12,20,{"$f":"ROUNDDOWN(F41*G41,2)","v":240}]
[null,"PRODUÇÃO DA EQUIPE",null,null,1,"CUSTO ",null,{"$f":"SUM(H38:H41)","v":9564}]
[null,"TOTAL",{"$nulls":5},{"$f":"H42/E42","v":9564},"OK"]
[null,"BDI                %",{"$nulls":5},{"$f":"1+$M$1","v":1.2201}]
[null,"TOTAL DO SERVIÇO - R$",{"$nulls":5},{"$f":"ROUND(H43*H44,2)","v":11669.04}]
[]
[{"$f":"A33+1","v":4},"CODEVASF",null,null," COMPOSIÇÃO DE PREÇO UNITÁRIO",null,null,null,{"$f":"H61","v":339.72},{"$f":"H63","v":414.49}]
[null,"OBRA:  ",{"$f":"$C$2","v":"RECAPEAMENTO DE VIAS URBANAS - BAIRRO GERALDO XAVIER E RESIDENCIAL ZÉ DO NATO (SÃO JOSÉ DA VARGINHA / MG) - ITEM 3"},null,null,null,"DATA: ",{"$f":"$H$2","v":" SETEMBRO / 2023   "}]
[null,"SERVIÇO:  ",{"$f":"VLOOKUP(A47,ORÇAMENTO!$A$10:$I$25,3)","v":"PLACA DE OBRA EM CHAPA DE AÇO GALVANIZADO"},null,"SINAPI",{"$f":"VLOOKUP(A47,ORÇAMENTO!$A$10:$I$25,4)","v":103689},"UNIDADE: ",{"$f":"VLOOKUP(A47,ORÇAMENTO!$A$10:$I$25,5)","v":"M2"}]
[]
[null,"TIPO ITEM","CODIGO ITEM","DESCRIÇÃO ITEM","UNIDADE ITEM","COEFICIENTE","PRECO UNITARIO","CUSTO TOTAL"]
[null,"INSUMO","4509","SARRAFO *2,5 X 10* CM EM PINUS, MISTA OU EQUIVALENTE DA REGIAO - BRUTA","M","3,2083000","4,41",{"$f":"ROUNDDOWN(F52*G52,2)","v":14.14}]
[null,"INSUMO","4813","PLACA DE OBRA (PARA CONSTRUCAO CIVIL) EM CHAPA GALVANIZADA *N. 22*, ADESIVADA, DE *2,4 X 1,2* M (SEM POSTES PARA FIXACAO)","M2","1,0000000","250,00",250]
[null,"INSUMO","5065","PREGO DE ACO POLIDO COM CABECA 10 X 10 (7/8 X 17)","KG","0,0113000","36,57",0.41]
[null,"INSUMO","5069","PREGO DE ACO POLIDO COM CABECA 17 X 27 (2 1/2 X 11)","KG","0,0132000","19,59",0.25]
[null,"COMPOSICAO","88262","CARPINTEIRO DE FORMAS COM ENCARGOS COMPLEMENTARES","H","0,3729000","27,05",10.08]
[null,"COMPOSICAO","88316","SERVENTE COM ENCARGOS COMPLEMENTARES","H","1,1186000","19,76",22.1]
[null,"INSUMO",4115,"MADEIRA ROLICA TRATADA, D = 12 A 15 CM, H = 3,00 M, EM EUCALIPTO OU EQUIVALENTE","M",2,21.37,42.74]
[{"$nulls":7},0]
[null,"PRODUÇÃO DA EQUIPE",null,null,1,"CUSTO ",null,{"$f":"SUM(H52:H59)","v":339.72}]
{"$rows_left_out":215}
{"sheet":"BDI SERV","index":2,"n_rows":37,"n_cols":20,"rows_kept":37,"cut":false,"hidden":false,"merged":[[31,1,31,2],[32,0,34,5],[36,0,36,5],[0,1,2,4],[3,1,4,1],[3,2,4,2],[28,0,28,5],[30,1,30,2]]}
[null,"DETALHAMENTO DO BDI - SERVIÇOS"]
[]
[]
[null,"Item","Descrição dos Serviços","%","%"]
[null,null,null,"PV","CD"]
[]
[null,1,"ADMINISTRAÇÃO CENTRAL"," ",4.01]
[null,"1.1","ESCRITÓRIO CENTRAL"," "," "]
[null,"1.2","VIAGENS"," "," "]
[null,"1.3","OUTROS"," "," "]
[null," "," "," "," "]
[null,2,"IMPOSTOS E TAXAS",{"$f":"SUM(D13:D16)","v":5.65},{"$f":"SUM(E13:E16)","v":7.0600000000000005}]
[null,"2.1","ISS (*)",2,{"$f":"ROUND(D13*1.2515,2)","v":2.5}]
[null,"2.2","PIS",0.65,{"$f":"ROUND(D14*1.2515,2)","v":0.81}]
[null,"2.3","Cofins",3,{"$f":"ROUND(D15*1.2515,2)","v":3.75}]
[null,"2.4","CONTRIBUIÇÃO PREVIDENCIÁRIA SOBRE A RENDA BRUTA",0,{"$f":"ROUND(D16*1.2515,2)","v":0}]
[]
[null,3,"TAXA DE RISCO"," ",{"$f":"SUM(E19:E22)","v":0.96}]
[null,"3.1","SEGURO",null,0.2]
[null,"3.2","RISCO",null,0.56000000000000005]
[null,"3.3","GARANTIA",null,0.2]
[{"$nulls":19},{"$f":"1/0.82","v":1.2195121951219512}]
[null,4,"DESPESAS FINANCEIRAS"," ",1.54]
[]
[null,5,"LUCRO",null,8]
[]
[null," ","BDI - CALCULADO"," ",{"$f":"ROUND((((1+(E7+E18)/100)*(1+E23/100)*(1+E25/100)/(1-D12/100)-1)*100),2)","v":22.01}]
[]
["BDI = ((1+((AC+S+R+G)/100))x(1+DF/100)x(1+L/100)/(1-I/100)-1)*100"]
[]
[null,"BDI (CALCULADO):",null,{"$f":"ROUND((((1+((E7+E18)/100))*(1+E23/100)*(1+E25/100))/(1-D12/100)-1)*100,2)","v":22.01},"%"]
[null," "]
["(*) ISS CONFORME LEI MUNICIPAL Nº 484 / 2009 - VIDE DECLARAÇÃO DA PREFEITURA"]
[]
[]
[]
["BDI EM CONFORMIDADE COM OS ACÓRDÃOS Nº 2369/2011 e ACÓRDÃO Nº 2.622/2013 - TCU - PLENÁRIO"]

{"sheet":"BDI FORN","index":3,"n_rows":37,"n_cols":5,"rows_kept":37,"cut":false,"hidden":false,"merged":[[31,1,31,2],[32,0,34,5],[36,0,36,5],[0,1,2,4],[3,1,4,1],[3,2,4,2],[28,0,28,5],[30,1,30,2]]}
[null,"DETALHAMENTO DO BDI - FORNECIMENTO \n(MATERIAL ASFÁLTICO)"]
[]
[]
[null,"Item","Descrição dos Serviços","%","%"]
[null,null,null,"PV","CD"]
[]
[null,1,"ADMINISTRAÇÃO CENTRAL"," ",3.72]
[null,"1.1","ESCRITÓRIO CENTRAL"," "," "]
[null,"1.2","VIAGENS"," "," "]
[null,"1.3","OUTROS"," "," "]
[null," "," "," "," "]
[null,2,"IMPOSTOS E TAXAS",{"$f":"SUM(D13:D16)","v":3.65},{"$f":"SUM(E13:E16)","v":4.5600000000000005}]
[null,"2.1","ISS (*)",null,{"$f":"ROUND(D13*1.2515,2)","v":0}]
[null,"2.2","PIS",0.65,{"$f":"ROUND(D14*1.2515,2)","v":0.81}]
[null,"2.3","Cofins",3,{"$f":"ROUND(D15*1.2515,2)","v":3.75}]
[null,"2.4","CONTRIBUIÇÃO PREVIDENCIÁRIA SOBRE A RENDA BRUTA",0,{"$f":"ROUND(D16*1.2515,2)","v":0}]
[]
[null,3,"TAXA DE RISCO"," ",{"$f":"SUM(E19:E22)","v":0.82000000000000006}]
[null,"3.1","SEGURO",null,0.16]
[null,"3.2","RISCO",null,0.5]
[null,"3.3","GARANTIA",null,0.16]
[]
[null,4,"DESPESAS FINANCEIRAS"," ",0.94]
[]
[null,5,"LUCRO",null,5]
[]
[null," ","BDI - CALCULADO"," ",{"$f":"ROUND((((1+(E7+E18)/100)*(1+E23/100)*(1+E25/100)/(1-D12/100)-1)*100),2)","v":15}]
[]
["BDI = ((1+((AC+S+R+G)/100))x(1+DF/100)x(1+L/100)/(1-I/100)-1)*100"]
[]
[null,"BDI (CALCULADO):",null,{"$f":"ROUND((((1+((E7+E18)/100))*(1+E23/100)*(1+E25/100))/(1-D12/100)-1)*100,2)","v":15},"%"]
[null," "]
[]
[]
[]
[]
["BDI EM CONFORMIDADE COM OS ACÓRDÃOS Nº 2369/2011 e ACÓRDÃO Nº 2.622/2013 - TCU - PLENÁRIO"]

{"sheet":"CRONOGRAMA","index":4,"n_rows":21,"n_cols":10,"rows_kept":21,"cut":false,"hidden":false,"merged":[[0,1,0,9],[1,1,2,1],[1,2,2,4],[1,6,1,9],[2,6,2,9],[3,1,3,8],[5,0,6,0],[5,1,6,1],[5,2,6,2],[7,0,8,0],[7,1,8,1],[7,2,8,2],[9,0,10,0],[9,1,10,1],[9,2,10,2],[11,0,12,0],[11,1,12,1],[11,2,12,2],[17,1,18,2],[20,1,24,9],[13,0,14,0],[13,1,14,1],[13,2,14,2],[15,0,16,0],[15,1,16,1],[15,2,16,2]]}
[null,"CRONOGRAMA FÍSICO-FINANCEIRO"]
[null,"OBRA: ",{"$f":"ORÇAMENTO!C5","v":"RECAPEAMENTO DE VIAS URBANAS - BAIRRO GERALDO XAVIER E RESIDENCIAL ZÉ DO NATO (SÃO JOSÉ DA VARGINHA / MG) - ITEM 3"},null,null,"VALOR:",{"$f":"ORÇAMENTO!I33","v":2716104.91}]
[{"$nulls":5},"PRAZO: ","120 DIAS "]
[]
[null,"ITEM","ETAPAS/DESCRIÇAO","FISICO/  FINANCEIRO","TOTAL    ETAPAS","MÊS 1","MÊS 2","MÊS 3","MÊS 4","TOTAL"]
["A",{"$f":"VLOOKUP(A6,ORÇAMENTO!$A$9:$I$33,2)","v":1},{"$f":"VLOOKUP(A6,ORÇAMENTO!$A$9:$I$33,3)","v":"SERVIÇOS PRELIMINARES "},"FISICO ",{"$f":"ROUND(E7/$G$2,4)","v":5.1499999999999997E-2},0.25,0.25,0.25,0.25,{"$f":"SUM(F6:I6)","v":1}]
[null,null,null,"FINANCEIRO",{"$f":"ORÇAMENTO!I9","v":139908.1},{"$f":"ROUND($E$7*F6,2)","v":34977.03},{"$f":"ROUND($E$7*G6,2)","v":34977.03},{"$f":"ROUND($E$7*H6,2)","v":34977.03},{"$f":"ROUND($E$7*I6,2)","v":34977.03},{"$f":"SUM(F7:I7)","v":139908.12}]
["B",{"$f":"VLOOKUP(A8,ORÇAMENTO!$A$9:$I$33,2)","v":2},{"$f":"VLOOKUP(A8,ORÇAMENTO!$A$9:$I$33,3)","v":"PAVIMENTAÇÃO"},"FISICO ",{"$f":"ROUND(E9/$G$2,4)","v":9.6299999999999997E-2},0.25,0.25,0.25,0.25,{"$f":"SUM(F8:I8)","v":1}]
[null,null,null,"FINANCEIRO",{"$f":"ORÇAMENTO!I14","v":261660.76},{"$f":"ROUND($E$9*F8,2)","v":65415.19},{"$f":"ROUND($E$9*G8,2)","v":65415.19},{"$f":"ROUND($E$9*H8,2)","v":65415.19},{"$f":"ROUND($E$9*I8,2)","v":65415.19},{"$f":"SUM(F9:I9)","v":261660.76}]
["C",{"$f":"VLOOKUP(A10,ORÇAMENTO!$A$9:$I$33,2)","v":3},{"$f":"VLOOKUP(A10,ORÇAMENTO!$A$9:$I$33,3)","v":"TRANSPORTE DE MATERIAIS"},"FISICO ",{"$f":"ROUND(E11/$G$2,4)","v":1E-3},0.25,0.25,0.25,0.25,{"$f":"SUM(F10:I10)","v":1}]
[null,null,null,"FINANCEIRO",{"$f":"ORÇAMENTO!I18","v":2596},{"$f":"ROUND($E$11*F10,2)","v":649},{"$f":"ROUND($E$11*G10,2)","v":649},{"$f":"ROUND($E$11*H10,2)","v":649},{"$f":"ROUND($E$11*I10,2)","v":649},{"$f":"SUM(F11:I11)-0.04","v":2595.96}]
["D",{"$f":"VLOOKUP(A12,ORÇAMENTO!$A$9:$I$33,2)","v":4},{"$f":"VLOOKUP(A12,ORÇAMENTO!$A$9:$I$33,3)","v":"TRANSPORTE DE MATERIAL ASFÁLTICO (BDI DIFERENCIADO)"},"FISICO ",{"$f":"ROUND(E13/$G$2,4)","v":1.78E-2},0.25,0.25,0.25,0.25,{"$f":"SUM(F12:I12)","v":1}]
[null,null,null,"FINANCEIRO",{"$f":"ORÇAMENTO!I21","v":48296},{"$f":"ROUND($E$13*F12,2)","v":12074},{"$f":"ROUND($E$13*G12,2)","v":12074},{"$f":"ROUND($E$13*H12,2)","v":12074},{"$f":"ROUND($E$13*I12,2)","v":12074},{"$f":"SUM(F13:I13)-0.02","v":48295.98}]
["E",{"$f":"VLOOKUP(A14,ORÇAMENTO!$A$9:$I$33,2)","v":5},{"$f":"VLOOKUP(A14,ORÇAMENTO!$A$9:$I$33,3)","v":"DRENAGEM E OBRAS COMPLEMENTARES"},"FISICO ",{"$f":"ROUND(E15/$G$2,4)","v":5.2400000000000002E-2},null,0.3,0.4,0.3,{"$f":"SUM(F14:I14)","v":1}]
[null,null,null,"FINANCEIRO",{"$f":"ORÇAMENTO!I24","v":142413.4},{"$f":"ROUND($E$15*F14,2)","v":0},{"$f":"ROUND($E$15*G14,2)","v":42724.02},{"$f":"ROUND($E$15*H14,2)","v":56965.36},{"$f":"ROUND($E$15*I14,2)","v":42724.02},{"$f":"SUM(F15:I15)-0.02","v":142413.38}]
["F",{"$f":"VLOOKUP(A16,ORÇAMENTO!$A$9:$I$33,2)","v":6},{"$f":"VLOOKUP(A16,ORÇAMENTO!$A$9:$I$33,3)","v":"FORNECIMENTOS - MATERIAL ASFÁLTICO (BDI DIFERENCIADO)"},"FISICO ",{"$f":"ROUND(E17/$G$2,4)","v":0.78100000000000003},0.25,0.25,0.25,0.25,{"$f":"SUM(F16:I16)","v":1}]
[null,null,null,"FINANCEIRO",{"$f":"ORÇAMENTO!I30","v":2121230.65},{"$f":"ROUND($E$17*F16,2)","v":530307.66},{"$f":"ROUND($E$17*G16,2)","v":530307.66},{"$f":"ROUND($E$17*H16,2)","v":530307.66},{"$f":"ROUND($E$17*I16,2)","v":530307.66},{"$f":"SUM(F17:I17)-0.02","v":2121230.62}]
[null,"TOTAL",null,"FISICO ",{"$f":"SUM(F18:I18)","v":1.0000000036817429},{"$f":"F19/$E$19","v":0.23689176277068033},{"$f":"G19/$E$19","v":0.25262164855038682},{"$f":"H19/$E$19","v":0.25786494381028902},{"$f":"I19/$E$19","v":0.25262164855038682},{"$f":"SUM(F18:I18)","v":1.0000000036817429}]
[null,null,null,"FINANCEIRO",{"$f":"E11+E9+E7+E13+E17+E15","v":2716104.9099999997},{"$f":"F11+F9+F7+F13+F17+F15","v":643422.88},{"$f":"G11+G9+G7+G13+G17+G15","v":686146.9},{"$f":"H11+H9+H7+H13+H17+H15","v":700388.24},{"$f":"I11+I9+I7+I13+I17+I15","v":686146.9},{"$f":"SUM(F19:I19)-0.01","v":2716104.91}]
[]
[null,"OBSERVAÇÕES:"]