{"text_format":"2","workbook":"xlsx","n_sheets":4,"sheets":["ORÇAMENTO","CPU","BDI SERV","CRONOGRAMA"],"not_rendered":{"charts":0,"images":2,"macros":0,"external_links":0,"defined_names":4,"comments":1,"pivot_tables":0},"unopened":[],"bounds":{"document_bytes":16777216,"sheet_cells":100000,"run_cost":"one","rows_first":2000,"rows_last":500,"rows_between":2000,"halvings":0,"cell_chars":16384,"cell_head_chars":4096},"cells_cut":0,"cells_raw":0,"read":"whole","date_system":"1900"}

{"sheet":"ORÇAMENTO","index":0,"n_rows":29,"n_cols":9,"rows_kept":29,"cut":false,"hidden":false,"merged":[[6,6,6,7],[28,1,28,2],[0,0,7,0],[0,2,0,8],[1,2,1,8],[2,2,2,8],[4,2,4,8],[5,6,5,7],[18,6,18,7]]}
["<---- NUMERAR SERVIÇOS PARA CPU",null,"Ministério do Desenvolvimento Regional"]
[null,null,"Companhia de Desenvolvimento dos Vales do São Francisco e do Parnaíba"]
[null,null,"1ª Superintendência Regional"]
[]
[null,"OBRA: ","PAVIMENTAÇÃO EM BLOQUETE - RUAS DIVERSAS NA ÁREA URBANA - MONTE AZUL/ MG (ITEM 1)"]
[null,"DATA:"," AGOSTO/2023",null,null,null,"BDI Serviços:",null,{"$f":"'BDI SERV'!D30/100","v":0.21489999999999998}]
[null,"PRAZO DE EXECUÇÃO:     120 DIAS"]
[null,"ITEM","DISCRIMINAÇÃO","REFER.","UNID.","QUANT.","P. UNITÁRIO","P.UNIT.C/ BDI","P. TOTAL"]
["A",1,"SERVIÇOS PRELIMINARES ",{"$nulls":5},{"$f":"SUM(I10:I14)","v":82888.160000000018}]
[1,"1.1","MOBILIZAÇÃO E DESMOBILIZAÇÃO","CPU.1","GL",1,{"$f":"VLOOKUP(A10,CPU!$A$1:$N$4530,9)","v":3869.6000000000004},{"$f":"VLOOKUP(A10,CPU!$A$1:$N$4530,10)","v":4701.1770400000005},{"$f":"ROUND(F10*H10,2)","v":4701.18}]
[2,"1.2","ADMINISTRAÇÃO LOCAL","CPU.2","GL",1,{"$f":"VLOOKUP(A11,CPU!$A$1:$N$4530,9)","v":58857.280000000006},{"$f":"VLOOKUP(A11,CPU!$A$1:$N$4530,10)","v":71505.709472000017},{"$f":"ROUND(F11*H11,2)","v":71505.710000000006}]
[3,"1.3","CANTEIRO DE OBRAS","CPU.3","GL",1,{"$f":"VLOOKUP(A12,CPU!$A$1:$N$4530,9)","v":3980},{"$f":"VLOOKUP(A12,CPU!$A$1:$N$4530,10)","v":4835.3020000000006},{"$f":"ROUND(F12*H12,2)","v":4835.3}]
[4,"1.4","PLACA DE OBRA EM CHAPA DE AÇO GALVANIZADO","103689a","M2",2,{"$f":"VLOOKUP(A13,CPU!$A$1:$N$4530,9)","v":339.72},{"$f":"VLOOKUP(A13,CPU!$A$1:$N$4530,10)","v":412.72582800000009},{"$f":"ROUND(F13*H13,2)","v":825.45}]
[5,"1.5","LOCAÇÃO DE PAVIMENTAÇÃO",99064,"M",1200,{"$f":"VLOOKUP(A14,CPU!$A$1:$N$4530,9)","v":0.7},{"$f":"VLOOKUP(A14,CPU!$A$1:$N$4530,10)","v":0.85043000000000002},{"$f":"ROUND(F14*H14,2)","v":1020.52}]
["B",2,"PAVIMENTAÇÃO",{"$nulls":5},{"$f":"SUM(I16:I21)","v":648710.44999999995}]
[6,"2.1","ESCAVAÇÃO HORIZONTAL EM SOLO DE 1A CATEGORIA COM TRATOR DE ESTEIRAS",101116,"M3",2500,{"$f":"VLOOKUP(A16,CPU!$A$1:$N$4530,9)","v":2.0300000000000002},{"$f":"VLOOKUP(A16,CPU!$A$1:$N$4530,10)","v":2.4662470000000005},{"$f":"ROUND(F16*H16,2)","v":6165.62}]
[7,"2.2","CARGA, MANOBRA E DESCARGA DE SOLOS E MATERIAIS GRANULARES EM CAMINHÃO BASCULANTE - CARGA COM PÁ CARREGADEIRA E DESCARGA LIVRE",100976,"M3",2500,{"$f":"VLOOKUP(A17,CPU!$A$1:$N$4530,9)","v":7.99},{"$f":"VLOOKUP(A17,CPU!$A$1:$N$4530,10)","v":9.7070510000000017},{"$f":"ROUND(F17*H17,2)","v":24267.63}]
[8,"2.3","REGULARIZAÇÃO E COMPACTAÇÃO DE SUBLEITO",100576,"M2",8200,{"$f":"VLOOKUP(A18,CPU!$A$1:$N$4530,9)","v":2.5299999999999998},{"$f":"VLOOKUP(A18,CPU!$A$1:$N$4530,10)","v":3.0736970000000001},{"$f":"ROUND(F18*H18,2)","v":25204.32}]
[null,"2.4","AQUISIÇÃO DE CASCALHO PARA EXECUÇÃO DA BASE","-","M3",1300,"FORNECIDO PELA PREFEITURA",null,0]
[9,"2.5","EXECUÇÃO E COMPACTAÇÃO DE BASE E OU SUB BASE PARA PAVIMENTAÇÃO DE CASCALHO - EXCLUSIVE SOLO, ESCAVAÇÃO, CARGA E TRANSPORTE. ",96388,"M3",1300,{"$f":"VLOOKUP(A20,CPU!$A$1:$N$4530,9)","v":11.61},{"$f":"VLOOKUP(A20,CPU!$A$1:$N$4530,10)","v":14.104989},{"$f":"ROUND(F20*H20,2)","v":18336.490000000002}]
[10,"2.6","EXECUÇÃO DE PAVIMENTO EM PISO INTERTRAVADO, COM BLOCO SEXTAVADO DE CONCRETO DE 25 X 25 CM, ESPESSURA 8 CM",92394,"M2",7100,{"$f":"VLOOKUP(A21,CPU!$A$1:$N$4530,9)","v":66.63000000000001},{"$f":"VLOOKUP(A21,CPU!$A$1:$N$4530,10)","v":80.948787000000024},574736.39]
["C",3,"TRANSPORTE DE MATERIAIS",{"$nulls":5},{"$f":"SUM(I23:I24)","v":20264.53}]
[11,"3.1","TRANSPORTE COM CAMINHÃO BASCULANTE, EM VIA URBANA EM REVESTIMENTO PRIMÁRIO",95426,"M3XKM",11000,{"$f":"VLOOKUP(A23,CPU!$A$1:$N$4530,9)","v":1.28},{"$f":"VLOOKUP(A23,CPU!$A$1:$N$4530,10)","v":1.5550720000000002},{"$f":"ROUND(F23*H23,2)","v":17105.79}]
[12,"3.2","TRANSPORTE COM CAMINHÃO BASCULANTE, EM VIA URBANA PAVIMENTADA",95427,"M3XKM",3999.9985745919998,{"$f":"VLOOKUP(A24,CPU!$A$1:$N$4530,9)","v":0.64999999999999991},{"$f":"VLOOKUP(A24,CPU!$A$1:$N$4530,10)","v":0.78968499999999997},{"$f":"ROUND(F24*H24,2)","v":3158.74}]
[13,"3.3","TRANSPORTE COM CAMINHÃO CARROCERIA, EM VIA URBANA PAVIMENTADA",100948,"TXKM",49000,{"$f":"VLOOKUP(A25,CPU!$A$1:$N$4530,9)","v":0.64},{"$f":"VLOOKUP(A25,CPU!$A$1:$N$4530,10)","v":0.77753600000000012},{"$f":"ROUND(F25*H25,2)","v":38099.26}]
["D",4,"OBRAS COMPLEMENTARES",{"$nulls":5},{"$f":"SUM(I27:I28)","v":171680.68000000002}]
[14,"4.1","GUIA (MEIO-FIO) E SARJETA CONJUGADOS DE CONCRETO, MOLDADA  IN LOCO  EM TRECHO RETO COM EXTRUSORA, 45 CM BASE (15 CM BASE DA GUIA + 30 CM BASE DA SARJETA) X 22 CM ALTURA",94267,"M",2300,{"$f":"VLOOKUP(A27,CPU!$A$1:$N$4530,9)","v":57.109999999999992},{"$f":"VLOOKUP(A27,CPU!$A$1:$N$4530,10)","v":69.382938999999993},{"$f":"ROUND(F27*H27,2)","v":159580.76}]
[15,"4.2","GUIA (MEIO-FIO) CONCRETO, MOLDADA IN LOCO EM TRECHO RETO COM EXTRUSORA, 13 CM BASE X 22 CM ALTURA - PARA TRAVAMENTO",94263,"M",280,{"$f":"VLOOKUP(A28,CPU!$A$1:$N$4530,9)","v":35.569999999999993},{"$f":"VLOOKUP(A28,CPU!$A$1:$N$4530,10)","v":43.213992999999995},{"$f":"ROUND(F28*H28,2)","v":12099.92}]
[null,"TOTAL GERAL DA OBRA COM BDI ",{"$nulls":6},{"$f":"SUM(I9,I15,I22,I26)","v":923543.82000000007}]

{"sheet":"CPU","index":1,"n_rows":227,"n_cols":13,"rows_kept":227,"cut":false,"hidden":false,"merged":[[177,0,188,0],[177,1,177,3],[177,4,177,7],[178,2,178,5],[179,2,179,3],[180,1,180,7],[185,1,185,3],[185,5,185,6],[186,1,186,6],[187,1,187,6],[188,1,188,6],[223,1,223,3],[223,5,223,6],[224,1,224,6],[225,1,225,6],[226,1,226,6],[190,1,190,3],[190,4,190,7],[173,1,173,6],[174,1,174,6],[175,1,175,6],[209,0,227,0],[209,1,209,3],[209,4,209,7],[210,2,210,5],[211,2,211,3],[212,1,212,7],[26,1,26,6],[27,1,27,6],[28,1,28,6],[30,1,30,3],[30,4,30,7],[41,1,41,3],[41,4,41,7],[77,5,77,6],[78,1,78,6],[79,1,79,6],[80,1,80,6],[96,0,111,0],[113,0,130,0],[164,1,164,3],[164,4,164,7],[165,2,165,5],[166,2,166,3],[167,1,167,7],[13,1,13,3],[13,4,13,7],[13,10,13,11],[14,2,14,5],[15,2,15,3],[16,1,16,7],[25,1,25,3],[25,5,25,6],[190,0,208,0],[172,1,172,3],[172,5,172,6],[151,0,163,0],[164,0,175,0],[127,5,127,6],[128,1,128,6],[129,1,129,6],[130,1,130,6],[30,10,30,11],[31,2,31,5],[32,2,32,3],[33,1,33,7],[36,1,36,3],[36,5,36,6],[37,1,37,6],[0,10,0,11],[1,2,1,5],[2,2,2,3],[3,1,3,7],[8,1,8,3],[8,5,8,6],[9,1,9,6],[10,1,10,6],[11,1,11,6],[38,1,38,6],[39,1,39,6],[41,10,41,11],[42,2,42,5],[43,2,43,3],[44,1,44,7],[53,1,53,3],[53,5,53,6],[69,10,69,11],[70,2,70,5],[54,1,54,6],[55,1,55,6],[56,1,56,6],[58,1,58,3],[58,4,58,7],[58,10,58,11],[59,2,59,5],[60,2,60,3],[61,1,61,7],[64,1,64,3],[64,5,64,6],[65,1,65,6],[66,1,66,6],[67,1,67,6],[69,1,69,3],[69,4,69,7],[132,10,132,11],[133,2,133,5],[134,2,134,3],[135,1,135,7],[146,1,146,3],[146,5,146,6],[147,1,147,6],[96,10,96,11],[97,2,97,5],[98,2,98,3],[99,1,99,7],[108,1,108,3],[108,5,108,6],[109,1,109,6],[110,1,110,6],[111,1,111,6],[96,1,96,3],[96,4,96,7],[113,1,113,3],[113,4,113,7],[114,2,114,5],[115,2,115,3],[116,1,116,7],[127,1,127,3],[153,2,153,3],[154,1,154,7],[159,5,159,6],[160,1,160,6],[161,1,161,6],[162,1,162,6],[0,0,12,0],[13,0,29,0],[30,0,40,0],[41,0,57,0],[58,0,68,0],[132,0,150,0],[159,1,159,3],[148,1,148,6],[149,1,149,6],[151,1,151,3],[151,4,151,7],[132,1,132,3],[132,4,132,7],[71,2,71,3],[72,1,72,7],[77,1,77,3],[0,1,0,3],[0,4,0,7],[209,10,209,11],[94,1,94,6],[69,0,80,0],[82,0,94,0],[82,1,82,3],[82,4,82,7],[83,2,83,5],[84,2,84,3],[85,1,85,7],[91,1,91,3],[91,5,91,6],[92,1,92,6],[93,1,93,6],[190,10,190,11],[191,2,191,5],[192,2,192,3],[193,1,193,7],[204,1,204,3],[204,5,204,6],[205,1,205,6],[206,1,206,6],[207,1,207,6],[151,10,151,11],[152,2,152,5]]}
[1,"CODEVASF",null,null," COMPOSIÇÃO DE PREÇO UNITÁRIO",null,null,null,{"$f":"H10","v":3869.6000000000004},{"$f":"H12","v":4701.1770400000005},"BDI CALCULADO:",null,{"$f":"ORÇAMENTO!I6","v":0.21489999999999998}]
[null,"OBRA:  ",{"$f":"ORÇAMENTO!C5","v":"PAVIMENTAÇÃO EM BLOQUETE - RUAS DIVERSAS NA ÁREA URBANA - MONTE AZUL/ MG (ITEM 1)"},null,null,null,"DATA: ",{"$f":"ORÇAMENTO!C6","v":" AGOSTO/2023"}]
[null,"SERVIÇO:  ",{"$f":"VLOOKUP(A1,ORÇAMENTO!A10:I28,3)","v":"MOBILIZAÇÃO E DESMOBILIZAÇÃO"},null,"Referência:",{"$f":"VLOOKUP(A1,ORÇAMENTO!A10:I28,4)","v":"CPU.1"},"UNIDADE: ",{"$f":"VLOOKUP(A1,ORÇAMENTO!A10:I28,5)","v":"GL"}]
[]
[null,"TIPO ITEM","CODIGO ITEM","DESCRIÇÃO ITEM","UNIDADE ITEM","COEFICIENTE","PRECO UNITARIO","CUSTO TOTAL"]
[null,"COMPOSICAO","5824","CAMINHÃO TOCO, PBT 16.000 KG, CARGA ÚTIL MÁX. 10.685 KG, DIST. ENTRE EIXOS 4,8 M, POTÊNCIA 189 CV, INCLUSIVE CARROCERIA FIXA ABERTA DE MADEIRA P/ TRANSPORTE GERAL DE CARGA SECA ","CHP",16,183.71,{"$f":"ROUNDDOWN(F6*G6,2)","v":2939.36}]
[null,"COMPOSICAO","5826","CAMINHÃO TOCO, PBT 16.000 KG, CARGA ÚTIL MÁX. 10.685 KG, DIST. ENTRE EIXOS 4,8 M, POTÊNCIA 189 CV, INCLUSIVE CARROCERIA FIXA ABERTA DE MADEIRA P/ TRANSPORTE GERAL DE CARGA SECA ","CHI",8,57,{"$f":"ROUNDDOWN(F7*G7,2)","v":456}]
[null,"COMPOSIÇÃO",88316,"SERVENTE COM ENCARGOS COMPLEMENTARES","H",24,19.760000000000002,474.24]
[null,"PRODUÇÃO DA EQUIPE",null,null,1,"CUSTO ",null,{"$f":"SUM(H6:H8)","v":3869.6000000000004}]
[null,"TOTAL",{"$nulls":5},{"$f":"H9/E9","v":3869.6000000000004},"OK"]
[null,"BDI                %",{"$nulls":5},{"$f":"1+$M$1","v":1.2149000000000001}]
[null,"TOTAL DO SERVIÇO - R$",{"$nulls":5},{"$f":"H10*H11","v":4701.1770400000005}]
[]
[{"$f":"A1+1","v":2},"CODEVASF",null,null," COMPOSIÇÃO DE PREÇO UNITÁRIO",null,null,null,{"$f":"H27","v":58857.280000000006},{"$f":"H29","v":71505.709472000017}]
[null,"OBRA:  ",{"$f":"$C$2","v":"PAVIMENTAÇÃO EM BLOQUETE - RUAS DIVERSAS NA ÁREA URBANA - MONTE AZUL/ MG (ITEM 1)"},null,null,null,"DATA: ",{"$f":"$H$2","v":" AGOSTO/2023"}]
[null,"SERVIÇO:  ",{"$f":"VLOOKUP(A14,ORÇAMENTO!$A$10:$I$28,3)","v":"ADMINISTRAÇÃO LOCAL"},null,"SINAPI",{"$f":"VLOOKUP(A14,ORÇAMENTO!A10:I28,4,0)","v":"CPU.2"},"UNIDADE: ",{"$f":"VLOOKUP(A14,ORÇAMENTO!$A$10:$I$28,5)","v":"GL"}]
[]
[null,"TIPO ITEM","CODIGO ITEM","DESCRIÇÃO ITEM","UNIDADE ITEM","COEFICIENTE","PRECO UNITARIO","CUSTO TOTAL"]
[null,"INSUMO",14250,"ENERGIA ELÉTRICA","kwh",80,0.95,{"$f":"ROUNDDOWN(F19*G19,2)","v":76}]
[null,"INSUMO",44480,"TARIFA \"A\" ENTRE 0 E 20 M³ - FORNECIMENTO D'ÁGUA","m³",6,17.97,{"$f":"ROUNDDOWN(F20*G20,2)","v":107.82}]
[null,"COTAÇÃO","MERC.","TELEFONE (PLANO CONTROLE)","UNID",2,59.9,119.8]
[null,"COMPOSICAO",90777,"Engenheiro Civil Júnior com encargos complementares","H",55,114.12,6276.6]
[null,"COMPOSICAO",90776,"Encarregado Geral com encargos complementares","H",75,57.73,4329.75]
[null,"COMPOSICAO",88321,"Tecnico de Laboratório com encargos complementares","H",55,45.45,2499.75]
[null,"COMPOSICAO",90772,"Auxiliar de escritório com encargos complementares","H",55,23.72,1304.5999999999999]
[null,"PRODUÇÃO DA EQUIPE",null,null,0.25,"CUSTO ",null,{"$f":"SUM(H19:H25)","v":14714.320000000002}]
[null,"TOTAL",{"$nulls":5},{"$f":"H26/E26","v":58857.280000000006},"OK"]
[null,"BDI                %",{"$nulls":5},{"$f":"1+$M$1","v":1.2149000000000001}]
[null,"TOTAL DO SERVIÇO - R$",{"$nulls":5},{"$f":"H27*H28","v":71505.709472000017}]
[]
[{"$f":"A14+1","v":3},"CODEVASF",null,null," COMPOSIÇÃO DE PREÇO UNITÁRIO",null,null,null,{"$f":"H38","v":3980},{"$f":"H40","v":4835.3020000000006}]
[null,"OBRA:  ",{"$f":"$C$2","v":"PAVIMENTAÇÃO EM BLOQUETE - RUAS DIVERSAS NA ÁREA URBANA - MONTE AZUL/ MG (ITEM 1)"},null,null,null,"DATA: ",{"$f":"$H$2","v":" AGOSTO/2023"}]
[null,"SERVIÇO:  ",{"$f":"VLOOKUP(A31,ORÇAMENTO!$A$10:$I$28,3)","v":"CANTEIRO DE OBRAS"},null,"SINAPI",{"$f":"VLOOKUP(A31,ORÇAMENTO!$A$10:$I$28,4)","v":"CPU.3"},"UNIDADE: ",{"$f":"VLOOKUP(A31,ORÇAMENTO!$A$10:$I$28,5)","v":"GL"}]
[]
[null,"TIPO ITEM","CODIGO ITEM","DESCRIÇÃO ITEM","UNIDADE ITEM","COEFICIENTE","PRECO UNITARIO","CUSTO TOTAL"]
[null,"COTAÇÃO",10775,"ALUGUEL DE IMÓVEL OU CONTEINER QUE ATENDA AOS REQUISITOS MÍNIMOS PARA INSTALAÇÃO DO CANTEIRO DE OBRAS ","MÊS",4,995,{"$f":"ROUNDDOWN(F36*G36,2)","v":3980}]
[null,"PRODUÇÃO DA EQUIPE",null,null,1,"CUSTO ",null,{"$f":"SUM(H36:H36)","v":3980}]
[null,"TOTAL",{"$nulls":5},{"$f":"H37/E37","v":3980},"OK"]
[null,"BDI                %",{"$nulls":5},{"$f":"1+$M$1","v":1.2149000000000001}]
[null,"TOTAL DO SERVIÇO - R$",{"$nulls":5},{"$f":"H38*H39","v":4835.3020000000006}]
[]
[{"$f":"A31+1","v":4},"CODEVASF",null,null," COMPOSIÇÃO DE PREÇO UNITÁRIO",null,null,null,{"$f":"H55","v":339.72},{"$f":"H57","v":412.72582800000009}]
[null,"OBRA:  ",{"$f":"$C$2","v":"PAVIMENTAÇÃO EM BLOQUETE - RUAS DIVERSAS NA ÁREA URBANA - MONTE AZUL/ MG (ITEM 1)"},null,null,null,"DATA: ",{"$f":"$H$2","v":" AGOSTO/2023"}]
[null,"SERVIÇO:  ",{"$f":"VLOOKUP(A42,ORÇAMENTO!$A$10:$I$28,3)","v":"PLACA DE OBRA EM CHAPA DE AÇO GALVANIZADO"},null,"SINAPI",{"$f":"VLOOKUP(A42,ORÇAMENTO!$A$10:$I$28,4)","v":"103689a"},"UNIDADE: ",{"$f":"VLOOKUP(A42,ORÇAMENTO!$A$10:$I$28,5)","v":"M2"}]
[]
[null,"TIPO ITEM","CODIGO ITEM","DESCRIÇÃO ITEM","UNIDADE ITEM","COEFICIENTE","PRECO UNITARIO","CUSTO TOTAL"]
[null,"INSUMO","4509","SARRAFO *2,5 X 10* CM EM PINUS, MISTA OU EQUIVALENTE DA REGIAO - BRUTA","M","3,2083000","4,41",{"$f":"ROUNDDOWN(F47*G47,2)","v":14.14}]
[null,"INSUMO","4813","PLACA DE OBRA (PARA CONSTRUCAO CIVIL) EM CHAPA GALVANIZADA *N. 22*, ADESIVADA, DE *2,4 X 1,2* M (SEM POSTES PARA FIXACAO)","M2","1,0000000","250,00",{"$f":"ROUNDDOWN(F48*G48,2)","v":250}]
[null,"INSUMO","5065","PREGO DE ACO POLIDO COM CABECA 10 X 10 (7/8 X 17)","KG","0,0113000","36,57",0.41]
[null,"INSUMO","5069","PREGO DE ACO POLIDO COM CABECA 17 X 27 (2 1/2 X 11)","KG","0,0132000","19,59",0.25]
[null,"COMPOSICAO","88262","CARPINTEIRO DE FORMAS COM ENCARGOS COMPLEMENTARES","H","0,3729000","27,05",10.08]
[null,"COMPOSICAO","88316","SERVENTE COM ENCARGOS COMPLEMENTARES","H","1,1186000","19,76",22.1]
[null,"COMPOSICAO",4115,"MADEIRA ROLICA TRATADA, D = 12 A 15 CM, H = 3,00 M, EM EUCALIPTO OU EQUIVALENTE","M2",2,21.37,42.74]
[null,"PRODUÇÃO DA EQUIPE",null,null,1,"CUSTO ",null,{"$f":"SUM(H47:H53)","v":339.72}]
[null,"TOTAL",{"$nulls":5},{"$f":"H54/E54","v":339.72},"OK"]
[null,"BDI                %",{"$nulls":5},{"$f":"1+$M$1","v":1.2149000000000001}]
[null,"TOTAL DO SERVIÇO - R$",{"$nulls":5},{"$f":"H55*H56","v":412.72582800000009}]
[]
[{"$f":"A42+1","v":5},"CODEVASF",null,null," COMPOSIÇÃO DE PREÇO UNITÁRIO",null,null,null,{"$f":"H66","v":0.7},{"$f":"H68","v":0.85043000000000002}]
[null,"OBRA:  ",{"$f":"$C$2","v":"PAVIMENTAÇÃO EM BLOQUETE - RUAS DIVERSAS NA ÁREA URBANA - MONTE AZUL/ MG (ITEM 1)"},null,null,null,"DATA: ",{"$f":"$H$2","v":" AGOSTO/2023"}]
[null,"SERVIÇO:  ",{"$f":"VLOOKUP(A59,ORÇAMENTO!$A$10:$I$28,3)","v":"LOCAÇÃO DE PAVIMENTAÇÃO"},null,"SINAPI",{"$f":"VLOOKUP(A59,ORÇAMENTO!$A$10:$I$28,4)","v":99064},"UNIDADE: ",{"$f":"VLOOKUP(A59,ORÇAMENTO!$A$10:$I$28,5)","v":"M"}]
[]
[null,"TIPO ITEM","CODIGO ITEM","DESCRIÇÃO ITEM","UNIDADE ITEM","COEFICIENTE","PRECO UNITARIO","CUSTO TOTAL"]
[null,"COMPOSICAO","99058","LOCAÇÃO DE PONTO PARA REFERÊNCIA TOPOGRÁFICA","UN","0,0500000",14.16,{"$f":"ROUNDDOWN(F64*G64,2)","v":0.7}]
[null,"PRODUÇÃO DA EQUIPE",null,null,1,"CUSTO ",null,{"$f":"SUM(H64:H64)","v":0.7}]
[null,"TOTAL",{"$nulls":5},{"$f":"H65/E65","v":0.7},"OK"]
[null,"BDI                %",{"$nulls":5},{"$f":"1+$M$1","v":1.2149000000000001}]
[null,"TOTAL DO SERVIÇO - R$",{"$nulls":5},{"$f":"H66*H67","v":0.85043000000000002}]
[]
[{"$f":"A59+1","v":6},"CODEVASF",null,null," COMPOSIÇÃO DE PREÇO UNITÁRIO",null,null,null,{"$f":"H79","v":2.0300000000000002},{"$f":"H81","v":2.4662470000000005}]
[null,"OBRA:  ",{"$f":"$C$2","v":"PAVIMENTAÇÃO EM BLOQUETE - RUAS DIVERSAS NA ÁREA URBANA - MONTE AZUL/ MG (ITEM 1)"},null,null,null,"DATA: ",{"$f":"$H$2","v":" AGOSTO/2023"},null,{"$f":"H96","v":0}]
[null,"SERVIÇO:  ",{"$f":"VLOOKUP(A70,ORÇAMENTO!$A$10:$I$28,3)","v":"ESCAVAÇÃO HORIZONTAL EM SOLO DE 1A CATEGORIA COM TRATOR DE ESTEIRAS"},null,"SINAPI",{"$f":"VLOOKUP(A70,ORÇAMENTO!$A$10:$I$28,4)","v":101116},"UNIDADE: ",{"$f":"VLOOKUP(A70,ORÇAMENTO!$A$10:$I$28,5)","v":"M3"}]
[]
[null,"TIPO ITEM","CODIGO ITEM","DESCRIÇÃO ITEM","UNIDADE ITEM","COEFICIENTE","PRECO UNITARIO","CUSTO TOTAL"]
[null,"COMPOSICAO","5847","TRATOR DE ESTEIRAS, POTÊNCIA 170 HP, PESO OPERACIONAL 19 T, CAÇAMBA 5,2 M3","CHP","0,0048000","231,82",{"$f":"ROUNDDOWN(F75*G75,2)","v":1.1100000000000001}]
[null,"COMPOSICAO","5849","TRATOR DE ESTEIRAS, POTÊNCIA 170 HP, PESO OPERACIONAL 19 T, CAÇAMBA 5,2 M3","CHI","0,0082000","82,14",0.67]
[null,"COMPOSICAO","88316","SERVENTE COM ENCARGOS COMPLEMENTARES","H","0,0131000","19,76",0.25]
[null,"PRODUÇÃO DA EQUIPE",null,null,1,"CUSTO ",null,{"$f":"SUM(H75:H77)","v":2.0300000000000002}]
[null,"TOTAL",{"$nulls":5},{"$f":"H78/E78","v":2.0300000000000002},"OK"]
[null,"BDI                %",{"$nulls":5},{"$f":"1+$M$1","v":1.2149000000000001}]
{"$rows_left_out":148}
{"sheet":"BDI SERV","index":2,"n_rows":36,"n_cols":5,"rows_kept":36,"cut":false,"hidden":false,"merged":[[7,7,17,12],[35,0,35,5],[3,1,4,1],[3,2,4,2],[0,1,2,4],[31,0,33,5],[27,0,27,5],[29,1,29,2],[30,1,30,2]]}
[null,"DETALHAMENTO DO BDI - SERVIÇOS"]
[]
[]
[null,"Item","Descrição dos Serviços","%","%"]
[null,null,null,"PV","CD"]
[]
[null,1,"ADMINISTRAÇÃO CENTRAL"," ",4.01]
[null,"1.1","ESCRITÓRIO CENTRAL"," "," "]
[null,"1.2","VIAGENS"," "," "]
[null,"1.3","OUTROS"," "," "]
[null," "," "," "," "]
[null,2,"IMPOSTOS E TAXAS",{"$f":"SUM(D13:D15)","v":5.65},{"$f":"SUM(E13:E15)","v":7.0600000000000005}]
[null,"2.1","ISS (*)",{"$f":"5*0.4","v":2},{"$f":"ROUND(D13*1.2515,2)","v":2.5}]
[null,"2.2","PIS",0.65,0.81]
[null,"2.3","Cofins",3,3.75]
[]
[null,3,"TAXA DE RISCO"," ",{"$f":"SUM(E18:E21)","v":0.96}]
[null,"3.1","SEGURO",null,0.2]
[null,"3.2","RISCO",null,0.56000000000000005]
[null,"3.3","GARANTIA",null,0.2]
[]
[null,4,"DESPESAS FINANCEIRAS"," ",1.1100000000000001]
[]
[null,5,"LUCRO",null,8]
[]
[null," ","BDI - CALCULADO"," ",{"$f":"ROUND((((1+(E7+E17)/100)*(1+E22/100)*(1+E24/100)/(1-D12/100)-1)*100),2)","v":21.49}]
[]
["BDI = ((1+((AC+S+R+G)/100))x(1+DF/100)x(1+L/100)/(1-I/100)-1)*100"]
[]
[null,"BDI (CALCULADO):",null,{"$f":"ROUND((((1+((E7+E17)/100))*(1+E22/100)*(1+E24/100))/(1-D12/100)-1)*100,2)","v":21.49},"%"]
[null," "]
["(*) ISS CONFORME DECLARAÇÃO DO MUNICÍPIO (EM ANEXO) \nQUANT. ESTIMADA DE MATERIAIS = 60%"]
[]
[]
[" "]
["BDI EM CONFORMIDADE COM OS ACÓRDÃOS Nº 2369/2011 e ACÓRDÃO Nº 2.622/2013 - TCU - PLENÁRIO"]

{"sheet":"CRONOGRAMA","index":3,"n_rows":17,"n_cols":10,"rows_kept":17,"cut":false,"hidden":false,"merged":[[7,0,8,0],[9,0,10,0],[11,0,12,0],[0,1,0,9],[1,6,1,9],[2,6,2,9],[3,1,3,6],[5,0,6,0],[5,2,6,2],[1,1,2,1],[5,1,6,1],[1,2,2,4],[13,1,14,2],[16,1,20,9],[7,2,8,2],[9,2,10,2],[11,2,12,2],[7,1,8,1],[9,1,10,1],[11,1,12,1]]}
[null,"CRONOGRAMA FÍSICO-FINANCEIRO"]
[null,"OBRA: ",{"$f":"ORÇAMENTO!C5","v":"PAVIMENTAÇÃO EM BLOQUETE - RUAS DIVERSAS NA ÁREA URBANA - MONTE AZUL/ MG (ITEM 1)"},null,null,"VALOR:",{"$f":"ORÇAMENTO!I29","v":923543.82000000007}]
[{"$nulls":5},"PRAZO: ","120 DIAS "]
[]
[null,"ITEM","ETAPAS/DESCRIÇAO","FISICO/  FINANCEIRO","TOTAL    ETAPAS","MÊS 1","MÊS 2","MÊS 3","MÊS 4","TOTAL"]
["A",{"$f":"VLOOKUP(A6,ORÇAMENTO!$A$9:$I$29,2)","v":1},{"$f":"VLOOKUP(A6,ORÇAMENTO!$A$9:$I$29,3)","v":"SERVIÇOS PRELIMINARES "},"FISICO ",{"$f":"ROUND(E7/$G$2,4)","v":8.9800000000000005E-2},0.2,0.3,0.3,0.2,{"$f":"SUM(F6:I6)","v":1}]
[null,null,null,"FINANCEIRO",{"$f":"ORÇAMENTO!I9","v":82888.160000000018},{"$f":"ROUND($E$7*F6,2)","v":16577.63},24866.45,24866.45,16577.63,{"$f":"SUM(F7:I7)+0.01","v":82888.17}]
["B",{"$f":"VLOOKUP(A8,ORÇAMENTO!$A$9:$I$29,2)","v":2},{"$f":"VLOOKUP(A8,ORÇAMENTO!$A$9:$I$29,3)","v":"PAVIMENTAÇÃO"},"FISICO ",{"$f":"ROUND(E9/$G$2,4)","v":0.70240000000000002},0.2,0.3,0.3,0.2,{"$f":"SUM(F8:I8)","v":1}]
[null,null,null,"FINANCEIRO",{"$f":"ORÇAMENTO!I15","v":648710.44999999995},{"$f":"ROUND($E$9*F8,2)","v":129742.09},194613.14,194613.14,129742.09,648710.46]
["C",{"$f":"VLOOKUP(A10,ORÇAMENTO!$A$9:$I$29,2)","v":3},{"$f":"VLOOKUP(A10,ORÇAMENTO!$A$9:$I$29,3)","v":"TRANSPORTE DE MATERIAIS"},"FISICO ",{"$f":"ROUND(E11/$G$2,4)","v":2.1899999999999999E-2},0.1,0.3,0.3,0.3,1]
[null,null,null,"FINANCEIRO",{"$f":"ORÇAMENTO!I22","v":20264.53},{"$f":"ROUND($E$11*F10,2)","v":2026.45},{"$f":"ROUND($E$11*G10,2)","v":6079.36},6079.36,6079.36,{"$f":"SUM(F11:I11)+0.01","v":20264.539999999997}]
["D",{"$f":"VLOOKUP(A12,ORÇAMENTO!$A$9:$I$29,2)","v":4},{"$f":"VLOOKUP(A12,ORÇAMENTO!$A$9:$I$29,3)","v":"OBRAS COMPLEMENTARES"},"FISICO ",{"$f":"ROUND(E13/$G$2,4)","v":0.18590000000000001},0,0.3,0.3,0.4,1]
[null,null,null,"FINANCEIRO",{"$f":"ORÇAMENTO!I26","v":171680.68000000002},{"$f":"ROUND($E$13*F12,2)","v":0},{"$f":"ROUND($E$13*G12,2)","v":51504.2},{"$f":"ROUND($E$13*H12,2)","v":51504.2},{"$f":"ROUND($E$13*I12,2)","v":68672.27},171680.66999999998]
[null,"TOTAL",null,"FISICO ",{"$f":"SUM(F14:I14)","v":1.000000021655713},{"$f":"F15/E15","v":0.16062710484056944},{"$f":"G15/$E$15","v":0.3000000043311426},{"$f":"H15/$E$15","v":0.30000001515899916},{"$f":"I15/E15","v":0.23937289732500183},{"$f":"SUM(F14:I14)","v":1.000000021655713}]
[null,null,null,"FINANCEIRO",{"$f":"E11+E9+E7+E13","v":923543.82000000007},{"$f":"F11+F9+F7+F13","v":148346.17000000001},{"$f":"G11+G9+G7+G13","v":277063.15000000002},{"$f":"H11+H9+H7+H13+0.01","v":277063.16000000003},{"$f":"I11+I9+I7+I13+0.01","v":221071.35999999999},{"$f":"SUM(F15:I15)-0.02","v":923543.82000000007}]
[]
[null,"OBSERVAÇÕES:"]