{"text_format":"2","workbook":"xlsx","n_sheets":5,"sheets":["ORÇAMENTO","CPU","BDI SERV","BDI FORN","CRONOGRAMA"],"not_rendered":{"charts":0,"images":4,"macros":0,"external_links":0,"defined_names":5,"comments":1,"pivot_tables":0},"unopened":[],"bounds":{"document_bytes":16777216,"sheet_cells":100000,"run_cost":"one","rows_first":2000,"rows_last":500,"rows_between":2000,"halvings":0,"cell_chars":16384,"cell_head_chars":4096},"cells_cut":0,"cells_raw":0,"read":"whole","date_system":"1900"}

{"sheet":"ORÇAMENTO","index":0,"n_rows":43,"n_cols":9,"rows_kept":43,"cut":false,"hidden":false,"merged":[[6,1,6,2],[6,6,6,7],[42,1,42,2],[0,0,7,0],[0,2,0,8],[1,2,1,8],[2,2,2,8],[4,2,4,8],[5,6,5,7]]}
["<---- NUMERAR SERVIÇOS PARA CPU",null,"Ministério do Desenvolvimento Regional"]
[null,null,"Companhia de Desenvolvimento dos Vales do São Francisco e do Parnaíba"]
[null,null,"1ª Superintendência Regional"]
[]
[null,"OBRA: "," PAVIMENTAÇÃO ASFÁLTICA EM CBUQ - VIAS DE ACESSO AO BAIRRO CARMO DE UNIÃO (NOVA UNIÃO/ MG) - ITEM 1"]
[null,"DATA:"," SETEMBRO / 2023   ",null,null,null,"BDI Serviços:",null,{"$f":"'BDI SERV'!D31/100","v":0.22649999999999998}]
[null,"PRAZO DE EXECUÇÃO:     90 DIAS",{"$nulls":4},"BDI Serviços:",null,{"$f":"'BDI FORN'!D31/100","v":0.15}]
[null,"ITEM","DISCRIMINAÇÃO","REFER.","UNID.","QUANT.","P. UNITÁRIO","P.UNIT.C/ BDI","P. TOTAL"]
["A",1,"SERVIÇOS PRELIMINARES ",{"$nulls":5},{"$f":"SUM(I10:I14)","v":105022.66}]
[1,"1.1","MOBILIZAÇÃO E DESMOBILIZAÇÃO","CPU.1","GL",1,{"$f":"VLOOKUP(A10,CPU!$A$1:$N$4760,9)","v":16112.24},{"$f":"VLOOKUP(A10,CPU!$A$1:$N$4760,10)","v":19761.66},{"$f":"ROUND(F10*H10,2)","v":19761.66}]
[2,"1.2","ADMINISTRAÇÃO LOCAL","CPU.2","GL",1,{"$f":"VLOOKUP(A11,CPU!$A$1:$N$4760,9)","v":57685.120000000003},{"$f":"VLOOKUP(A11,CPU!$A$1:$N$4760,10)","v":70750.8},{"$f":"ROUND(F11*H11,2)","v":70750.8}]
[3,"1.3","CANTEIRO DE OBRAS","CPU.3","GL",1,{"$f":"VLOOKUP(A12,CPU!$A$1:$N$4760,9)","v":6950.25},{"$f":"VLOOKUP(A12,CPU!$A$1:$N$4760,10)","v":8524.48},{"$f":"ROUND(F12*H12,2)","v":8524.48}]
[4,"1.4","PLACA DE OBRA EM CHAPA DE AÇO GALVANIZADO",103689,"M2",6,{"$f":"VLOOKUP(A13,CPU!$A$1:$N$4760,9)","v":340.5},{"$f":"VLOOKUP(A13,CPU!$A$1:$N$4760,10)","v":417.62},{"$f":"ROUND(F13*H13,2)","v":2505.7199999999998}]
[5,"1.5","SERVIÇOS TOPOGRÁFICOS PARA PAVIMENTAÇÃO, INCLUSIVE NOTA DE SERVIÇO, ACOMPANHAMENTO E GREIDE",78472,"M2",8700,{"$f":"VLOOKUP(A14,CPU!$A$1:$N$4760,9)","v":0.32999999999999996},{"$f":"VLOOKUP(A14,CPU!$A$1:$N$4760,10)","v":0.4},{"$f":"ROUND(F14*H14,2)","v":3480}]
["B",2,"TERRAPLANAGEM E PAVIMENTAÇÃO",{"$nulls":5},{"$f":"SUM(I16:I22)","v":147638}]
[6,"2.1","ESCAVAÇÃO HORIZONTAL EM SOLO DE 1A CATEGORIA ",101116,"M3",1300,{"$f":"VLOOKUP(A16,CPU!$A$1:$N$4760,9)","v":2.2000000000000002},{"$f":"VLOOKUP(A16,CPU!$A$1:$N$4760,10)","v":2.7},{"$f":"ROUND(F16*H16,2)","v":3510}]
[7,"2.2","CARGA, MANOBRA E DESCARGA DE SOLOS E MATERIAIS GRANULARES EM CAMINHÃO BASCULANTE",100976,"M3",1300,{"$f":"VLOOKUP(A17,CPU!$A$1:$N$4760,9)","v":8.7100000000000009},{"$f":"VLOOKUP(A17,CPU!$A$1:$N$4760,10)","v":10.68},{"$f":"ROUND(F17*H17,2)","v":13884}]
[8,"2.3","REGULARIZAÇÃO E COMPACTAÇÃO DO SUBLEITO ",100576,"M2",8700,{"$f":"VLOOKUP(A18,CPU!$A$1:$N$4760,9)","v":2.57},{"$f":"VLOOKUP(A18,CPU!$A$1:$N$4760,10)","v":3.15},27405]
[9,"2.4","EXECUÇÃO E COMPACTAÇÃO DE BASE E OU SUB BASE PARA PAVIMENTAÇÃO DE SOLOS DE COMPORTAMENTO LATERITICO - EXCLUSIVE SOLO, ESCAVAÇÃO, CARGA E TRANSPORTE (CASCALHO FORNECIDO PELA PREFEITURA)",96388,"M3",1300,{"$f":"VLOOKUP(A19,CPU!$A$1:$N$4760,9)","v":12.469999999999999},{"$f":"VLOOKUP(A19,CPU!$A$1:$N$4760,10)","v":15.29},19877]
[10,"2.5","IMPRIMAÇÃO COM EMULSÃO ASFÁLTICA (EAI)",96401,"M2",8700,{"$f":"VLOOKUP(A20,CPU!$A$1:$N$4760,9)","v":1.23},{"$f":"VLOOKUP(A20,CPU!$A$1:$N$4760,10)","v":1.51},13137]
[11,"2.6","PINTURA DE LIGAÇÃO COM EMULSÃO ASFÁLTICA RR-2C",96402,"M2",7600,{"$f":"VLOOKUP(A21,CPU!$A$1:$N$4760,9)","v":1.01},{"$f":"VLOOKUP(A21,CPU!$A$1:$N$4760,10)","v":1.24},9424]
[12,"2.7","EXECUÇÃO DE PAVIMENTO COM APLICAÇÃO DE CONCRETO ASFÁLTICO USINADO A QUENTE (CBUQ), CAMADA DE ROLAMENTO - EXCLUSIVE TRANSPORTE",95995,"M3",380,{"$f":"VLOOKUP(A22,CPU!$A$1:$N$4760,9)","v":129.6},{"$f":"VLOOKUP(A22,CPU!$A$1:$N$4760,10)","v":158.94999999999999},60401]
["C",3,"TRANSPORTE DE MATERIAIS",{"$nulls":5},{"$f":"SUM(I24:I27)","v":162280}]
[13,"3.1","TRANSPORTE COM CAMINHÃO BASCULANTE, EM VIA URBANA PAVIMENTADA",95877,"M3XKM",57000.001999999993,{"$f":"VLOOKUP(A24,CPU!$A$1:$N$4760,9)","v":1.78},{"$f":"VLOOKUP(A24,CPU!$A$1:$N$4760,10)","v":2.1800000000000002},{"$f":"ROUND(F24*H24,2)","v":124260}]
[13.5,"3.2","TRANSPORTE COM CAMINHÃO BASCULANTE, EM VIA URBANA PAVIMENTADA - ADICIONAL PARA DMT EXCEDENTE A 30KM",95427,"M3XKM",40000,{"$f":"VLOOKUP(A25,CPU!$A$1:$N$4760,9)","v":0.73},{"$f":"VLOOKUP(A25,CPU!$A$1:$N$4760,10)","v":0.9},{"$f":"ROUND(F25*H25,2)","v":36000}]
[14,"3.3","TRANSPORTE COM CAMINHÃO CARROCERIA 9T, EM VIA URBANA PAVIMENTADA",100947,"TXKM",499.9987648,{"$f":"VLOOKUP(A26,CPU!$A$1:$N$4760,9)","v":2.12},{"$f":"VLOOKUP(A26,CPU!$A$1:$N$4760,10)","v":2.6},{"$f":"ROUND(F26*H26,2)","v":1300}]
[15,"3.4","TRANSPORTE COM CAMINHÃO TANQUE DE TRANSPORTE DE MATERIAL ASFÁLTICO DE 30000 L, EM VIA URBANA PAVIMENTADA (BDI DIFERENCIADO)",102331,"TXKM",1200,{"$f":"VLOOKUP(A27,CPU!$A$1:$N$4760,9)","v":0.52},{"$f":"VLOOKUP(A27,CPU!$A$1:$N$4760,10)","v":0.6},{"$f":"ROUND(F27*H27,2)","v":720}]
["D",4,"OBRAS COMPLEMENTARES",{"$nulls":5},{"$f":"SUM(I29:I38)","v":260957.34}]
[16,"4.1","SARJETA TRIANGULAR DE CONCRETO - CONFORME PROJETO - AREIA E BRITA COMERCIAIS","CPU.4","M",2320,{"$f":"VLOOKUP(A29,CPU!$A$1:$N$4760,9)","v":66.89},{"$f":"VLOOKUP(A29,CPU!$A$1:$N$4760,10)","v":82.04},{"$f":"ROUND(F29*H29,2)","v":190332.79999999999}]
[16.100000000000001,"4.2","ESCAVAÇÃO MECANIZADA DE VALA COM PROFUNDIDADE ATÉ 1,5 M, EM SOLO DE 1A CATEGORIA",90105,"M3",54,{"$f":"VLOOKUP(A30,CPU!$A$1:$N$4760,9)","v":9.34},{"$f":"VLOOKUP(A30,CPU!$A$1:$N$4760,10)","v":11.46},618.84]
[16.2,"4.3","PREPARO DE FUNDO DE VALA COM LARGURA MENOR QUE 1,5 M (ACERTO DO SOLO NATURAL)",101616,"M2",36,{"$f":"VLOOKUP(A31,CPU!$A$1:$N$4760,9)","v":6.07},{"$f":"VLOOKUP(A31,CPU!$A$1:$N$4760,10)","v":7.44},267.83999999999997]
[16.3,"4.4","ESCORAMENTO DE VALA, TIPO PONTALETEAMENTO",101570,"M2",108,{"$f":"VLOOKUP(A32,CPU!$A$1:$N$4760,9)","v":26.27},{"$f":"VLOOKUP(A32,CPU!$A$1:$N$4760,10)","v":32.22},3479.76]
[16.399999999999999,"4.5","TUBO DE CONCRETO PARA REDES COLETORAS DE ÁGUAS PLUVIAIS, DIÂMETRO DE 400 MM, JUNTA RÍGIDA - FORNECIMENTO E ASSENTAMENTO, INCLUSIVE BERÇO EM CONCRETO","92210a","M",36,{"$f":"VLOOKUP(A33,CPU!$A$1:$N$4760,9)","v":247.08999999999997},{"$f":"VLOOKUP(A33,CPU!$A$1:$N$4760,10)","v":303.06},10910.16]
[16.5,"4.6","CAIXA COLETORA DE SARJETA - CCS 01 - COM GRELHA DE FERRO - TCC 02 - AREIA E BRITA COMERCIAIS",2003517,"UNID",3,{"$f":"VLOOKUP(A34,CPU!$A$1:$N$4760,9)","v":3889.9300000000003},{"$f":"VLOOKUP(A34,CPU!$A$1:$N$4760,10)","v":4771},14313]
[16.600000000000001,"4.8","REATERRO MANUAL DE VALAS COM COMPACTAÇÃO MECANIZADA",93382,"M3",54,{"$f":"VLOOKUP(A35,CPU!$A$1:$N$4760,9)","v":25.169999999999998},{"$f":"VLOOKUP(A35,CPU!$A$1:$N$4760,10)","v":30.87},1666.98]
[17,"4.9","FORNECIMENTO E INSTALAÇÃO DE PLACA DE SINALIZAÇÃO VIÁRIA - REGULAMENTAÇÃO ","CPU.5","UN.",10,{"$f":"VLOOKUP(A36,CPU!$A$1:$N$4760,9)","v":444.73},{"$f":"VLOOKUP(A36,CPU!$A$1:$N$4760,10)","v":545.46},5454.6]
[18,"4.10","LOCAÇÃO DE REDE DE ÁGUA OU ESGOTO",99063,"UN.",36,{"$f":"VLOOKUP(A37,CPU!$A$1:$N$4760,9)","v":5.92},{"$f":"VLOOKUP(A37,CPU!$A$1:$N$4760,10)","v":7.26},261.36]
[19,"4.4","PINTURA DE EIXO VIÁRIO SOBRE ASFALTO COM TINTA RETRORREFLETIVA A BASE DE RESINA ACRÍLICA COM MICROESFERAS DE VIDRO, APLICAÇÃO MECÂNICA COM DEMARCADORA AUTOPROPELIDA",102512,"M",4700,{"$f":"VLOOKUP(A38,CPU!$A$1:$N$4760,9)","v":5.84},{"$f":"VLOOKUP(A38,CPU!$A$1:$N$4760,10)","v":7.16},{"$f":"ROUND(F38*H38,2)","v":33652}]
["E",5,"FORNECIMENTOS - MATERIAL ASFÁLTICO (BDI DIFERENCIADO)",{"$nulls":5},{"$f":"SUM(I40:I42)","v":557407.77}]
[20,"5.1","AQUISIÇÃO DE EMULSÃO ASFÁLTICA PARA IMPRIMAÇÃO (EAI) - EXCLUSIVE TRANSPORTE","CPU.6","T",11.995000000000001,{"$f":"VLOOKUP(A40,CPU!$A$1:$N$4760,9)","v":2307.59},{"$f":"VLOOKUP(A40,CPU!$A$1:$N$4760,10)","v":2653.73},{"$f":"ROUND(F40*H40,2)","v":31831.49}]
{"$rows_left_out":4}
{"sheet":"CPU","index":1,"n_rows":457,"n_cols":13,"rows_kept":457,"cut":false,"hidden":false,"merged":[[354,0,367,0],[354,1,354,3],[354,4,354,7],[355,2,355,5],[356,2,356,3],[357,1,357,7],[364,1,364,3],[364,5,364,6],[365,1,365,6],[366,1,366,6],[367,1,367,6],[336,0,352,0],[336,1,336,3],[336,4,336,7],[337,2,337,5],[338,2,338,3],[339,1,339,7],[349,1,349,3],[349,5,349,6],[350,1,350,6],[351,1,351,6],[352,1,352,6],[318,0,334,0],[318,1,318,3],[318,4,318,7],[319,2,319,5],[320,2,320,3],[321,1,321,7],[331,1,331,3],[331,5,331,6],[332,1,332,6],[333,1,333,6],[334,1,334,6],[302,0,316,0],[302,1,302,3],[302,4,302,7],[303,2,303,5],[304,2,304,3],[305,1,305,7],[313,1,313,3],[313,5,313,6],[314,1,314,6],[315,1,315,6],[316,1,316,6],[287,0,300,0],[287,1,287,3],[287,4,287,7],[288,2,288,5],[289,2,289,3],[290,1,290,7],[297,1,297,3],[297,5,297,6],[298,1,298,6],[299,1,299,6],[300,1,300,6],[273,0,285,0],[273,1,273,3],[273,4,273,7],[274,2,274,5],[275,2,275,3],[276,1,276,7],[282,1,282,3],[282,5,282,6],[283,1,283,6],[284,1,284,6],[285,1,285,6],[218,10,218,11],[219,2,219,5],[220,2,220,3],[221,1,221,7],[226,1,226,3],[226,5,226,6],[227,1,227,6],[228,1,228,6],[229,1,229,6],[0,1,0,3],[0,4,0,7],[0,10,0,11],[1,2,1,5],[1,10,1,11],[2,2,2,3],[3,1,3,7],[9,1,9,3],[9,5,9,6],[10,1,10,6],[11,1,11,6],[12,1,12,6],[14,1,14,3],[14,4,14,7],[14,10,14,11],[15,2,15,5],[16,2,16,3],[17,1,17,7],[27,1,27,3],[27,5,27,6],[28,1,28,6],[29,1,29,6],[30,1,30,6],[32,1,32,3],[32,4,32,7],[32,10,32,11],[33,2,33,5],[34,2,34,3],[35,1,35,7],[41,1,41,3],[41,5,41,6],[42,1,42,6],[43,1,43,6],[44,1,44,6],[46,1,46,3],[46,4,46,7],[46,10,46,11],[47,2,47,5],[48,2,48,3],[49,1,49,7],[59,1,59,3],[59,5,59,6],[60,1,60,6],[61,1,61,6],[62,1,62,6],[64,1,64,3],[64,4,64,7],[64,10,64,11],[65,2,65,5],[66,2,66,3],[67,1,67,7],[75,1,75,3],[75,5,75,6],[76,1,76,6],[77,1,77,6],[78,1,78,6],[80,1,80,3],[80,4,80,7],[80,10,80,11],[81,2,81,5],[82,2,82,3],[83,1,83,7],[88,1,88,3],[88,5,88,6],[89,1,89,6],[90,1,90,6],[91,1,91,6],[93,1,93,3],[93,4,93,7],[94,2,94,5],[95,2,95,3],[96,1,96,7],[102,1,102,3],[102,5,102,6],[103,1,103,6],[104,1,104,6],[105,1,105,6],[107,1,107,3],[107,4,107,7],[107,10,107,11],[108,2,108,5],[109,2,109,3],[110,1,110,7],[120,1,120,3],[120,5,120,6],[121,1,121,6],[122,1,122,6],[123,1,123,6],[125,1,125,3],[125,4,125,7],[126,2,126,5],[127,2,127,3],[128,1,128,7],[140,1,140,3],[140,5,140,6],[141,1,141,6],[142,1,142,6],[143,1,143,6],[145,1,145,3],[145,4,145,7],[145,10,145,11],[146,2,146,5],[147,2,147,3],[148,1,148,7],[159,1,159,3],[159,5,159,6],[160,1,160,6],[161,1,161,6],[162,1,162,6],[164,1,164,3],[164,4,164,7],[164,10,164,11],[165,2,165,5],[166,2,166,3],[167,1,167,7],[178,1,178,3],[178,5,178,6],[179,1,179,6],[180,1,180,6],[181,1,181,6],[183,1,183,3],[183,4,183,7],[183,10,183,11],[184,2,184,5],[185,2,185,3],[186,1,186,7],[188,8,188,9],[200,1,200,3],[200,5,200,6],[201,1,201,6],[202,1,202,6],[203,1,203,6],[205,1,205,3],[205,4,205,7],[205,10,205,11],[206,2,206,5],[207,2,207,3],[208,1,208,7],[213,1,213,3],[213,5,213,6],[214,1,214,6],[215,1,215,6],[216,1,216,6],[231,1,231,3],[231,4,231,7],[232,2,232,5],[233,2,233,3],[218,1,218,3],[218,4,218,7],[234,1,234,7],[239,1,239,3],[239,5,239,6],[240,1,240,6],[241,1,241,6],[242,1,242,6],[244,1,244,3],[244,4,244,7],[244,10,244,11],[245,2,245,5],[246,2,246,3],[247,1,247,7],[251,1,251,3],[251,5,251,6],[252,1,252,6],[253,1,253,6],[254,1,254,6],[256,1,256,3],[256,4,256,7],[256,10,256,11],[257,2,257,5],[258,2,258,3],[259,1,259,7],[268,1,268,3],[268,5,268,6],[269,1,269,6],[270,1,270,6],[271,1,271,6],[407,1,407,7],[417,1,417,3],[417,5,417,6],[386,1,386,3],[386,4,386,7],[387,2,387,5],[388,2,388,3],[389,1,389,7],[399,1,399,3],[399,5,399,6],[446,1,446,3],[446,4,446,7],[447,2,447,5],[448,2,448,3],[449,1,449,7],[453,1,453,3],[453,5,453,6],[430,1,430,6],[431,1,431,6],[432,1,432,6],[434,1,434,3],[434,4,434,7],[435,2,435,5],[436,2,436,3],[437,1,437,7],[441,1,441,3],[441,5,441,6],[256,0,271,0],[386,0,402,0],[404,0,420,0],[422,0,432,0],[442,1,442,6],[443,1,443,6],[444,1,444,6],[418,1,418,6],[419,1,419,6],[420,1,420,6],[422,1,422,3],[422,4,422,7],[423,2,423,5],[424,2,424,3],[425,1,425,7],[429,1,429,3],[429,5,429,6],[400,1,400,6],[401,1,401,6],[402,1,402,6],[404,1,404,3],[404,4,404,7],[405,2,405,5],[406,2,406,3],[244,0,255,0],[0,0,13,0],[14,0,31,0],[32,0,45,0],[46,0,63,0],[64,0,79,0],[80,0,92,0],[93,0,105,0],[107,0,124,0],[125,0,143,0],[218,0,229,0],[452,14,453,14],[434,0,444,0],[446,0,456,0],[15,8,16,9],[33,8,34,9],[369,0,384,0],[369,1,369,3],[369,4,369,7],[370,2,370,5],[371,2,371,3],[372,1,372,7],[381,1,381,3],[381,5,381,6],[382,1,382,6],[383,1,383,6],[384,1,384,6],[454,1,454,6],[455,1,455,6],[456,1,456,6],[145,0,163,0],[164,0,182,0],[183,0,204,0],[205,0,216,0],[231,0,242,0]]}
[1,"CODEVASF",null,null," COMPOSIÇÃO DE PREÇO UNITÁRIO",null,null,null,{"$f":"H11","v":16112.24},{"$f":"H13","v":19761.66},"BDI CALCULADO:",null,{"$f":"ORÇAMENTO!I6","v":0.22649999999999998}]
[null,"OBRA:  ",{"$f":"ORÇAMENTO!C5","v":" PAVIMENTAÇÃO ASFÁLTICA EM CBUQ - VIAS DE ACESSO AO BAIRRO CARMO DE UNIÃO (NOVA UNIÃO/ MG) - ITEM 1"},null,null,null,"DATA: ",{"$f":"ORÇAMENTO!C6","v":" SETEMBRO / 2023   "},null,null,"BDI DIFERENCIADO:",null,{"$f":"'BDI FORN'!D31/100","v":0.15}]
[null,"SERVIÇO:  ",{"$f":"VLOOKUP(A1,ORÇAMENTO!A10:I29,3)","v":"MOBILIZAÇÃO E DESMOBILIZAÇÃO"},null,"Referência:","CPU.1","UNIDADE: ",{"$f":"VLOOKUP(A1,ORÇAMENTO!A10:I29,5)","v":"GL"}]
[]
[null,"TIPO ITEM","CODIGO ITEM","DESCRIÇÃO ITEM","UNIDADE ITEM","COEFICIENTE","PRECO UNITARIO","CUSTO TOTAL"]
[null,"COMPOSICAO",89876,"CAMINHÃO BASCULANTE 14 M3, COM CAVALO MECÂNICO DE CAPACIDADE MÁXIMA DE TRAÇÃO COMBINADO DE 36000 KG, POTÊNCIA 286 CV, INCLUSIVE SEMIREBOQUE COM CAÇAMBA METÁLICA ","CHP DIURNO.",16,316.13,{"$f":"ROUNDDOWN(F6*G6,2)","v":5058.08}]
[null,"COMPOSICAO",89877,"CAMINHÃO BASCULANTE 14 M3, COM CAVALO MECÂNICO DE CAPACIDADE MÁXIMA DE TRAÇÃO COMBINADO DE 36000 KG, POTÊNCIA 286 CV, INCLUSIVE SEMIREBOQUE TRAÇÃO ","CHI DIURNO.",8,89.75,{"$f":"ROUNDDOWN(F7*G7,2)","v":718}]
[null,"COMPOSICAO",5914640,"TRANSPORTE COM CAVALO MECÂNICO COM SEMIRREBOQUE COM CAPACIDADE DE 30 T - RODOVIA PAVIMENTADA","T.KM",3386,0.57999999999999996,1963.88]
[null,"COMPOSIÇÃO",88316,"SERVENTE COM ENCARGOS COMPLEMENTARES","H",16,19.760000000000002,316.16000000000003]
[null,"PRODUÇÃO DA EQUIPE",null,null,0.5,"CUSTO ",null,{"$f":"SUM(H6:H9)","v":8056.12}]
[null,"TOTAL",{"$nulls":5},{"$f":"H10/E10","v":16112.24},"OK"]
[null,"BDI                %",{"$nulls":5},{"$f":"1+$M$1","v":1.2264999999999999}]
[null,"TOTAL DO SERVIÇO - R$",{"$nulls":5},{"$f":"ROUND(H11*H12,2)","v":19761.66}]
[]
[{"$f":"A1+1","v":2},"CODEVASF",null,null," COMPOSIÇÃO DE PREÇO UNITÁRIO",null,null,null,{"$f":"H29","v":57685.120000000003},{"$f":"H31","v":70750.8}]
[null,"OBRA:  ",{"$f":"$C$2","v":" PAVIMENTAÇÃO ASFÁLTICA EM CBUQ - VIAS DE ACESSO AO BAIRRO CARMO DE UNIÃO (NOVA UNIÃO/ MG) - ITEM 1"},null,null,null,"DATA: ",{"$f":"$H$2","v":" SETEMBRO / 2023   "}]
[null,"SERVIÇO:  ",{"$f":"VLOOKUP(A15,ORÇAMENTO!$A$10:$I$29,3)","v":"ADMINISTRAÇÃO LOCAL"},null,"SINAPI","CPU.2","UNIDADE: ",{"$f":"VLOOKUP(A15,ORÇAMENTO!$A$10:$I$29,5)","v":"GL"}]
[]
[null,"TIPO ITEM","CODIGO ITEM","DESCRIÇÃO ITEM","UNIDADE ITEM","COEFICIENTE","PRECO UNITARIO","CUSTO TOTAL"]
[null,"INSUMO",14250,"ENERGIA ELÉTRICA","kwh",60,0.94,{"$f":"ROUNDDOWN(F20*G20,2)","v":56.4}]
[null,"INSUMO",44480,"TARIFA FORNECIMENTO DE ÁGUA/ESGOTO ","M3",6,17.78,106.68]
[null,"COTAÇÃO","MERC.","TELEFONE (PLANO CONTROLE)","UNID",2,59.9,119.8]
[null,"COMPOSICAO",90777,"Engenheiro Civil Júnior com encargos complementares","H",55,114.12,6276.6]
[null,"COMPOSICAO",90776,"Encarregado Geral com encargos complementares","H",110,57.73,6350.3]
[null,"COMPOSICAO",88321,"Tecnico de Laboratório com encargos complementares","H",55,45.45,2499.75]
[null,"COMPOSICAO",100309,"Tecnico em Segurança do Trabalho com encargos complementares","H",55,45.71,2514.0500000000002]
[null,"COMPOSICAO",90772,"Auxiliar de escritório com encargos complementares","H",55,23.72,1304.5999999999999]
[null,"PRODUÇÃO DA EQUIPE",null,null,0.33333000000000002,"CUSTO ",null,{"$f":"SUM(H20:H27)","v":19228.18}]
[null,"TOTAL",{"$nulls":5},{"$f":"ROUND(H28/E28,2)","v":57685.120000000003},"OK"]
[null,"BDI                %",{"$nulls":5},{"$f":"1+$M$1","v":1.2264999999999999}]
[null,"TOTAL DO SERVIÇO - R$",{"$nulls":5},{"$f":"ROUND(H29*H30,2)","v":70750.8}]
[]
[{"$f":"A15+1","v":3},"CODEVASF",null,null," COMPOSIÇÃO DE PREÇO UNITÁRIO",null,null,null,{"$f":"H43","v":6950.25},{"$f":"H45","v":8524.48}]
[null,"OBRA:  ",{"$f":"$C$2","v":" PAVIMENTAÇÃO ASFÁLTICA EM CBUQ - VIAS DE ACESSO AO BAIRRO CARMO DE UNIÃO (NOVA UNIÃO/ MG) - ITEM 1"},null,null,null,"DATA: ",{"$f":"$H$2","v":" SETEMBRO / 2023   "}]
[null,"SERVIÇO:  ",{"$f":"VLOOKUP(A33,ORÇAMENTO!$A$10:$I$29,3)","v":"CANTEIRO DE OBRAS"},null,"SINAPI",{"$f":"VLOOKUP(A33,ORÇAMENTO!$A$10:$I$29,4)","v":"CPU.3"},"UNIDADE: ",{"$f":"VLOOKUP(A33,ORÇAMENTO!$A$10:$I$29,5)","v":"GL"}]
[]
[null,"TIPO ITEM","CODIGO ITEM","DESCRIÇÃO ITEM","UNIDADE ITEM","COEFICIENTE","PRECO UNITARIO","CUSTO TOTAL"]
[null,"INSUMO",10775,"LOCACAO DE CONTAINER COM 1 SANITARIO, PARA ESCRITORIO,COMPLETO, SEM DIVISORIAS INTERNAS","MÊS",3,975,{"$f":"ROUNDDOWN(F38*G38,2)","v":2925}]
[null,"INSUMO",10779,"LOCACAO DE CONTAINER P/ SANITARIO, C/ 5 BACIAS, 1 LAVATORIO E 4 MICTORIOS","MÊS",3,1218.75,3656.25]
[null,"INSUMO","37525","TELA PLASTICA TECIDA LISTRADA BRANCA E LARANJA, TIPO GUARDA CORPO, EM POLIETILENO MONOFILADO, ROLO 1,20 X 50 M (L X C)","M",100,3.69,369]
{"$rows_left_out":418}
{"sheet":"BDI SERV","index":2,"n_rows":37,"n_cols":5,"rows_kept":37,"cut":false,"hidden":false,"merged":[[32,6,35,8],[36,0,36,5],[3,1,4,1],[3,2,4,2],[0,1,2,4],[32,0,34,5],[28,0,28,5],[30,1,30,2],[31,1,31,2]]}
[null,"DETALHAMENTO DO BDI - SERVIÇOS"]
[]
[]
[null,"Item","Descrição dos Serviços","%","%"]
[null,null,null,"PV","CD"]
[]
[null,1,"ADMINISTRAÇÃO CENTRAL"," ",4.01]
[null,"1.1","ESCRITÓRIO CENTRAL"," "," "]
[null,"1.2","VIAGENS"," "," "]
[null,"1.3","OUTROS"," "," "]
[null," "," "," "," "]
[null,2,"IMPOSTOS E TAXAS",{"$f":"SUM(D13:D16)","v":7.15},{"$f":"SUM(E13:E16)","v":8.94}]
[null,"2.1","ISS (*)",3.5,{"$f":"ROUND(D13*1.2515,2)","v":4.38}]
[null,"2.2","PIS",0.65,0.81]
[null,"2.3","Cofins",3,3.75]
[null,"2.4","CONTRIBUIÇÃO PREVIDENCIÁRIA SOBRE A RENDA BRUTA",0,0]
[]
[null,3,"TAXA DE RISCO"," ",{"$f":"SUM(E19:E22)","v":0.96}]
[null,"3.1","SEGURO",null,0.2]
[null,"3.2","RISCO",null,0.56000000000000005]
[null,"3.3","GARANTIA",null,0.2]
[]
[null,4,"DESPESAS FINANCEIRAS"," ",1.1100000000000001]
[]
[null,5,"LUCRO",null,7.3]
[]
[null," ","BDI - CALCULADO"," ",{"$f":"ROUND((((1+(E7+E18)/100)*(1+E23/100)*(1+E25/100)/(1-D12/100)-1)*100),2)","v":22.65}]
[]
["BDI = ((1+((AC+S+R+G)/100))x(1+DF/100)x(1+L/100)/(1-I/100)-1)*100"]
[]
[null,"BDI (CALCULADO):",null,{"$f":"ROUND((((1+((E7+E18)/100))*(1+E23/100)*(1+E25/100))/(1-D12/100)-1)*100,2)","v":22.65},"%"]
[null," "]
["(*) ISS conforme Lei Municipal nº 839/2017 - Considerando as deduções previstas no Art. 3º - § 10º \n(Dedução de 30% sem necessidade de comprovação)"]
[]
[]
[]
["BDI EM CONFORMIDADE COM OS ACÓRDÃOS Nº 2369/2011 e ACÓRDÃO Nº 2.622/2013 - TCU - PLENÁRIO"]

{"sheet":"BDI FORN","index":3,"n_rows":37,"n_cols":5,"rows_kept":37,"cut":false,"hidden":false,"merged":[[0,1,2,4],[28,0,28,5],[30,1,30,2],[31,1,31,2],[36,0,36,5],[3,1,4,1],[3,2,4,2],[32,0,34,5]]}
[null,"DETALHAMENTO DO BDI - FORNECIMENTO \n(MATERIAL ASFÁLTICO)"]
[]
[]
[null,"Item","Descrição dos Serviços","%","%"]
[null,null,null,"PV","CD"]
[]
[null,1,"ADMINISTRAÇÃO CENTRAL"," ",3.72]
[null,"1.1","ESCRITÓRIO CENTRAL"," "," "]
[null,"1.2","VIAGENS"," "," "]
[null,"1.3","OUTROS"," "," "]
[null," "," "," "," "]
[null,2,"IMPOSTOS E TAXAS",{"$f":"SUM(D13:D16)","v":3.65},{"$f":"SUM(E13:E16)","v":4.5600000000000005}]
[null,"2.1","ISS (*)",null,{"$f":"ROUND(D13*1.2515,2)","v":0}]
[null,"2.2","PIS",0.65,0.81]
[null,"2.3","Cofins",3,3.75]
[null,"2.4","CONTRIBUIÇÃO PREVIDENCIÁRIA SOBRE A RENDA BRUTA",0,0]
[]
[null,3,"TAXA DE RISCO"," ",{"$f":"SUM(E19:E22)","v":0.82000000000000006}]
[null,"3.1","SEGURO",null,0.16]
[null,"3.2","RISCO",null,0.5]
[null,"3.3","GARANTIA",null,0.16]
[]
[null,4,"DESPESAS FINANCEIRAS"," ",0.94]
[]
[null,5,"LUCRO",null,5]
[]
[null," ","BDI - CALCULADO"," ",{"$f":"ROUND((((1+(E7+E18)/100)*(1+E23/100)*(1+E25/100)/(1-D12/100)-1)*100),2)","v":15}]
[]
["BDI = ((1+((AC+S+R+G)/100))x(1+DF/100)x(1+L/100)/(1-I/100)-1)*100"]
[]
[null,"BDI (CALCULADO):",null,{"$f":"ROUND((((1+((E7+E18)/100))*(1+E23/100)*(1+E25/100))/(1-D12/100)-1)*100,2)","v":15},"%"]
[null," "]
[]
[]
[]
[]
["BDI EM CONFORMIDADE COM OS ACÓRDÃOS Nº 2369/2011 e ACÓRDÃO Nº 2.622/2013 - TCU - PLENÁRIO"]

{"sheet":"CRONOGRAMA","index":4,"n_rows":19,"n_cols":9,"rows_kept":19,"cut":false,"hidden":false,"merged":[[0,1,0,8],[3,1,3,7],[5,0,6,0],[5,2,6,2],[1,2,2,4],[1,6,1,8],[2,6,2,8],[7,0,8,0],[9,0,10,0],[11,0,12,0],[13,0,14,0],[1,1,2,1],[5,1,6,1],[7,1,8,1],[9,1,10,1],[11,1,12,1],[13,1,14,1],[15,1,16,2],[18,1,22,8],[7,2,8,2],[9,2,10,2],[11,2,12,2],[13,2,14,2]]}
[null,"CRONOGRAMA FÍSICO-FINANCEIRO"]
[null,"OBRA: ",{"$f":"ORÇAMENTO!C5","v":" PAVIMENTAÇÃO ASFÁLTICA EM CBUQ - VIAS DE ACESSO AO BAIRRO CARMO DE UNIÃO (NOVA UNIÃO/ MG) - ITEM 1"},null,null,"VALOR:",{"$f":"ORÇAMENTO!I43","v":1233305.77}]
[{"$nulls":5},"PRAZO: ","180 DIAS "]
[]
[null,"ITEM","ETAPAS/DESCRIÇAO","FISICO/  FINANCEIRO","TOTAL    ETAPAS","MÊS 1","MÊS 2","MÊS 3","TOTAL"]
["A",{"$f":"VLOOKUP(A6,ORÇAMENTO!$A$9:$I$43,2)","v":1},{"$f":"VLOOKUP(A6,ORÇAMENTO!$A$9:$I$43,3)","v":"SERVIÇOS PRELIMINARES "},"FISICO ",{"$f":"ROUND(E7/$G$2,4)","v":8.5199999999999998E-2},0.3,0.4,0.3,{"$f":"SUM(F6:H6)","v":1}]
[null,null,null,"FINANCEIRO",{"$f":"ORÇAMENTO!I9","v":105022.66},{"$f":"ROUND($E$7*F6,2)","v":31506.799999999999},42009.06,31506.799999999999,{"$f":"SUM(F7:H7)","v":105022.66}]
["B",{"$f":"VLOOKUP(A8,ORÇAMENTO!$A$9:$I$43,2)","v":2},{"$f":"VLOOKUP(A8,ORÇAMENTO!$A$9:$I$43,3)","v":"TERRAPLANAGEM E PAVIMENTAÇÃO"},"FISICO ",{"$f":"ROUND(E9/$G$2,4)","v":0.1197},0.3,0.4,0.3,{"$f":"SUM(F8:H8)","v":1}]
[null,null,null,"FINANCEIRO",{"$f":"ORÇAMENTO!I15","v":147638},{"$f":"ROUND($E$9*F8,2)","v":44291.4},59055.199999999997,44291.4,{"$f":"SUM(F9:H9)","v":147638}]
["C",{"$f":"VLOOKUP(A10,ORÇAMENTO!$A$9:$I$43,2)","v":3},{"$f":"VLOOKUP(A10,ORÇAMENTO!$A$9:$I$43,3)","v":"TRANSPORTE DE MATERIAIS"},"FISICO ",{"$f":"ROUND(E11/$G$2,4)","v":0.13159999999999999},0.3,0.4,0.3,{"$f":"SUM(F10:H10)","v":1}]
[null,null,null,"FINANCEIRO",{"$f":"ORÇAMENTO!I23","v":162280},{"$f":"ROUND($E$11*F10,2)","v":48684},64912,48684,{"$f":"SUM(F11:H11)-0.04","v":162279.96}]
["D",{"$f":"VLOOKUP(A12,ORÇAMENTO!$A$9:$I$43,2)","v":4},{"$f":"VLOOKUP(A12,ORÇAMENTO!$A$9:$I$43,3)","v":"OBRAS COMPLEMENTARES"},"FISICO ",{"$f":"ROUND(E13/$G$2,4)","v":0.21160000000000001},0,0.5,0.5,{"$f":"SUM(F12:H12)","v":1}]
[null,null,null,"FINANCEIRO",{"$f":"ORÇAMENTO!I28","v":260957.34},{"$f":"ROUND($E$13*F12,2)","v":0},130478.67,130478.67,{"$f":"SUM(F13:H13)-0.02","v":260957.32}]
["E",{"$f":"VLOOKUP(A14,ORÇAMENTO!$A$9:$I$43,2)","v":5},{"$f":"VLOOKUP(A14,ORÇAMENTO!$A$9:$I$43,3)","v":"FORNECIMENTOS - MATERIAL ASFÁLTICO (BDI DIFERENCIADO)"},"FISICO ",{"$f":"ROUND(E15/$G$2,4)","v":0.45200000000000001},0.3,0.4,0.3,{"$f":"SUM(F14:H14)","v":1}]
[null,null,null,"FINANCEIRO",{"$f":"ORÇAMENTO!I39","v":557407.77},{"$f":"ROUND($E$15*F14,2)","v":167222.32999999999},{"$f":"ROUND($E$15*G14,2)","v":222963.11},167222.32999999999,{"$f":"SUM(F15:H15)-0.02","v":557407.74999999988}]
[null,"TOTAL",null,"FISICO ",{"$f":"SUM(F16:H16)","v":1},{"$f":"F17/$E$17","v":0.23652247244412061},{"$f":"G17/$E$17","v":0.42115917450057822},0.34231835305530106,{"$f":"SUM(F16:H16)","v":1}]
[null,null,null,"FINANCEIRO",{"$f":"E11+E9+E7+E13+E15","v":1233305.77},{"$f":"F11+F9+F7+F13+F15","v":291704.52999999997},{"$f":"G11+G9+G7+G13+G15","v":519418.04},422183.19999999995,{"$f":"SUM(F17:H17)","v":1233305.77}]
[]
[null,"OBSERVAÇÕES:"]