{"text_format":"2","workbook":"xlsx","n_sheets":5,"sheets":["ORÇAMENTO","CPU","BDI SERV","BDI FORN","CRONOGRAMA"],"not_rendered":{"charts":0,"images":2,"macros":0,"external_links":0,"defined_names":5,"comments":1,"pivot_tables":0},"unopened":[],"bounds":{"document_bytes":16777216,"sheet_cells":100000,"run_cost":"one","rows_first":2000,"rows_last":500,"rows_between":2000,"halvings":0,"cell_chars":16384,"cell_head_chars":4096},"cells_cut":0,"cells_raw":0,"read":"whole","date_system":"1900"}

{"sheet":"ORÇAMENTO","index":0,"n_rows":37,"n_cols":9,"rows_kept":37,"cut":false,"hidden":false,"merged":[[36,1,36,2],[0,0,7,0],[0,2,0,8],[1,2,1,8],[2,2,2,8],[4,2,4,8],[5,6,5,7],[6,1,6,2],[6,6,6,7]]}
["<---- NUMERAR SERVIÇOS PARA CPU",null,"Ministério do Desenvolvimento Regional"]
[null,null,"Companhia de Desenvolvimento dos Vales do São Francisco e do Parnaíba"]
[null,null,"1ª Superintendência Regional"]
[]
[null,"OBRA: "," PAVIMENTAÇÃO ASFÁLTICA EM CBUQ - VIAS DIVERSAS – BAIRRO INDUSTRIAL (PIRAPORA / MG) - ITEM 2"]
[null,"DATA:"," SETEMBRO / 2023   ",null,null,null,"BDI Serviços:",null,{"$f":"'BDI SERV'!D31/100","v":0.21350000000000002}]
[null,"PRAZO DE EXECUÇÃO:     120 DIAS",{"$nulls":4},"BDI Serviços:",null,{"$f":"'BDI FORN'!D31/100","v":0.15}]
[null,"ITEM","DISCRIMINAÇÃO","REFER.","UNID.","QUANT.","P. UNITÁRIO","P.UNIT.C/ BDI","P. TOTAL"]
["A",1,"SERVIÇOS PRELIMINARES ",{"$nulls":5},{"$f":"SUM(I10:I14)","v":208282.88}]
[1,"1.1","MOBILIZAÇÃO E DESMOBILIZAÇÃO","CPU.1","GL",1,{"$f":"VLOOKUP(A10,CPU!$A$1:$N$4673,9)","v":16665.080000000002},{"$f":"VLOOKUP(A10,CPU!$A$1:$N$4673,10)","v":20223.07},{"$f":"ROUND(F10*H10,2)","v":20223.07}]
[2,"1.2","ADMINISTRAÇÃO LOCAL","CPU.2","GL",1,{"$f":"VLOOKUP(A11,CPU!$A$1:$N$4673,9)","v":118872.92},{"$f":"VLOOKUP(A11,CPU!$A$1:$N$4673,10)","v":144252.29},{"$f":"ROUND(F11*H11,2)","v":144252.29}]
[3,"1.3","CANTEIRO DE OBRAS","CPU.3","GL",3,{"$f":"VLOOKUP(A12,CPU!$A$1:$N$4673,9)","v":9144},{"$f":"VLOOKUP(A12,CPU!$A$1:$N$4673,10)","v":11096.24},{"$f":"ROUND(F12*H12,2)","v":33288.720000000001}]
[4,"1.4","PLACA DE OBRA EM CHAPA DE AÇO GALVANIZADO",103689,"M2",9,{"$f":"VLOOKUP(A13,CPU!$A$1:$N$4673,9)","v":340.5},{"$f":"VLOOKUP(A13,CPU!$A$1:$N$4673,10)","v":413.2},{"$f":"ROUND(F13*H13,2)","v":3718.8}]
[5,"1.5","SERVIÇOS TOPOGRÁFICOS PARA PAVIMENTAÇÃO, INCLUSIVE NOTA DE SERVIÇO, ACOMPANHAMENTO E GREIDE",78472,"M2",17000,{"$f":"VLOOKUP(A14,CPU!$A$1:$N$4673,9)","v":0.32999999999999996},{"$f":"VLOOKUP(A14,CPU!$A$1:$N$4673,10)","v":0.4},{"$f":"ROUND(F14*H14,2)","v":6800}]
["B",2,"TERRAPLANAGEM E PAVIMENTAÇÃO",{"$nulls":5},{"$f":"SUM(I16:I22)","v":549537.9}]
[6,"2.1","ESCAVAÇÃO HORIZONTAL EM SOLO DE 1A CATEGORIA ",101116,"M3",5100,{"$f":"VLOOKUP(A16,CPU!$A$1:$N$4673,9)","v":2.2000000000000002},{"$f":"VLOOKUP(A16,CPU!$A$1:$N$4673,10)","v":2.67},{"$f":"ROUND(F16*H16,2)","v":13617}]
[7,"2.2","CARGA, MANOBRA E DESCARGA DE SOLOS E MATERIAIS GRANULARES EM CAMINHÃO BASCULANTE",100976,"M3",5100,{"$f":"VLOOKUP(A17,CPU!$A$1:$N$4673,9)","v":8.7100000000000009},{"$f":"VLOOKUP(A17,CPU!$A$1:$N$4673,10)","v":7.88},40188]
[8,"2.3","REGULARIZAÇÃO E COMPACTAÇÃO DO SUBLEITO ",100576,"M2",17000,{"$f":"VLOOKUP(A18,CPU!$A$1:$N$4673,9)","v":2.57},{"$f":"VLOOKUP(A18,CPU!$A$1:$N$4673,10)","v":3.12},53040]
[9,"2.4","EXECUÇÃO E COMPACTAÇÃO DE BASE E OU SUB-BASE PARA PAVIMENTAÇÃO DE SOLO BRITA - 50/50 - EXCLUSIVE SOLO, ESCAVAÇÃO, CARGA E TRANSPORTE",100565,"M3",2550,{"$f":"VLOOKUP(A19,CPU!$A$1:$N$4673,9)","v":104.78999999999999},{"$f":"VLOOKUP(A19,CPU!$A$1:$N$4673,10)","v":127.16},324258]
[10,"2.5","IMPRIMAÇÃO COM EMULSÃO ASFÁLTICA (EAI)",96401,"M2",17000,{"$f":"VLOOKUP(A20,CPU!$A$1:$N$4673,9)","v":1.23},{"$f":"VLOOKUP(A20,CPU!$A$1:$N$4673,10)","v":1.49},25330]
[11,"2.6","PINTURA DE LIGAÇÃO COM EMULSÃO ASFÁLTICA RR-1C",96402,"M2",15600,{"$f":"VLOOKUP(A21,CPU!$A$1:$N$4673,9)","v":1.01},{"$f":"VLOOKUP(A21,CPU!$A$1:$N$4673,10)","v":1.23},19188]
[12,"2.7","EXECUÇÃO DE PAVIMENTO COM APLICAÇÃO DE CONCRETO ASFÁLTICO USINADO A QUENTE (CBUQ), CAMADA DE ROLAMENTO - EXCLUSIVE TRANSPORTE",95995,"M3",470,{"$f":"VLOOKUP(A22,CPU!$A$1:$N$4673,9)","v":129.6},{"$f":"VLOOKUP(A22,CPU!$A$1:$N$4673,10)","v":157.27000000000001},73916.899999999994]
["C",3,"TRANSPORTE DE MATERIAIS",{"$nulls":5},{"$f":"SUM(I24:I27)","v":528298.98}]
[13,"3.1","TRANSPORTE COM CAMINHÃO BASCULANTE, EM VIA URBANA PAVIMENTADA",95877,"M3XKM",104999.996,{"$f":"VLOOKUP(A24,CPU!$A$1:$N$4673,9)","v":1.78},{"$f":"VLOOKUP(A24,CPU!$A$1:$N$4673,10)","v":2.16},{"$f":"ROUND(F24*H24,2)","v":226799.99}]
[13.5,"3.2","TRANSPORTE COM CAMINHÃO BASCULANTE, EM VIA URBANA PAVIMENTADA - ADICIONAL PARA DMT EXCEDENTE A 30KM",95427,"M3XKM",330000,{"$f":"VLOOKUP(A25,CPU!$A$1:$N$4673,9)","v":0.73},{"$f":"VLOOKUP(A25,CPU!$A$1:$N$4673,10)","v":0.89},{"$f":"ROUND(F25*H25,2)","v":293700}]
[14,"3.3","TRANSPORTE COM CAMINHÃO CARROCERIA 9T, EM VIA URBANA PAVIMENTADA",100947,"TXKM",699.99600640000006,{"$f":"VLOOKUP(A26,CPU!$A$1:$N$4673,9)","v":2.12},{"$f":"VLOOKUP(A26,CPU!$A$1:$N$4673,10)","v":2.57},{"$f":"ROUND(F26*H26,2)","v":1798.99}]
[15,"3.4","TRANSPORTE COM CAMINHÃO TANQUE DE TRANSPORTE DE MATERIAL ASFÁLTICO DE 30000 L, EM VIA URBANA PAVIMENTADA (BDI DIFERENCIADO)",102331,"TXKM",10000,{"$f":"VLOOKUP(A27,CPU!$A$1:$N$4673,9)","v":0.52},{"$f":"VLOOKUP(A27,CPU!$A$1:$N$4673,10)","v":0.6},{"$f":"ROUND(F27*H27,2)","v":6000}]
["D",4,"OBRAS COMPLEMENTARES",{"$nulls":5},{"$f":"SUM(I29:I32)","v":287257.21999999997}]
[16,"4.1","GUIA (MEIO-FIO) E SARJETA CONJUGADOS DE CONCRETO, MOLDADA IN LOCO COM EXTRUSORA, 45 CM BASE (15 CM BASE DA GUIA + 30 CM BASE DA SARJETA) X 22 CM ALTURA",94267,"M",3200,{"$f":"VLOOKUP(A29,CPU!$A$1:$N$4673,9)","v":57.319999999999986},{"$f":"VLOOKUP(A29,CPU!$A$1:$N$4673,10)","v":69.56},{"$f":"ROUND(F29*H29,2)","v":222592}]
[17,"4.2","FORNECIMENTO E INSTALAÇÃO DE PLACA DE SINALIZAÇÃO VIÁRIA - REGULAMENTAÇÃO OCTOGONAL (PARE) 0,60MX0,60M","CPU.4","UN.",25,{"$f":"VLOOKUP(A30,CPU!$A$1:$N$4673,9)","v":444.73},{"$f":"VLOOKUP(A30,CPU!$A$1:$N$4673,10)","v":539.67999999999995},{"$f":"ROUND(F30*H30,2)","v":13492}]
[18,"4.3","FORNECIMENTO E INSTALAÇÃO DE PLACA DE IDENTIFICACAO DE RUA EM CHAPA DE AÇO PINTADA COM PELÍCULA DE ALTA INTENSIDADE, 45 CM X 20 CM - INCLUSIVE SUPORTE DE MADEIRA, CONFORME PROJETO (02 PLACAS POR SUPORTE)","CPU.5","UN.",25,{"$f":"VLOOKUP(A31,CPU!$A$1:$N$4673,9)","v":436.48},{"$f":"VLOOKUP(A31,CPU!$A$1:$N$4673,10)","v":529.66999999999996},{"$f":"ROUND(F31*H31,2)","v":13241.75}]
[19,"4.4","PINTURA DE EIXO VIÁRIO SOBRE ASFALTO COM TINTA RETRORREFLETIVA A BASE DE RESINA ACRÍLICA COM MICROESFERAS DE VIDRO, APLICAÇÃO MECÂNICA COM DEMARCADORA AUTOPROPELIDA",102512,"M",5349.9957142857147,{"$f":"VLOOKUP(A32,CPU!$A$1:$N$4673,9)","v":5.84},{"$f":"VLOOKUP(A32,CPU!$A$1:$N$4673,10)","v":7.09},{"$f":"ROUND(F32*H32,2)","v":37931.47}]
["E",5,"FORNECIMENTOS - MATERIAL ASFÁLTICO (BDI DIFERENCIADO)",{"$nulls":5},{"$f":"SUM(I34:I36)","v":915288.14}]
[20,"5.1","AQUISIÇÃO DE EMULSÃO ASFÁLTICA PARA IMPRIMAÇÃO (EAI) - EXCLUSIVE TRANSPORTE","CPU.6","T",24,{"$f":"VLOOKUP(A34,CPU!$A$1:$N$4673,9)","v":2307.59},{"$f":"VLOOKUP(A34,CPU!$A$1:$N$4673,10)","v":2653.73},{"$f":"ROUND(F34*H34,2)","v":63689.52}]
[21,"5.2","AQUISIÇÃO DE EMULSAO ASFALTICA CATIONICA RR-1C - EXCLUSIVE TRANSPORTE","CPU.7","T",7.5,{"$f":"VLOOKUP(A35,CPU!$A$1:$N$4673,9)","v":2736.39},{"$f":"VLOOKUP(A35,CPU!$A$1:$N$4673,10)","v":3146.85},{"$f":"ROUND(F35*H35,2)","v":23601.38}]
[22,"5.3","AQUISIÇÃO DE CONCRETO BETUMINOSO USINADO A QUENTE (CBUQ) PARA PAVIMENTACAO ASFALTICA, PADRAO DNIT, FAIXA C, COM CAP 50/70 - EXCLUSIVE TRANSPORTE","CPU.8","T",1199.9960000000001,{"$f":"VLOOKUP(A36,CPU!$A$1:$N$4673,9)","v":600},{"$f":"VLOOKUP(A36,CPU!$A$1:$N$4673,10)","v":690},{"$f":"ROUND(F36*H36,2)","v":827997.24}]
[null,"TOTAL GERAL DA OBRA COM BDI ",{"$nulls":6},{"$f":"SUM(I9,I15,I23,I28,I33)","v":2488665.12}]

{"sheet":"CPU","index":1,"n_rows":370,"n_cols":13,"rows_kept":370,"cut":false,"hidden":false,"merged":[[0,0,13,0],[0,1,0,3],[0,4,0,7],[0,10,0,11],[1,2,1,5],[1,10,1,11],[2,2,2,3],[3,1,3,7],[9,1,9,3],[9,5,9,6],[10,1,10,6],[11,1,11,6],[12,1,12,6],[14,0,32,0],[14,1,14,3],[14,4,14,7],[14,10,14,11],[15,2,15,5],[15,8,16,9],[16,2,16,3],[17,1,17,7],[28,1,28,3],[28,5,28,6],[29,1,29,6],[30,1,30,6],[31,1,31,6],[33,0,46,0],[33,1,33,3],[33,4,33,7],[33,10,33,11],[34,2,34,5],[34,8,35,9],[35,2,35,3],[36,1,36,7],[42,1,42,3],[42,5,42,6],[43,1,43,6],[44,1,44,6],[45,1,45,6],[47,0,64,0],[47,1,47,3],[47,4,47,7],[47,10,47,11],[48,2,48,5],[49,2,49,3],[50,1,50,7],[60,1,60,3],[60,5,60,6],[61,1,61,6],[62,1,62,6],[63,1,63,6],[65,0,80,0],[65,1,65,3],[65,4,65,7],[65,10,65,11],[66,2,66,5],[67,2,67,3],[68,1,68,7],[76,1,76,3],[76,5,76,6],[77,1,77,6],[78,1,78,6],[79,1,79,6],[81,0,93,0],[81,1,81,3],[81,4,81,7],[81,10,81,11],[82,2,82,5],[83,2,83,3],[84,1,84,7],[89,1,89,3],[89,5,89,6],[90,1,90,6],[91,1,91,6],[92,1,92,6],[94,0,106,0],[94,1,94,3],[94,4,94,7],[95,2,95,5],[96,2,96,3],[97,1,97,7],[103,1,103,3],[103,5,103,6],[104,1,104,6],[105,1,105,6],[106,1,106,6],[108,0,125,0],[108,1,108,3],[108,4,108,7],[108,10,108,11],[109,2,109,5],[110,2,110,3],[111,1,111,7],[121,1,121,3],[121,5,121,6],[122,1,122,6],[123,1,123,6],[124,1,124,6],[126,0,149,0],[126,1,126,3],[126,4,126,7],[127,2,127,5],[128,2,128,3],[129,1,129,7],[146,1,146,3],[146,5,146,6],[147,1,147,6],[148,1,148,6],[149,1,149,6],[151,0,169,0],[151,1,151,3],[151,4,151,7],[151,10,151,11],[152,2,152,5],[153,2,153,3],[154,1,154,7],[165,1,165,3],[165,5,165,6],[166,1,166,6],[167,1,167,6],[168,1,168,6],[170,0,188,0],[170,1,170,3],[170,4,170,7],[170,10,170,11],[171,2,171,5],[172,2,172,3],[173,1,173,7],[184,1,184,3],[184,5,184,6],[185,1,185,6],[186,1,186,6],[187,1,187,6],[189,0,210,0],[189,1,189,3],[189,4,189,7],[189,10,189,11],[190,2,190,5],[191,2,191,3],[192,1,192,7],[194,8,194,9],[206,1,206,3],[206,5,206,6],[207,1,207,6],[208,1,208,6],[209,1,209,6],[211,0,222,0],[211,1,211,3],[211,4,211,7],[211,10,211,11],[212,2,212,5],[213,2,213,3],[214,1,214,7],[219,1,219,3],[219,5,219,6],[220,1,220,6],[221,1,221,6],[222,1,222,6],[224,0,235,0],[224,1,224,3],[224,4,224,7],[224,10,224,11],[225,2,225,5],[226,2,226,3],[227,1,227,7],[232,1,232,3],[232,5,232,6],[233,1,233,6],[234,1,234,6],[235,1,235,6],[237,0,248,0],[237,1,237,3],[237,4,237,7],[238,2,238,5],[239,2,239,3],[240,1,240,7],[245,1,245,3],[245,5,245,6],[246,1,246,6],[247,1,247,6],[248,1,248,6],[250,0,261,0],[250,1,250,3],[250,4,250,7],[250,10,250,11],[251,2,251,5],[252,2,252,3],[253,1,253,7],[257,1,257,3],[257,5,257,6],[258,1,258,6],[259,1,259,6],[260,1,260,6],[262,0,279,0],[262,1,262,3],[262,4,262,7],[262,10,262,11],[263,2,263,5],[264,2,264,3],[265,1,265,7],[276,1,276,3],[276,5,276,6],[277,1,277,6],[278,1,278,6],[279,1,279,6],[281,0,297,0],[281,1,281,3],[281,4,281,7],[282,2,282,5],[283,2,283,3],[284,1,284,7],[294,1,294,3],[294,5,294,6],[295,1,295,6],[296,1,296,6],[297,1,297,6],[299,0,315,0],[299,1,299,3],[299,4,299,7],[300,2,300,5],[301,2,301,3],[302,1,302,7],[312,1,312,3],[312,5,312,6],[313,1,313,6],[314,1,314,6],[315,1,315,6],[317,0,333,0],[317,1,317,3],[317,4,317,7],[318,2,318,5],[319,2,319,3],[320,1,320,7],[330,1,330,3],[330,5,330,6],[331,1,331,6],[332,1,332,6],[333,1,333,6],[335,0,345,0],[335,1,335,3],[335,4,335,7],[336,2,336,5],[337,2,337,3],[338,1,338,7],[342,1,342,3],[342,5,342,6],[343,1,343,6],[344,1,344,6],[345,1,345,6],[347,0,357,0],[347,1,347,3],[347,4,347,7],[348,2,348,5],[349,2,349,3],[350,1,350,7],[354,1,354,3],[354,5,354,6],[355,1,355,6],[356,1,356,6],[357,1,357,6],[359,0,369,0],[359,1,359,3],[359,4,359,7],[360,2,360,5],[361,2,361,3],[362,1,362,7],[366,1,366,3],[366,5,366,6],[367,1,367,6],[368,1,368,6],[369,1,369,6]]}
[1,"CODEVASF",null,null," COMPOSIÇÃO DE PREÇO UNITÁRIO",null,null,null,{"$f":"H11","v":16665.080000000002},{"$f":"H13","v":20223.07},"BDI CALCULADO:",null,{"$f":"ORÇAMENTO!I6","v":0.21350000000000002}]
[null,"OBRA:  ",{"$f":"ORÇAMENTO!C5","v":" PAVIMENTAÇÃO ASFÁLTICA EM CBUQ - VIAS DIVERSAS – BAIRRO INDUSTRIAL (PIRAPORA / MG) - ITEM 2"},null,null,null,"DATA: ",{"$f":"ORÇAMENTO!C6","v":" SETEMBRO / 2023   "},null,null,"BDI DIFERENCIADO:",null,{"$f":"'BDI FORN'!D31/100","v":0.15}]
[null,"SERVIÇO:  ",{"$f":"VLOOKUP(A1,ORÇAMENTO!A10:I29,3)","v":"MOBILIZAÇÃO E DESMOBILIZAÇÃO"},null,"Referência:","CPU.1","UNIDADE: ",{"$f":"VLOOKUP(A1,ORÇAMENTO!A10:I29,5)","v":"GL"}]
[]
[null,"TIPO ITEM","CODIGO ITEM","DESCRIÇÃO ITEM","UNIDADE ITEM","COEFICIENTE","PRECO UNITARIO","CUSTO TOTAL"]
[null,"COMPOSICAO",89876,"CAMINHÃO BASCULANTE 14 M3, COM CAVALO MECÂNICO DE CAPACIDADE MÁXIMA DE TRAÇÃO COMBINADO DE 36000 KG, POTÊNCIA 286 CV, INCLUSIVE SEMIREBOQUE COM CAÇAMBA METÁLICA ","CHP DIURNO.",8,316.13,{"$f":"ROUNDDOWN(F6*G6,2)","v":2529.04}]
[null,"COMPOSICAO",89877,"CAMINHÃO BASCULANTE 14 M3, COM CAVALO MECÂNICO DE CAPACIDADE MÁXIMA DE TRAÇÃO COMBINADO DE 36000 KG, POTÊNCIA 286 CV, INCLUSIVE SEMIREBOQUE TRAÇÃO ","CHI DIURNO.",8,89.75,{"$f":"ROUNDDOWN(F7*G7,2)","v":718}]
[null,"COMPOSICAO",5914640,"TRANSPORTE COM CAVALO MECÂNICO COM SEMIRREBOQUE COM CAPACIDADE DE 30 T - RODOVIA PAVIMENTADA","T.KM",8223,0.57999999999999996,{"$f":"ROUNDDOWN(F8*G8,2)","v":4769.34}]
[null,"COMPOSIÇÃO",88316,"SERVENTE COM ENCARGOS COMPLEMENTARES","H",16,19.760000000000002,{"$f":"ROUNDDOWN(F9*G9,2)","v":316.16000000000003}]
[null,"PRODUÇÃO DA EQUIPE",null,null,0.5,"CUSTO ",null,{"$f":"SUM(H6:H9)","v":8332.5400000000009}]
[null,"TOTAL",{"$nulls":5},{"$f":"H10/E10","v":16665.080000000002},"OK"]
[null,"BDI                %",{"$nulls":5},{"$f":"1+$M$1","v":1.2135}]
[null,"TOTAL DO SERVIÇO - R$",{"$nulls":5},{"$f":"ROUND(H11*H12,2)","v":20223.07}]
[]
[{"$f":"A1+1","v":2},"CODEVASF",null,null," COMPOSIÇÃO DE PREÇO UNITÁRIO",null,null,null,{"$f":"H30","v":118872.92},{"$f":"H32","v":144252.29}]
[null,"OBRA:  ",{"$f":"$C$2","v":" PAVIMENTAÇÃO ASFÁLTICA EM CBUQ - VIAS DIVERSAS – BAIRRO INDUSTRIAL (PIRAPORA / MG) - ITEM 2"},null,null,null,"DATA: ",{"$f":"$H$2","v":" SETEMBRO / 2023   "}]
[null,"SERVIÇO:  ",{"$f":"VLOOKUP(A15,ORÇAMENTO!$A$10:$I$29,3)","v":"ADMINISTRAÇÃO LOCAL"},null,"SINAPI","CPU.2","UNIDADE: ",{"$f":"VLOOKUP(A15,ORÇAMENTO!$A$10:$I$29,5)","v":"GL"}]
[]
[null,"TIPO ITEM","CODIGO ITEM","DESCRIÇÃO ITEM","UNIDADE ITEM","COEFICIENTE","PRECO UNITARIO","CUSTO TOTAL"]
[null,"INSUMO",14250,"ENERGIA ELÉTRICA","kwh",60,0.94,{"$f":"ROUNDDOWN(F20*G20,2)","v":56.4}]
[null,"INSUMO",44480,"TARIFA FORNECIMENTO DE ÁGUA/ESGOTO ","M3",6,17.78,106.68]
[null,"COTAÇÃO","MERC.","TELEFONE (PLANO CONTROLE)","UNID",2,59.9,119.8]
[null,"INSUMO","ED-50155 SEINFRA","BANHEIRO QUÍMICO 110 X 120 X 230 CM COM MANUTENÇÃO (CONSIDERANDO OBRAS SIMULTÂNEAS)","MÊS",2,820,1640]
[null,"COMPOSICAO",90777,"Engenheiro Civil Júnior com encargos complementares","H",55,114.12,6276.6]
[null,"COMPOSICAO",90776,"Encarregado Geral com encargos complementares","H",220,57.73,12700.6]
[null,"COMPOSICAO",88321,"Tecnico de Laboratório com encargos complementares","H",110,45.45,4999.5]
[null,"COMPOSICAO",100309,"Tecnico em Segurança do Trabalho com encargos complementares","H",55,45.71,2514.0500000000002]
[null,"COMPOSICAO",90772,"Auxiliar de escritório com encargos complementares","H",55,23.72,1304.5999999999999]
[null,"PRODUÇÃO DA EQUIPE",null,null,0.25,"CUSTO ",null,{"$f":"SUM(H20:H28)","v":29718.23}]
[null,"TOTAL",{"$nulls":5},{"$f":"ROUND(H29/E29,2)","v":118872.92},"OK"]
[null,"BDI                %",{"$nulls":5},{"$f":"1+$M$1","v":1.2135}]
[null,"TOTAL DO SERVIÇO - R$",{"$nulls":5},{"$f":"ROUND(H30*H31,2)","v":144252.29}]
[]
[{"$f":"A15+1","v":3},"CODEVASF",null,null," COMPOSIÇÃO DE PREÇO UNITÁRIO",null,null,null,{"$f":"H44","v":9144},{"$f":"H46","v":11096.24}]
[null,"OBRA:  ",{"$f":"$C$2","v":" PAVIMENTAÇÃO ASFÁLTICA EM CBUQ - VIAS DIVERSAS – BAIRRO INDUSTRIAL (PIRAPORA / MG) - ITEM 2"},null,null,null,"DATA: ",{"$f":"$H$2","v":" SETEMBRO / 2023   "}]
[null,"SERVIÇO:  ",{"$f":"VLOOKUP(A34,ORÇAMENTO!$A$10:$I$29,3)","v":"CANTEIRO DE OBRAS"},null,"SINAPI",{"$f":"VLOOKUP(A34,ORÇAMENTO!$A$10:$I$29,4)","v":"CPU.3"},"UNIDADE: ",{"$f":"VLOOKUP(A34,ORÇAMENTO!$A$10:$I$29,5)","v":"GL"}]
[]
[null,"TIPO ITEM","CODIGO ITEM","DESCRIÇÃO ITEM","UNIDADE ITEM","COEFICIENTE","PRECO UNITARIO","CUSTO TOTAL"]
[null,"INSUMO",10775,"LOCACAO DE CONTAINER COM 1 SANITARIO, PARA ESCRITORIO,COMPLETO, SEM DIVISORIAS INTERNAS","MÊS",4,975,{"$f":"ROUNDDOWN(F39*G39,2)","v":3900}]
[null,"INSUMO",10779,"LOCACAO DE CONTAINER P/ SANITARIO, C/ 5 BACIAS, 1 LAVATORIO E 4 MICTORIOS","MÊS",4,1218.75,4875]
[null,"INSUMO","37525","TELA PLASTICA TECIDA LISTRADA BRANCA E LARANJA, TIPO GUARDA CORPO, EM POLIETILENO MONOFILADO, ROLO 1,20 X 50 M (L X C)","M",100,3.69,369]
[{"$nulls":7},0]
[null,"PRODUÇÃO DA EQUIPE",null,null,1,"CUSTO ",null,{"$f":"SUM(H39:H42)","v":9144}]
[null,"TOTAL",{"$nulls":5},{"$f":"H43/E43","v":9144},"OK"]
[null,"BDI                %",{"$nulls":5},{"$f":"1+$M$1","v":1.2135}]
[null,"TOTAL DO SERVIÇO - R$",{"$nulls":5},{"$f":"ROUND(H44*H45,2)","v":11096.24}]
[]
[{"$f":"A34+1","v":4},"CODEVASF",null,null," COMPOSIÇÃO DE PREÇO UNITÁRIO",null,null,null,{"$f":"H62","v":340.5},{"$f":"H64","v":413.2}]
[null,"OBRA:  ",{"$f":"$C$2","v":" PAVIMENTAÇÃO ASFÁLTICA EM CBUQ - VIAS DIVERSAS – BAIRRO INDUSTRIAL (PIRAPORA / MG) - ITEM 2"},null,null,null,"DATA: ",{"$f":"$H$2","v":" SETEMBRO / 2023   "}]
[null,"SERVIÇO:  ",{"$f":"VLOOKUP(A48,ORÇAMENTO!$A$10:$I$29,3)","v":"PLACA DE OBRA EM CHAPA DE AÇO GALVANIZADO"},null,"SINAPI",{"$f":"VLOOKUP(A48,ORÇAMENTO!$A$10:$I$29,4)","v":103689},"UNIDADE: ",{"$f":"VLOOKUP(A48,ORÇAMENTO!$A$10:$I$29,5)","v":"M2"}]
[]
[null,"TIPO ITEM","CODIGO ITEM","DESCRIÇÃO ITEM","UNIDADE ITEM","COEFICIENTE","PRECO UNITARIO","CUSTO TOTAL"]
[null,"INSUMO","4509","SARRAFO *2,5 X 10* CM EM PINUS, MISTA OU EQUIVALENTE DA REGIAO - BRUTA","M","3,2083000","4,41",{"$f":"ROUNDDOWN(F53*G53,2)","v":14.14}]
[null,"INSUMO","4813","PLACA DE OBRA (PARA CONSTRUCAO CIVIL) EM CHAPA GALVANIZADA *N. 22*, ADESIVADA, DE *2,4 X 1,2* M (SEM POSTES PARA FIXACAO)","M2","1,0000000","250,00",250]
[null,"INSUMO","5065","PREGO DE ACO POLIDO COM CABECA 10 X 10 ","KG","0,0113000","36,57",0.41]
[null,"INSUMO","5069","PREGO DE ACO POLIDO COM CABECA 17 X 27 ","KG","0,0132000","19,59",0.25]
[null,"COMPOSICAO","88262","CARPINTEIRO DE FORMAS COM ENCARGOS COMPLEMENTARES","H","0,3729000","27,05",10.08]
[null,"COMPOSICAO","88316","SERVENTE COM ENCARGOS COMPLEMENTARES","H","1,1186000","19,76",22.1]
[null,"COMPOSICAO",4115,"MADEIRA ROLICA TRATADA, D = 12 A 15 CM, H = 3,00 M, EM EUCALIPTO OU EQUIVALENTE","M",2,21.76,43.52]
[{"$nulls":7},0]
{"$rows_left_out":311}
{"sheet":"BDI SERV","index":2,"n_rows":37,"n_cols":5,"rows_kept":37,"cut":false,"hidden":false,"merged":[[31,1,31,2],[32,0,34,5],[32,6,35,8],[36,0,36,5],[0,1,2,4],[3,1,4,1],[3,2,4,2],[28,0,28,5],[30,1,30,2]]}
[null,"DETALHAMENTO DO BDI - SERVIÇOS"]
[]
[]
[null,"Item","Descrição dos Serviços","%","%"]
[null,null,null,"PV","CD"]
[]
[null,1,"ADMINISTRAÇÃO CENTRAL"," ",4.01]
[null,"1.1","ESCRITÓRIO CENTRAL"," "," "]
[null,"1.2","VIAGENS"," "," "]
[null,"1.3","OUTROS"," "," "]
[null," "," "," "," "]
[null,2,"IMPOSTOS E TAXAS",{"$f":"SUM(D13:D16)","v":6.15},{"$f":"SUM(E13:E16)","v":7.6899999999999995}]
[null,"2.1","ISS (*)",{"$f":"5*0.5","v":2.5},{"$f":"ROUND(D13*1.2515,2)","v":3.13}]
[null,"2.2","PIS",0.65,{"$f":"ROUND(D14*1.2515,2)","v":0.81}]
[null,"2.3","Cofins",3,{"$f":"ROUND(D15*1.2515,2)","v":3.75}]
[null,"2.4","CONTRIBUIÇÃO PREVIDENCIÁRIA SOBRE A RENDA BRUTA",0,{"$f":"ROUND(D16*1.2515,2)","v":0}]
[]
[null,3,"TAXA DE RISCO"," ",{"$f":"SUM(E19:E22)","v":0.96}]
[null,"3.1","SEGURO",null,0.2]
[null,"3.2","RISCO",null,0.56000000000000005]
[null,"3.3","GARANTIA",null,0.2]
[]
[null,4,"DESPESAS FINANCEIRAS"," ",1.1100000000000001]
[]
[null,5,"LUCRO",null,7.3]
[]
[null," ","BDI - CALCULADO"," ",{"$f":"ROUND((((1+(E7+E18)/100)*(1+E23/100)*(1+E25/100)/(1-D12/100)-1)*100),2)","v":21.35}]
[]
["BDI = ((1+((AC+S+R+G)/100))x(1+DF/100)x(1+L/100)/(1-I/100)-1)*100"]
[]
[null,"BDI (CALCULADO):",null,{"$f":"ROUND((((1+((E7+E18)/100))*(1+E23/100)*(1+E25/100))/(1-D12/100)-1)*100,2)","v":21.35},"%"]
[null," "]
["(*) ISS CONFORME LEI MUNICIPAL Nº 1.815 / 2005 - Considerando as deduções previstas no Art. 106 - § 2º (Dedução de 50% sem necessidade de comprovação)"]
[]
[]
[]
["BDI EM CONFORMIDADE COM OS ACÓRDÃOS Nº 2369/2011 e ACÓRDÃO Nº 2.622/2013 - TCU - PLENÁRIO"]

{"sheet":"BDI FORN","index":3,"n_rows":37,"n_cols":5,"rows_kept":37,"cut":false,"hidden":false,"merged":[[31,1,31,2],[32,0,34,5],[36,0,36,5],[0,1,2,4],[3,1,4,1],[3,2,4,2],[28,0,28,5],[30,1,30,2]]}
[null,"DETALHAMENTO DO BDI - FORNECIMENTO \n(MATERIAL ASFÁLTICO)"]
[]
[]
[null,"Item","Descrição dos Serviços","%","%"]
[null,null,null,"PV","CD"]
[]
[null,1,"ADMINISTRAÇÃO CENTRAL"," ",3.72]
[null,"1.1","ESCRITÓRIO CENTRAL"," "," "]
[null,"1.2","VIAGENS"," "," "]
[null,"1.3","OUTROS"," "," "]
[null," "," "," "," "]
[null,2,"IMPOSTOS E TAXAS",{"$f":"SUM(D13:D16)","v":3.65},{"$f":"SUM(E13:E16)","v":4.5600000000000005}]
[null,"2.1","ISS (*)",null,{"$f":"ROUND(D13*1.2515,2)","v":0}]
[null,"2.2","PIS",0.65,{"$f":"ROUND(D14*1.2515,2)","v":0.81}]
[null,"2.3","Cofins",3,{"$f":"ROUND(D15*1.2515,2)","v":3.75}]
[null,"2.4","CONTRIBUIÇÃO PREVIDENCIÁRIA SOBRE A RENDA BRUTA",0,{"$f":"ROUND(D16*1.2515,2)","v":0}]
[]
[null,3,"TAXA DE RISCO"," ",{"$f":"SUM(E19:E22)","v":0.82000000000000006}]
[null,"3.1","SEGURO",null,0.16]
[null,"3.2","RISCO",null,0.5]
[null,"3.3","GARANTIA",null,0.16]
[]
[null,4,"DESPESAS FINANCEIRAS"," ",0.94]
[]
[null,5,"LUCRO",null,5]
[]
[null," ","BDI - CALCULADO"," ",{"$f":"ROUND((((1+(E7+E18)/100)*(1+E23/100)*(1+E25/100)/(1-D12/100)-1)*100),2)","v":15}]
[]
["BDI = ((1+((AC+S+R+G)/100))x(1+DF/100)x(1+L/100)/(1-I/100)-1)*100"]
[]
[null,"BDI (CALCULADO):",null,{"$f":"ROUND((((1+((E7+E18)/100))*(1+E23/100)*(1+E25/100))/(1-D12/100)-1)*100,2)","v":15},"%"]
[null," "]
[]
[]
[]
[]
["BDI EM CONFORMIDADE COM OS ACÓRDÃOS Nº 2369/2011 e ACÓRDÃO Nº 2.622/2013 - TCU - PLENÁRIO"]

{"sheet":"CRONOGRAMA","index":4,"n_rows":19,"n_cols":10,"rows_kept":19,"cut":false,"hidden":false,"merged":[[0,1,0,9],[1,1,2,1],[1,2,2,4],[1,6,1,9],[2,6,2,9],[3,1,3,8],[5,0,6,0],[5,1,6,1],[5,2,6,2],[7,0,8,0],[7,1,8,1],[7,2,8,2],[9,0,10,0],[9,1,10,1],[9,2,10,2],[11,0,12,0],[11,1,12,1],[11,2,12,2],[13,0,14,0],[13,1,14,1],[13,2,14,2],[15,1,16,2],[18,1,22,9]]}
[null,"CRONOGRAMA FÍSICO-FINANCEIRO"]
[null,"OBRA: ",{"$f":"ORÇAMENTO!C5","v":" PAVIMENTAÇÃO ASFÁLTICA EM CBUQ - VIAS DIVERSAS – BAIRRO INDUSTRIAL (PIRAPORA / MG) - ITEM 2"},null,null,"VALOR:",{"$f":"ORÇAMENTO!I37","v":2488665.12}]
[{"$nulls":5},"PRAZO: ","180 DIAS "]
[]
[null,"ITEM","ETAPAS/DESCRIÇAO","FISICO/  FINANCEIRO","TOTAL    ETAPAS","MÊS 1","MÊS 2","MÊS 3","MÊS 4","TOTAL"]
["A",{"$f":"VLOOKUP(A6,ORÇAMENTO!$A$9:$I$37,2)","v":1},{"$f":"VLOOKUP(A6,ORÇAMENTO!$A$9:$I$37,3)","v":"SERVIÇOS PRELIMINARES "},"FISICO ",{"$f":"ROUND(E7/$G$2,4)","v":8.3699999999999997E-2},0.25,0.25,0.25,0.25,{"$f":"SUM(F6:I6)","v":1}]
[null,null,null,"FINANCEIRO",{"$f":"ORÇAMENTO!I9","v":208282.88},{"$f":"ROUND($E$7*F6,2)","v":52070.720000000001},52070.720000000001,52070.720000000001,52070.720000000001,{"$f":"SUM(F7:I7)","v":208282.88}]
["B",{"$f":"VLOOKUP(A8,ORÇAMENTO!$A$9:$I$37,2)","v":2},{"$f":"VLOOKUP(A8,ORÇAMENTO!$A$9:$I$37,3)","v":"TERRAPLANAGEM E PAVIMENTAÇÃO"},"FISICO ",{"$f":"ROUND(E9/$G$2,4)","v":0.2208},0.25,0.25,0.25,0.25,{"$f":"SUM(F8:I8)","v":1}]
[null,null,null,"FINANCEIRO",{"$f":"ORÇAMENTO!I15","v":549537.9},{"$f":"ROUND($E$9*F8,2)","v":137384.48000000001},137384.48000000001,137384.48000000001,137384.48000000001,{"$f":"SUM(F9:I9)","v":549537.92000000004}]
["C",{"$f":"VLOOKUP(A10,ORÇAMENTO!$A$9:$I$37,2)","v":3},{"$f":"VLOOKUP(A10,ORÇAMENTO!$A$9:$I$37,3)","v":"TRANSPORTE DE MATERIAIS"},"FISICO ",{"$f":"ROUND(E11/$G$2,4)","v":0.21229999999999999},0.25,0.25,0.25,0.25,{"$f":"SUM(F10:I10)","v":1}]
[null,null,null,"FINANCEIRO",{"$f":"ORÇAMENTO!I23","v":528298.98},{"$f":"ROUND($E$11*F10,2)","v":132074.75},132074.75,132074.75,132074.75,{"$f":"SUM(F11:I11)-0.04","v":528298.96}]
["D",{"$f":"VLOOKUP(A12,ORÇAMENTO!$A$9:$I$37,2)","v":4},{"$f":"VLOOKUP(A12,ORÇAMENTO!$A$9:$I$37,3)","v":"OBRAS COMPLEMENTARES"},"FISICO ",{"$f":"ROUND(E13/$G$2,4)","v":0.1154},0,0.3,0.4,0.3,{"$f":"SUM(F12:I12)","v":1}]
[null,null,null,"FINANCEIRO",{"$f":"ORÇAMENTO!I28","v":287257.21999999997},{"$f":"ROUND($E$13*F12,2)","v":0},86177.17,114902.89,86177.17,{"$f":"SUM(F13:I13)-0.02","v":287257.20999999996}]
["E",{"$f":"VLOOKUP(A14,ORÇAMENTO!$A$9:$I$37,2)","v":5},{"$f":"VLOOKUP(A14,ORÇAMENTO!$A$9:$I$37,3)","v":"FORNECIMENTOS - MATERIAL ASFÁLTICO (BDI DIFERENCIADO)"},"FISICO ",{"$f":"ROUND(E15/$G$2,4)","v":0.36780000000000002},0.25,0.25,0.25,0.25,{"$f":"SUM(F14:I14)","v":1}]
[null,null,null,"FINANCEIRO",{"$f":"ORÇAMENTO!I33","v":915288.14},{"$f":"ROUND($E$15*F14,2)","v":228822.04},228822.04,228822.04,228822.04,{"$f":"SUM(F15:I15)-0.02","v":915288.14}]
[null,"TOTAL",null,"FISICO ",{"$f":"SUM(F16:I16)","v":1.000000028127529},{"$f":"F17/$E$17","v":0.22114344978644618},0.25577131888279125,0.26731394057550023,0.25577131888279125,{"$f":"SUM(F16:I16)","v":1.000000028127529}]
[null,null,null,"FINANCEIRO",{"$f":"E11+E9+E7+E13+E15","v":2488665.1199999996},550351.99,636529.15999999992,665254.88,636529.15999999992,{"$f":"SUM(F17:I17)-0.07","v":2488665.1199999996}]
[]
[null,"OBSERVAÇÕES:"]