{"text_format":"2","workbook":"xlsx","n_sheets":4,"sheets":["ORÇAMENTO","CPU","BDI SERV","CRONOGRAMA"],"not_rendered":{"charts":0,"images":4,"macros":0,"external_links":0,"defined_names":4,"comments":1,"pivot_tables":0},"unopened":[],"bounds":{"document_bytes":16777216,"sheet_cells":100000,"run_cost":"one","rows_first":2000,"rows_last":500,"rows_between":2000,"halvings":0,"cell_chars":16384,"cell_head_chars":4096},"cells_cut":0,"cells_raw":0,"read":"whole","date_system":"1900"}

{"sheet":"ORÇAMENTO","index":0,"n_rows":29,"n_cols":9,"rows_kept":29,"cut":false,"hidden":false,"merged":[[6,6,6,7],[28,1,28,2],[0,0,7,0],[0,2,0,8],[1,2,1,8],[2,2,2,8],[4,2,4,8],[5,6,5,7]]}
["<---- NUMERAR SERVIÇOS PARA CPU",null,"Ministério do Desenvolvimento Regional"]
[null,null,"Companhia de Desenvolvimento dos Vales do São Francisco e do Parnaíba"]
[null,null,"1ª Superintendência Regional"]
[]
[null,"OBRA: ","PAVIMENTAÇÃO EM BLOQUETE - DISTRITO DE SÃO PEDRO DO PASSA TRÊS - BURITIS/MG"]
[null,"DATA:","JULHO/2023",null,null,null,"BDI Serviços:",null,{"$f":"'BDI SERV'!D30/100","v":0.2127}]
[null,"PRAZO DE EXECUÇÃO:     90 DIAS"]
[null,"ITEM","DISCRIMINAÇÃO","REFER.","UNID.","QUANT.","P. UNITÁRIO","P.UNIT.C/ BDI","P. TOTAL"]
["A",1,"SERVIÇOS PRELIMINARES ",{"$nulls":5},{"$f":"SUM(I10:I14)","v":42330.54}]
[1,"1.1","MOBILIZAÇÃO E DESMOBILIZAÇÃO","CPU.1","GL",1,{"$f":"VLOOKUP(A10,CPU!$A$1:$N$4519,9)","v":3757.04},{"$f":"VLOOKUP(A10,CPU!$A$1:$N$4519,10)","v":4556.1624079999992},{"$f":"ROUND(F10*H10,2)","v":4556.16}]
[2,"1.2","ADMINISTRAÇÃO LOCAL","CPU.2","GL",1,{"$f":"VLOOKUP(A11,CPU!$A$1:$N$4519,9)","v":27176.417641764176},{"$f":"VLOOKUP(A11,CPU!$A$1:$N$4519,10)","v":32956.841674167415},{"$f":"ROUND(F11*H11,2)","v":32956.839999999997}]
[3,"1.3","CANTEIRO DE OBRAS","CPU.3","GL",1,{"$f":"VLOOKUP(A12,CPU!$A$1:$N$4519,9)","v":3075},{"$f":"VLOOKUP(A12,CPU!$A$1:$N$4519,10)","v":3729.0524999999998},{"$f":"ROUND(F12*H12,2)","v":3729.05}]
[4,"1.4","PLACA DE OBRA EM CHAPA DE AÇO GALVANIZADO",103689,"M2",2,{"$f":"VLOOKUP(A13,CPU!$A$1:$N$4519,9)","v":308.09000000000003},{"$f":"VLOOKUP(A13,CPU!$A$1:$N$4519,10)","v":373.620743},{"$f":"ROUND(F13*H13,2)","v":747.24}]
[5,"1.5","LOCAÇÃO DE PAVIMENTAÇÃO",99064,"M",420,{"$f":"VLOOKUP(A14,CPU!$A$1:$N$4519,9)","v":0.67},{"$f":"VLOOKUP(A14,CPU!$A$1:$N$4519,10)","v":0.81250899999999993},{"$f":"ROUND(F14*H14,2)","v":341.25}]
["B",2,"PAVIMENTAÇÃO",{"$nulls":5},{"$f":"SUM(I16:I20)","v":260567.63999999998}]
[6,"2.1","ESCAVAÇÃO HORIZONTAL EM SOLO DE 1A CATEGORIA COM TRATOR DE ESTEIRAS",101116,"M3",970,{"$f":"VLOOKUP(A16,CPU!$A$1:$N$4519,9)","v":1.8900000000000001},{"$f":"VLOOKUP(A16,CPU!$A$1:$N$4519,10)","v":2.2920029999999998},{"$f":"ROUND(F16*H16,2)","v":2223.2399999999998}]
[7,"2.2","CARGA, MANOBRA E DESCARGA DE SOLOS E MATERIAIS GRANULARES EM CAMINHÃO BASCULANTE - CARGA COM PÁ CARREGADEIRA E DESCARGA LIVRE",100976,"M3",970,{"$f":"VLOOKUP(A17,CPU!$A$1:$N$4519,9)","v":8.11},{"$f":"VLOOKUP(A17,CPU!$A$1:$N$4519,10)","v":9.8349969999999978},{"$f":"ROUND(F17*H17,2)","v":9539.9500000000007}]
[8,"2.3","REGULARIZAÇÃO E COMPACTAÇÃO DE SUBLEITO",100576,"M2",2799.9999999999995,{"$f":"VLOOKUP(A18,CPU!$A$1:$N$4519,9)","v":2.37},{"$f":"VLOOKUP(A18,CPU!$A$1:$N$4519,10)","v":2.8740989999999997},{"$f":"ROUND(F18*H18,2)","v":8047.48}]
[8.5,"2.4","EXECUÇÃO E COMPACTAÇÃO DE BASE E OU SUB BASE PARA PAVIMENTAÇÃO DE SOLO DE COMPORTAMENTO LATERÍTICO - EXCLUSIVE SOLO, ESCAVAÇÃO, CARGA E TRANSPORTE",96388,"M3",420,{"$f":"VLOOKUP(A19,CPU!$A$1:$N$4519,9)","v":11.25},{"$f":"VLOOKUP(A19,CPU!$A$1:$N$4519,10)","v":13.642874999999998},{"$f":"ROUND(F19*H19,2)","v":5730.01}]
[9,"2.5","EXECUÇÃO DE PAVIMENTO EM PISO INTERTRAVADO, COM BLOCO SEXTAVADO DE 25 X 25 CM, ESPESSURA 8 CM",92394,"M2",2630,{"$f":"VLOOKUP(A20,CPU!$A$1:$N$4519,9)","v":73.690000000000012},{"$f":"VLOOKUP(A20,CPU!$A$1:$N$4519,10)","v":89.363863000000009},{"$f":"ROUND(F20*H20,2)","v":235026.96}]
["C",3,"TRANSPORTE DE MATERIAIS",{"$nulls":5},{"$f":"SUM(I22:I23)","v":32119.57}]
[10,"3.1","TRANSPORTE COM CAMINHÃO BASCULANTE, EM VIA URBANA PAVIMENTADA",95427,"M3XKM",11999.998739199998,{"$f":"VLOOKUP(A22,CPU!$A$1:$N$4519,9)","v":0.67999999999999994},{"$f":"VLOOKUP(A22,CPU!$A$1:$N$4519,10)","v":0.82463599999999981},{"$f":"ROUND(F22*H22,2)","v":9895.6299999999992}]
[11,"3.2","TRANSPORTE COM CAMINHÃO CARROCERIA, EM VIA URBANA PAVIMENTADA",100948,"TXKM",23800,{"$f":"VLOOKUP(A23,CPU!$A$1:$N$4519,9)","v":0.76999999999999991},{"$f":"VLOOKUP(A23,CPU!$A$1:$N$4519,10)","v":0.9337789999999998},{"$f":"ROUND(F23*H23,2)","v":22223.94}]
["D",4,"DRENAGEM E OBRAS COMPLEMENTARES",{"$nulls":5},{"$f":"SUM(I25:I28)","v":47032.68}]
[12,"4.1","GUIA (MEIO-FIO) CONCRETO, MOLDADA IN LOCO COM EXTRUSORA, 13 CM BASE X 22 CM ALTURA",94263,"M",400,{"$f":"VLOOKUP(A25,CPU!$A$1:$N$4519,9)","v":35.700000000000003},{"$f":"VLOOKUP(A25,CPU!$A$1:$N$4519,10)","v":43.293390000000002},{"$f":"ROUND(F25*H25,2)","v":17317.36}]
[13,"4.2","GUIA (MEIO-FIO) E SARJETA CONJUGADOS DE CONCRETO, MOLDADA IN LOCO COM EXTRUSORA, 45 CM BASE (15 CM BASE DA GUIA + 30 CM BASE DA SARJETA) X 22 CM ALTURA.",94267,"M",380,{"$f":"VLOOKUP(A26,CPU!$A$1:$N$4519,9)","v":57.399999999999991},{"$f":"VLOOKUP(A26,CPU!$A$1:$N$4519,10)","v":69.608979999999988},{"$f":"ROUND(F26*H26,2)","v":26451.41}]
[14,"4.3","FORNECIMENTO E INSTALAÇÃO DE PLACA DE SINALIZAÇÃO VIÁRIA - REGULAMENTAÇÃO 0,60MX0,60M, SUPORTE INCLUSO","CPU.4","UNID.",5,{"$f":"VLOOKUP(A27,CPU!$A$1:$N$4519,9)","v":393.91999999999996},{"$f":"VLOOKUP(A27,CPU!$A$1:$N$4519,10)","v":477.70678399999991},{"$f":"ROUND(F27*H27,2)","v":2388.5300000000002}]
[15,"4.4","FORNECIMENTO E INSTALAÇÃO DE PLACA DE IDENTIFICAÇÃO DE LOGRADOURO, SUPORTE INCLUSO - CONFORME PROJETO","CPU.5","UNID.",2,{"$f":"VLOOKUP(A28,CPU!$A$1:$N$4519,9)","v":360.91999999999996},{"$f":"VLOOKUP(A28,CPU!$A$1:$N$4519,10)","v":437.68768399999993},{"$f":"ROUND(F28*H28,2)","v":875.38}]
[null,"TOTAL GERAL DA OBRA COM BDI ",{"$nulls":6},{"$f":"SUM(I9,I15,I21,I24)","v":382050.43}]

{"sheet":"CPU","index":1,"n_rows":254,"n_cols":13,"rows_kept":254,"cut":false,"hidden":false,"merged":[[199,0,217,0],[180,1,180,3],[180,4,180,7],[180,0,198,0],[199,1,199,3],[199,4,199,7],[200,2,200,5],[201,2,201,3],[202,1,202,7],[213,1,213,3],[213,5,213,6],[214,1,214,6],[215,1,215,6],[216,1,216,6],[79,5,79,6],[80,1,80,6],[66,5,66,6],[67,1,67,6],[68,1,68,6],[69,1,69,6],[71,1,71,3],[71,4,71,7],[37,5,37,6],[38,1,38,6],[162,5,162,6],[163,1,163,6],[164,1,164,6],[165,1,165,6],[42,10,42,11],[43,2,43,5],[44,2,44,3],[45,1,45,7],[55,1,55,3],[63,1,63,7],[66,1,66,3],[135,10,135,11],[136,2,136,5],[137,2,137,3],[138,1,138,7],[149,1,149,3],[149,5,149,6],[150,1,150,6],[98,10,98,11],[99,2,99,5],[100,2,100,3],[101,1,101,7],[42,1,42,3],[42,4,42,7],[71,10,71,11],[72,2,72,5],[56,1,56,6],[57,1,57,6],[58,1,58,6],[60,1,60,3],[60,4,60,7],[60,10,60,11],[61,2,61,5],[14,1,14,3],[14,4,14,7],[14,10,14,11],[15,2,15,5],[16,2,16,3],[17,1,17,7],[26,1,26,3],[26,5,26,6],[55,5,55,6],[31,10,31,11],[32,2,32,5],[33,2,33,3],[34,1,34,7],[37,1,37,3],[27,1,27,6],[28,1,28,6],[29,1,29,6],[31,1,31,3],[31,4,31,7],[0,10,0,11],[1,2,1,5],[2,2,2,3],[3,1,3,7],[9,1,9,3],[9,5,9,6],[10,1,10,6],[11,1,11,6],[12,1,12,6],[154,10,154,11],[155,2,155,5],[115,1,115,3],[115,4,115,7],[115,10,115,11],[116,2,116,5],[117,2,117,3],[118,1,118,7],[130,1,130,3],[130,5,130,6],[131,1,131,6],[132,1,132,6],[133,1,133,6],[0,0,13,0],[14,0,30,0],[31,0,41,0],[42,0,59,0],[60,0,70,0],[135,0,153,0],[162,1,162,3],[151,1,151,6],[152,1,152,6],[154,1,154,3],[154,4,154,7],[135,1,135,3],[135,4,135,7],[73,2,73,3],[74,1,74,7],[79,1,79,3],[0,1,0,3],[0,4,0,7],[154,0,166,0],[39,1,39,6],[40,1,40,6],[62,2,62,3],[96,1,96,6],[71,0,82,0],[180,10,180,11],[181,2,181,5],[182,2,182,3],[183,1,183,7],[194,1,194,3],[194,5,194,6],[195,1,195,6],[196,1,196,6],[197,1,197,6],[177,1,177,6],[178,1,178,6],[81,1,81,6],[82,1,82,6],[84,0,96,0],[84,1,84,3],[84,4,84,7],[85,2,85,5],[86,2,86,3],[87,1,87,7],[93,1,93,3],[93,5,93,6],[94,1,94,6],[95,1,95,6],[110,1,110,3],[110,5,110,6],[111,1,111,6],[112,1,112,6],[113,1,113,6],[98,1,98,3],[98,4,98,7],[98,0,113,0],[156,2,156,3],[157,1,157,7],[167,1,167,3],[167,4,167,7],[167,10,167,11],[168,2,168,5],[169,2,169,3],[170,1,170,7],[175,1,175,3],[175,5,175,6],[176,1,176,6],[115,0,131,0],[236,0,254,0],[236,1,236,3],[236,4,236,7],[237,2,237,5],[238,2,238,3],[239,1,239,7],[250,1,250,3],[250,5,250,6],[251,1,251,6],[252,1,252,6],[253,1,253,6],[218,0,235,0],[218,1,218,3],[218,4,218,7],[219,2,219,5],[220,2,220,3],[221,1,221,7],[231,1,231,3],[231,5,231,6],[232,1,232,6],[233,1,233,6],[234,1,234,6],[167,0,179,0]]}
[1,"CODEVASF",null,null," COMPOSIÇÃO DE PREÇO UNITÁRIO",null,null,null,{"$f":"H11","v":3757.04},{"$f":"H13","v":4556.1624079999992},"BDI CALCULADO:",null,{"$f":"ORÇAMENTO!I6","v":0.2127}]
[null,"OBRA:  ",{"$f":"ORÇAMENTO!C5","v":"PAVIMENTAÇÃO EM BLOQUETE - DISTRITO DE SÃO PEDRO DO PASSA TRÊS - BURITIS/MG"},null,null,null,"DATA: ",{"$f":"ORÇAMENTO!C6","v":"JULHO/2023"}]
[null,"SERVIÇO:  ",{"$f":"VLOOKUP(A1,ORÇAMENTO!A10:I26,3)","v":"MOBILIZAÇÃO E DESMOBILIZAÇÃO"},null,"Referência:",{"$f":"VLOOKUP(A1,ORÇAMENTO!A10:I26,4)","v":"CPU.1"},"UNIDADE: ",{"$f":"VLOOKUP(A1,ORÇAMENTO!A10:I26,5)","v":"GL"}]
[]
[null,"TIPO ITEM","CODIGO ITEM","DESCRIÇÃO ITEM","UNIDADE ITEM","COEFICIENTE","PRECO UNITARIO","CUSTO TOTAL"]
[null,"COMPOSICAO","5824","CAMINHÃO TOCO, PBT 16.000 KG, CARGA ÚTIL MÁX. 10.685 KG, DIST. ENTRE EIXOS 4,8 M, POTÊNCIA 189 CV, INCLUSIVE CARROCERIA FIXA ABERTA DE MADEIRA P/ TRANSPORTE GERAL DE CARGA SECA ","CHP",8,188.68,{"$f":"ROUNDDOWN(F6*G6,2)","v":1509.44}]
[null,"COMPOSICAO","5826","CAMINHÃO TOCO, PBT 16.000 KG, CARGA ÚTIL MÁX. 10.685 KG, DIST. ENTRE EIXOS 4,8 M, POTÊNCIA 189 CV, INCLUSIVE CARROCERIA FIXA ABERTA DE MADEIRA P/ TRANSPORTE GERAL DE CARGA SECA ","CHI",4,52.75,{"$f":"ROUNDDOWN(F7*G7,2)","v":211}]
[null,"COMPOSIÇÃO",88316,"SERVENTE COM ENCARGOS COMPLEMENTARES","H",8,19.760000000000002,{"$f":"ROUNDDOWN(F8*G8,2)","v":158.08000000000001}]
[{"$nulls":7},{"$f":"ROUNDDOWN(F9*G9,2)","v":0}]
[null,"PRODUÇÃO DA EQUIPE",null,null,0.5,"CUSTO ",null,{"$f":"SUM(H6:H9)","v":1878.52}]
[null,"TOTAL",{"$nulls":5},{"$f":"H10/E10","v":3757.04},"OK"]
[null,"BDI                %",{"$nulls":5},{"$f":"1+$M$1","v":1.2126999999999999}]
[null,"TOTAL DO SERVIÇO - R$",{"$nulls":5},{"$f":"H11*H12","v":4556.1624079999992}]
[]
[{"$f":"A1+1","v":2},"CODEVASF",null,null," COMPOSIÇÃO DE PREÇO UNITÁRIO",null,null,null,{"$f":"H28","v":27176.417641764176},{"$f":"H30","v":32956.841674167415}]
[null,"OBRA:  ",{"$f":"$C$2","v":"PAVIMENTAÇÃO EM BLOQUETE - DISTRITO DE SÃO PEDRO DO PASSA TRÊS - BURITIS/MG"},null,null,null,"DATA: ",{"$f":"$H$2","v":"JULHO/2023"}]
[null,"SERVIÇO:  ",{"$f":"VLOOKUP(A15,ORÇAMENTO!$A$10:$I$26,3)","v":"ADMINISTRAÇÃO LOCAL"},null,"SINAPI","CPU","UNIDADE: ",{"$f":"VLOOKUP(A15,ORÇAMENTO!$A$10:$I$26,5)","v":"GL"}]
[]
[null,"TIPO ITEM","CODIGO ITEM","DESCRIÇÃO ITEM","UNIDADE ITEM","COEFICIENTE","PRECO UNITARIO","CUSTO TOTAL"]
[null,"INSUMO",14250,"ENERGIA ELÉTRICA","kwh",60,0.83,{"$f":"ROUNDDOWN(F20*G20,2)","v":49.8}]
[null,"INSUMO",44480,"TARIFA \"A\" ENTRE 0 E 20 M³ - FORNECIMENTO D'ÁGUA","m³",4,15.7,{"$f":"ROUNDDOWN(F21*G21,2)","v":62.8}]
[null,"COTAÇÃO","MERC.","TELEFONE (PLANO CONTROLE)","UNID",2,60,120]
[null,"COMPOSICAO",90777,"ENGENHEIRO CIVIL DE OBRA COM ENCARGOS COMPLEMENTARES","H",{"$f":"220/8","v":27.5},114.12,3138.3]
[null,"COMPOSICAO",90776,"ENCARREGADO GERAL COM ENCARGOS COMPLEMENTARES","H",55,57.73,{"$f":"ROUNDDOWN(F24*G24,2)","v":3175.15}]
[null,"COMPOSICAO",88321,"TÉCNICO DE LABORATÓRIO COM ENCARGOS COMPLEMENTARES","H",55,45.67,{"$f":"ROUNDDOWN(F25*G25,2)","v":2511.85}]
[{"$nulls":7},0]
[null,"PRODUÇÃO DA EQUIPE",null,null,0.33329999999999999,"CUSTO ",null,{"$f":"SUM(H20:H26)","v":9057.9}]
[null,"TOTAL",{"$nulls":5},{"$f":"H27/E27","v":27176.417641764176},"OK"]
[null,"BDI                %",{"$nulls":5},{"$f":"1+$M$1","v":1.2126999999999999}]
[null,"TOTAL DO SERVIÇO - R$",{"$nulls":5},{"$f":"H28*H29","v":32956.841674167415}]
[]
[{"$f":"A15+1","v":3},"CODEVASF",null,null," COMPOSIÇÃO DE PREÇO UNITÁRIO",null,null,null,{"$f":"H39","v":3075},{"$f":"H41","v":3729.0524999999998}]
[null,"OBRA:  ",{"$f":"$C$2","v":"PAVIMENTAÇÃO EM BLOQUETE - DISTRITO DE SÃO PEDRO DO PASSA TRÊS - BURITIS/MG"},null,null,null,"DATA: ",{"$f":"$H$2","v":"JULHO/2023"}]
[null,"SERVIÇO:  ",{"$f":"VLOOKUP(A32,ORÇAMENTO!$A$10:$I$26,3)","v":"CANTEIRO DE OBRAS"},null,"SINAPI",{"$f":"VLOOKUP(A32,ORÇAMENTO!$A$10:$I$26,4)","v":"CPU.3"},"UNIDADE: ",{"$f":"VLOOKUP(A32,ORÇAMENTO!$A$10:$I$26,5)","v":"GL"}]
[]
[null,"TIPO ITEM","CODIGO ITEM","DESCRIÇÃO ITEM","UNIDADE ITEM","COEFICIENTE","PRECO UNITARIO","CUSTO TOTAL"]
[null,"COTAÇÃO",10775,"ALUGUEL DE IMÓVEL OU CONTEINER QUE ATENDA AOS REQUISITOS MÍNIMOS PARA INSTALAÇÃO DO CANTEIRO DE OBRAS ","MÊS",3,1025,{"$f":"ROUNDDOWN(F37*G37,2)","v":3075}]
[null,"PRODUÇÃO DA EQUIPE",null,null,1,"CUSTO ",null,{"$f":"SUM(H37:H37)","v":3075}]
[null,"TOTAL",{"$nulls":5},{"$f":"H38/E38","v":3075},"OK"]
[null,"BDI                %",{"$nulls":5},{"$f":"1+$M$1","v":1.2126999999999999}]
[null,"TOTAL DO SERVIÇO - R$",{"$nulls":5},{"$f":"H39*H40","v":3729.0524999999998}]
[]
[{"$f":"A32+1","v":4},"CODEVASF",null,null," COMPOSIÇÃO DE PREÇO UNITÁRIO",null,null,null,{"$f":"H57","v":308.09000000000003},{"$f":"H59","v":373.620743}]
[null,"OBRA:  ",{"$f":"$C$2","v":"PAVIMENTAÇÃO EM BLOQUETE - DISTRITO DE SÃO PEDRO DO PASSA TRÊS - BURITIS/MG"},null,null,null,"DATA: ",{"$f":"$H$2","v":"JULHO/2023"}]
[null,"SERVIÇO:  ",{"$f":"VLOOKUP(A43,ORÇAMENTO!$A$10:$I$26,3)","v":"PLACA DE OBRA EM CHAPA DE AÇO GALVANIZADO"},null,"SINAPI",{"$f":"VLOOKUP(A43,ORÇAMENTO!$A$10:$I$26,4)","v":103689},"UNIDADE: ",{"$f":"VLOOKUP(A43,ORÇAMENTO!$A$10:$I$26,5)","v":"M2"}]
[]
[null,"TIPO ITEM","CODIGO ITEM","DESCRIÇÃO ITEM","UNIDADE ITEM","COEFICIENTE","PRECO UNITARIO","CUSTO TOTAL"]
[null,"INSUMO","4509","SARRAFO *2,5 X 10* CM EM PINUS, MISTA OU EQUIVALENTE DA REGIAO - BRUTA","M","3,2083000","4,40",{"$f":"ROUNDDOWN(F48*G48,2)","v":14.11}]
[null,"INSUMO","4813","PLACA DE OBRA (PARA CONSTRUCAO CIVIL) EM CHAPA GALVANIZADA *N. 22*, ADESIVADA, DE *2,4 X 1,2* M (SEM POSTES PARA FIXACAO)","M2","1,0000000","250,00",{"$f":"ROUNDDOWN(F49*G49,2)","v":250}]
[null,"INSUMO","5065","PREGO DE ACO POLIDO COM CABECA 10 X 10 (7/8 X 17)","KG","0,0113000","38,80",0.43]
[null,"INSUMO","5069","PREGO DE ACO POLIDO COM CABECA 17 X 27 (2 1/2 X 11)","KG","0,0132000","20,79",0.27]
[null,"COMPOSICAO","88262","CARPINTEIRO DE FORMAS COM ENCARGOS COMPLEMENTARES","H","0,3729000","27,05",10.08]
[null,"COMPOSICAO","88316","SERVENTE COM ENCARGOS COMPLEMENTARES","H","1,1186000","19,76",22.1]
[null,"COMPOSICAO","102234","PINTURA IMUNIZANTE PARA MADEIRA, 2 DEMÃOS","M2","0,5000000","22,20",{"$f":"ROUNDDOWN(F54*G54,2)","v":11.1}]
[{"$nulls":7},0]
[null,"PRODUÇÃO DA EQUIPE",null,null,1,"CUSTO ",null,{"$f":"SUM(H48:H55)","v":308.09000000000003}]
[null,"TOTAL",{"$nulls":5},{"$f":"H56/E56","v":308.09000000000003},"OK"]
[null,"BDI                %",{"$nulls":5},{"$f":"1+$M$1","v":1.2126999999999999}]
[null,"TOTAL DO SERVIÇO - R$",{"$nulls":5},{"$f":"H57*H58","v":373.620743}]
[]
[{"$f":"A43+1","v":5},"CODEVASF",null,null," COMPOSIÇÃO DE PREÇO UNITÁRIO",null,null,null,{"$f":"H68","v":0.67},{"$f":"H70","v":0.81250899999999993}]
[null,"OBRA:  ",{"$f":"$C$2","v":"PAVIMENTAÇÃO EM BLOQUETE - DISTRITO DE SÃO PEDRO DO PASSA TRÊS - BURITIS/MG"},null,null,null,"DATA: ",{"$f":"$H$2","v":"JULHO/2023"}]
[null,"SERVIÇO:  ",{"$f":"VLOOKUP(A61,ORÇAMENTO!$A$10:$I$26,3)","v":"LOCAÇÃO DE PAVIMENTAÇÃO"},null,"SINAPI",{"$f":"VLOOKUP(A61,ORÇAMENTO!$A$10:$I$26,4)","v":99064},"UNIDADE: ",{"$f":"VLOOKUP(A61,ORÇAMENTO!$A$10:$I$26,5)","v":"M"}]
[]
[null,"TIPO ITEM","CODIGO ITEM","DESCRIÇÃO ITEM","UNIDADE ITEM","COEFICIENTE","PRECO UNITARIO","CUSTO TOTAL"]
[null,"COMPOSICAO","99058","LOCAÇÃO DE PONTO PARA REFERÊNCIA TOPOGRÁFICA","UN","0,0500000","13,42",{"$f":"ROUNDDOWN(F66*G66,2)","v":0.67}]
[null,"PRODUÇÃO DA EQUIPE",null,null,1,"CUSTO ",null,{"$f":"SUM(H66:H66)","v":0.67}]
[null,"TOTAL",{"$nulls":5},{"$f":"H67/E67","v":0.67},"OK"]
[null,"BDI                %",{"$nulls":5},{"$f":"1+$M$1","v":1.2126999999999999}]
[null,"TOTAL DO SERVIÇO - R$",{"$nulls":5},{"$f":"H68*H69","v":0.81250899999999993}]
[]
[{"$f":"A61+1","v":6},"CODEVASF",null,null," COMPOSIÇÃO DE PREÇO UNITÁRIO",null,null,null,{"$f":"H81","v":1.8900000000000001},{"$f":"H83","v":2.2920029999999998}]
[null,"OBRA:  ",{"$f":"$C$2","v":"PAVIMENTAÇÃO EM BLOQUETE - DISTRITO DE SÃO PEDRO DO PASSA TRÊS - BURITIS/MG"},null,null,null,"DATA: ",{"$f":"$H$2","v":"JULHO/2023"},null,{"$f":"H98","v":0}]
[null,"SERVIÇO:  ",{"$f":"VLOOKUP(A72,ORÇAMENTO!$A$10:$I$26,3)","v":"ESCAVAÇÃO HORIZONTAL EM SOLO DE 1A CATEGORIA COM TRATOR DE ESTEIRAS"},null,"SINAPI",{"$f":"VLOOKUP(A72,ORÇAMENTO!$A$10:$I$26,4)","v":101116},"UNIDADE: ",{"$f":"VLOOKUP(A72,ORÇAMENTO!$A$10:$I$26,5)","v":"M3"}]
[]
[null,"TIPO ITEM","CODIGO ITEM","DESCRIÇÃO ITEM","UNIDADE ITEM","COEFICIENTE","PRECO UNITARIO","CUSTO TOTAL"]
[null,"COMPOSICAO","5847","TRATOR DE ESTEIRAS, POTÊNCIA 170 HP, PESO OPERACIONAL 19 T, CAÇAMBA 5,2 M3 - CHP DIURNO. AF_06/2014","CHP","0,0048000","223,32",{"$f":"ROUNDDOWN(F77*G77,2)","v":1.07}]
[null,"COMPOSICAO","5849","TRATOR DE ESTEIRAS, POTÊNCIA 170 HP, PESO OPERACIONAL 19 T, CAÇAMBA 5,2 M3 - CHI DIURNO. AF_06/2014","CHI","0,0082000","70,10",{"$f":"ROUNDDOWN(F78*G78,2)","v":0.56999999999999995}]
[null,"COMPOSICAO","88316","SERVENTE COM ENCARGOS COMPLEMENTARES","H","0,0131000","19,76",{"$f":"ROUNDDOWN(F79*G79,2)","v":0.25}]
[null,"PRODUÇÃO DA EQUIPE",null,null,1,"CUSTO ",null,{"$f":"SUM(H77:H79)","v":1.8900000000000001}]
{"$rows_left_out":175}
{"sheet":"BDI SERV","index":2,"n_rows":36,"n_cols":5,"rows_kept":36,"cut":false,"hidden":false,"merged":[[7,7,17,12],[35,0,35,5],[3,1,4,1],[3,2,4,2],[0,1,2,4],[31,0,33,5],[27,0,27,5],[29,1,29,2],[30,1,30,2]]}
[null,"DETALHAMENTO DO BDI - SERVIÇOS"]
[]
[]
[null,"Item","Descrição dos Serviços","%","%"]
[null,null,null,"PV","CD"]
[]
[null,1,"ADMINISTRAÇÃO CENTRAL"," ",4.01]
[null,"1.1","ESCRITÓRIO CENTRAL"," "," "]
[null,"1.2","VIAGENS"," "," "]
[null,"1.3","OUTROS"," "," "]
[null," "," "," "," "]
[null,2,"IMPOSTOS E TAXAS",{"$f":"SUM(D13:D15)","v":5.65},{"$f":"SUM(E13:E15)","v":7.0600000000000005}]
[null,"2.1","ISS (*)",{"$f":"5*0.4","v":2},{"$f":"ROUND(D13*1.2515,2)","v":2.5}]
[null,"2.2","PIS",0.65,{"$f":"ROUND(D14*1.2515,2)","v":0.81}]
[null,"2.3","Cofins",3,{"$f":"ROUND(D15*1.2515,2)","v":3.75}]
[]
[null,3,"TAXA DE RISCO"," ",{"$f":"SUM(E18:E21)","v":0.96}]
[null,"3.1","SEGURO",null,0.2]
[null,"3.2","RISCO",null,0.56000000000000005]
[null,"3.3","GARANTIA",null,0.2]
[]
[null,4,"DESPESAS FINANCEIRAS"," ",1.1100000000000001]
[]
[null,5,"LUCRO",null,7.8]
[]
[null," ","BDI - CALCULADO"," ",{"$f":"ROUND((((1+(E7+E17)/100)*(1+E22/100)*(1+E24/100)/(1-D12/100)-1)*100),2)","v":21.27}]
[]
["BDI = ((1+((AC+S+R+G)/100))x(1+DF/100)x(1+L/100)/(1-I/100)-1)*100"]
[]
[null,"BDI (CALCULADO):",null,{"$f":"ROUND((((1+((E7+E17)/100))*(1+E22/100)*(1+E24/100))/(1-D12/100)-1)*100,2)","v":21.27},"%"]
[null," "]
["(*) ISS CONFORME LEI COMPLEMENTAR Nº 006/2003 E LEI COMPLEMENTAR Nº 59/2009 QUE ALTEROU A ALÍQUOTA PARA ITENS 7 A 7.05 (ART. 9º ) - QUANT. ESTIMADA DE MATERIAIS = 60%"]
[]
[]
[" "]
["BDI EM CONFORMIDADE COM OS ACÓRDÃOS Nº 2369/2011 e ACÓRDÃO Nº 2.622/2013 - TCU - PLENÁRIO"]

{"sheet":"CRONOGRAMA","index":3,"n_rows":17,"n_cols":9,"rows_kept":17,"cut":false,"hidden":false,"merged":[[7,0,8,0],[9,0,10,0],[11,0,12,0],[0,1,0,8],[1,6,1,8],[2,6,2,8],[3,1,3,6],[5,0,6,0],[5,2,6,2],[1,1,2,1],[5,1,6,1],[1,2,2,4],[13,1,14,2],[16,1,20,8],[7,2,8,2],[9,2,10,2],[11,2,12,2],[7,1,8,1],[9,1,10,1],[11,1,12,1]]}
[null,"CRONOGRAMA FÍSICO-FINANCEIRO"]
[null,"OBRA: ",{"$f":"ORÇAMENTO!C5","v":"PAVIMENTAÇÃO EM BLOQUETE - DISTRITO DE SÃO PEDRO DO PASSA TRÊS - BURITIS/MG"},null,null,"VALOR:",{"$f":"ORÇAMENTO!I29","v":382050.43}]
[{"$nulls":5},"PRAZO: ","90 DIAS "]
[]
[null,"ITEM","ETAPAS/DESCRIÇAO","FISICO/  FINANCEIRO","TOTAL    ETAPAS","MÊS 1","MÊS 2","MÊS 3","TOTAL"]
["A",{"$f":"VLOOKUP(A6,ORÇAMENTO!$A$9:$I$29,2)","v":1},{"$f":"VLOOKUP(A6,ORÇAMENTO!$A$9:$I$29,3)","v":"SERVIÇOS PRELIMINARES "},"FISICO ",{"$f":"ROUND(E7/$G$2,4)","v":0.1108},0.4,0.3,0.3,{"$f":"SUM(F6:H6)","v":1}]
[null,null,null,"FINANCEIRO",{"$f":"ORÇAMENTO!I9","v":42330.54},{"$f":"ROUND($E$7*F6,2)","v":16932.22},{"$f":"ROUND($E$7*G6,2)","v":12699.16},{"$f":"ROUND($E$7*H6,2)","v":12699.16},42330.54]
["B",{"$f":"VLOOKUP(A8,ORÇAMENTO!$A$9:$I$29,2)","v":2},{"$f":"VLOOKUP(A8,ORÇAMENTO!$A$9:$I$29,3)","v":"PAVIMENTAÇÃO"},"FISICO ",{"$f":"ROUND(E9/$G$2,4)","v":0.68200000000000005},0.3,0.4,0.3,1]
[null,null,null,"FINANCEIRO",{"$f":"ORÇAMENTO!I15","v":260567.63999999998},{"$f":"ROUND($E$9*F8,2)","v":78170.289999999994},{"$f":"ROUND($E$9*G8,2)","v":104227.06},{"$f":"ROUND($E$9*H8,2)","v":78170.289999999994},260567.63999999996]
["C",{"$f":"VLOOKUP(A10,ORÇAMENTO!$A$9:$I$29,2)","v":3},{"$f":"VLOOKUP(A10,ORÇAMENTO!$A$9:$I$29,3)","v":"TRANSPORTE DE MATERIAIS"},"FISICO ",{"$f":"ROUND(E11/$G$2,4)","v":8.4099999999999994E-2},0.5,0.5,null,1]
[null,null,null,"FINANCEIRO",{"$f":"ORÇAMENTO!I21","v":32119.57},{"$f":"ROUND($E$11*F10,2)","v":16059.79},{"$f":"ROUND($E$11*G10,2)","v":16059.79},{"$f":"ROUND($E$11*H10,2)","v":0},32119.58]
["D",{"$f":"VLOOKUP(A12,ORÇAMENTO!$A$9:$I$29,2)","v":4},{"$f":"VLOOKUP(A12,ORÇAMENTO!$A$9:$I$29,3)","v":"DRENAGEM E OBRAS COMPLEMENTARES"},"FISICO ",{"$f":"ROUND(E13/$G$2,4)","v":0.1231},null,0.5,0.5,1]
[null,null,null,"FINANCEIRO",{"$f":"ORÇAMENTO!I24","v":47032.68},{"$f":"ROUND($E$13*F12,2)","v":0},{"$f":"ROUND($E$13*G12,2)","v":23516.34},{"$f":"ROUND($E$13*H12,2)","v":23516.34},{"$f":"SUM(F13:H13)-0.01","v":47032.67}]
[null,"TOTAL",null,"FISICO ",{"$f":"SUM(F14:H14)","v":1.0000000000000002},{"$f":"F15/E15","v":0.29096237373689127},{"$f":"G15/$E$15","v":0.40963793706501006},{"$f":"H15/$E$15","v":0.29939968919809884},1.0000000000000002]
[null,null,null,"FINANCEIRO",{"$f":"E11+E9+E7+E13","v":382050.42999999993},{"$f":"F11+F9+F7+F13","v":111162.29999999999},{"$f":"G11+G9+G7+G13","v":156502.35},{"$f":"H11+H9+H7+H13-0.01","v":114385.78},{"$f":"ROUNDUP(SUM(F15:H15),2)","v":382050.43}]
[]
[null,"OBSERVAÇÕES:"]