{"text_format":"2","workbook":"xlsx","n_sheets":5,"sheets":["ORÇAMENTO","CPU","BDI SERV","BDI FORN","CRONOGRAMA"],"not_rendered":{"charts":0,"images":2,"macros":0,"external_links":0,"defined_names":5,"comments":1,"pivot_tables":0},"unopened":[],"bounds":{"document_bytes":16777216,"sheet_cells":100000,"run_cost":"one","rows_first":2000,"rows_last":500,"rows_between":2000,"halvings":0,"cell_chars":16384,"cell_head_chars":4096},"cells_cut":0,"cells_raw":0,"read":"whole","date_system":"1900"}

{"sheet":"ORÇAMENTO","index":0,"n_rows":50,"n_cols":9,"rows_kept":50,"cut":false,"hidden":false,"merged":[[6,1,6,2],[6,6,6,7],[49,1,49,2],[0,0,7,0],[0,2,0,8],[1,2,1,8],[2,2,2,8],[4,2,4,8],[5,6,5,7]]}
["<---- NUMERAR SERVIÇOS PARA CPU",null,"Ministério do Desenvolvimento Regional"]
[null,null,"Companhia de Desenvolvimento dos Vales do São Francisco e do Parnaíba"]
[null,null,"1ª Superintendência Regional"]
[]
[null,"OBRA: "," PAVIMENTAÇÃO ASFÁLTICA EM CBUQ - ESTRADA PARA O POVOADO DIAMANTE - LAGOA DOURADA/MG"]
[null,"DATA:"," AGOSTO / 2023   ",null,null,null,"BDI Serviços:",null,{"$f":"'BDI SERV'!D31/100","v":0.24670000000000003}]
[null,"PRAZO DE EXECUÇÃO:     180 DIAS",{"$nulls":4},"BDI Serviços:",null,{"$f":"'BDI FORN'!D31/100","v":0.15}]
[null,"ITEM","DISCRIMINAÇÃO","REFER.","UNID.","QUANT.","P. UNITÁRIO","P.UNIT.C/ BDI","P. TOTAL"]
["A",1,"SERVIÇOS PRELIMINARES ",{"$nulls":5},{"$f":"SUM(I10:I14)","v":282536.90999999997}]
[1,"1.1","MOBILIZAÇÃO E DESMOBILIZAÇÃO","CPU.1","GL",1,{"$f":"VLOOKUP(A10,CPU!$A$1:$N$4844,9)","v":6452.78},{"$f":"VLOOKUP(A10,CPU!$A$1:$N$4844,10)","v":8044.68},{"$f":"ROUND(F10*H10,2)","v":8044.68}]
[2,"1.2","ADMINISTRAÇÃO LOCAL","CPU.2","GL",1,{"$f":"VLOOKUP(A11,CPU!$A$1:$N$4844,9)","v":190217.52},{"$f":"VLOOKUP(A11,CPU!$A$1:$N$4844,10)","v":237144.18},{"$f":"ROUND(F11*H11,2)","v":237144.18}]
[3,"1.3","CANTEIRO DE OBRAS","CPU.3","GL",1,{"$f":"VLOOKUP(A12,CPU!$A$1:$N$4844,9)","v":19074.54},{"$f":"VLOOKUP(A12,CPU!$A$1:$N$4844,10)","v":23780.23},{"$f":"ROUND(F12*H12,2)","v":23780.23}]
[4,"1.4","PLACA DE OBRA EM CHAPA DE AÇO GALVANIZADO",103689,"M2",9,{"$f":"VLOOKUP(A13,CPU!$A$1:$N$4844,9)","v":350.51000000000005},{"$f":"VLOOKUP(A13,CPU!$A$1:$N$4844,10)","v":436.98},{"$f":"ROUND(F13*H13,2)","v":3932.82}]
[5,"1.5","SERVIÇOS TOPOGRÁFICOS PARA PAVIMENTAÇÃO, INCLUSIVE NOTA DE SERVIÇO, ACOMPANHAMENTO E GREIDE",78472,"M2",23499.996999999999,{"$f":"VLOOKUP(A14,CPU!$A$1:$N$4844,9)","v":0.32999999999999996},{"$f":"VLOOKUP(A14,CPU!$A$1:$N$4844,10)","v":0.41},{"$f":"ROUND(F14*H14,2)","v":9635}]
["B",2,"TERRAPLANAGEM E PAVIMENTAÇÃO",{"$nulls":5},{"$f":"SUM(I16:I22)","v":405644.5}]
[6,"2.1","ESCAVAÇÃO HORIZONTAL EM SOLO DE 1A CATEGORIA ",101116,"M3",9500,{"$f":"VLOOKUP(A16,CPU!$A$1:$N$4844,9)","v":2.0300000000000002},{"$f":"VLOOKUP(A16,CPU!$A$1:$N$4844,10)","v":2.5299999999999998},{"$f":"ROUND(F16*H16,2)","v":24035}]
[7,"2.2","CARGA, MANOBRA E DESCARGA DE SOLOS E MATERIAIS GRANULARES EM CAMINHÃO BASCULANTE",100976,"M3",9500,{"$f":"VLOOKUP(A17,CPU!$A$1:$N$4844,9)","v":6.32},{"$f":"VLOOKUP(A17,CPU!$A$1:$N$4844,10)","v":7.88},{"$f":"ROUND(F17*H17,2)","v":74860}]
[8,"2.3","REGULARIZAÇÃO E COMPACTAÇÃO DO SUBLEITO ",100577,"M2",23500,{"$f":"VLOOKUP(A18,CPU!$A$1:$N$4844,9)","v":1.1299999999999999},{"$f":"VLOOKUP(A18,CPU!$A$1:$N$4844,10)","v":1.41},33135]
[9,"2.4","EXECUÇÃO E COMPACTAÇÃO DE BASE E OU SUB BASE PARA PAVIMENTAÇÃO DE SOLOS DE COMPORTAMENTO LATERITICO - EXCLUSIVE SOLO, ESCAVAÇÃO, CARGA E TRANSPORTE (CASCALHO FORNECIDO PELA PREFEITURA)",96388,"M3",4700,{"$f":"VLOOKUP(A19,CPU!$A$1:$N$4844,9)","v":11.61},{"$f":"VLOOKUP(A19,CPU!$A$1:$N$4844,10)","v":14.47},68009]
[10,"2.5","IMPRIMAÇÃO COM EMULSÃO ASFÁLTICA (EAI)",96401,"M2",23500,{"$f":"VLOOKUP(A20,CPU!$A$1:$N$4844,9)","v":1.1200000000000001},{"$f":"VLOOKUP(A20,CPU!$A$1:$N$4844,10)","v":1.4},32900]
[11,"2.6","PINTURA DE LIGAÇÃO COM EMULSÃO ASFÁLTICA RR-1C",96402,"M2",19800,{"$f":"VLOOKUP(A21,CPU!$A$1:$N$4844,9)","v":0.93000000000000016},{"$f":"VLOOKUP(A21,CPU!$A$1:$N$4844,10)","v":1.1599999999999999},22968]
[12,"2.7","EXECUÇÃO DE PAVIMENTO COM APLICAÇÃO DE CONCRETO ASFÁLTICO USINADO A QUENTE (CBUQ), CAMADA DE ROLAMENTO - EXCLUSIVE TRANSPORTE",95995,"M3",990,{"$f":"VLOOKUP(A22,CPU!$A$1:$N$4844,9)","v":121.32},{"$f":"VLOOKUP(A22,CPU!$A$1:$N$4844,10)","v":151.25},149737.5]
["C",3,"TRANSPORTE DE MATERIAIS",{"$nulls":5},{"$f":"SUM(I24:I25)","v":223251}]
[13,"3.1","TRANSPORTE COM CAMINHÃO BASCULANTE, EM VIA URBANA PAVIMENTADA",95877,"M3XKM",110000.00185152001,{"$f":"VLOOKUP(A24,CPU!$A$1:$N$4844,9)","v":1.6099999999999999},{"$f":"VLOOKUP(A24,CPU!$A$1:$N$4844,10)","v":2.0099999999999998},{"$f":"ROUND(F24*H24,2)","v":221100}]
[14,"3.2","TRANSPORTE COM CAMINHÃO CARROCERIA 9T, EM VIA URBANA PAVIMENTADA",100947,"TXKM",900,{"$f":"VLOOKUP(A25,CPU!$A$1:$N$4844,9)","v":1.92},{"$f":"VLOOKUP(A25,CPU!$A$1:$N$4844,10)","v":2.39},{"$f":"ROUND(F25*H25,2)","v":2151}]
["D",4,"TRANSPORTE DE MATERIAL ASFÁLTICO (BDI DIFERENCIADO)",{"$nulls":5},{"$f":"SUM(I27:I30)","v":137738}]
[15,"4.1","TRANSPORTE DE MASSA ASFÁLTICA COM CAMINHÃO BASCULANTE, EM VIA URBANA PAVIMENTADA (BDI DIFERENCIADO)",95880,"TXKM",80000,{"$f":"VLOOKUP(A27,CPU!$A$1:$N$4844,9)","v":1.08},{"$f":"VLOOKUP(A27,CPU!$A$1:$N$4844,10)","v":1.24},{"$f":"ROUND(F27*H27,2)","v":99200}]
[15.1,"4.2","TRANSPORTE COM CAMINHÃO BASCULANTE EM VIA URBANA PAVIMENTADA, ADICIONAL PARA DMT EXCEDENTE A 30 KM  (BDI DIFERENCIADO)",95427,"TXKM",45000,{"$f":"VLOOKUP(A28,CPU!$A$1:$N$4844,9)","v":0.64999999999999991},{"$f":"VLOOKUP(A28,CPU!$A$1:$N$4844,10)","v":0.75},{"$f":"ROUND(F28*H28,2)","v":33750}]
[16,"4.3","TRANSPORTE COM CAMINHÃO TANQUE DE TRANSPORTE DE MATERIAL ASFÁLTICO, EM VIA URBANA PAVIMENTADA, DMT ATÉ 30KM (BDI DIFERENCIADO)",102330,"TXKM",1200,{"$f":"VLOOKUP(A29,CPU!$A$1:$N$4844,9)","v":1.2000000000000002},{"$f":"VLOOKUP(A29,CPU!$A$1:$N$4844,10)","v":1.38},1656]
[16.100000000000001,"4.4","TRANSPORTE COM CAMINHÃO TANQUE DE TRANSPORTE DE MATERIAL ASFÁLTICO, EM VIA URBANA PAVIMENTADA ADICIONAL PARA DMT EXCEDENTE A 30 KM (BDI DIFERENCIADO)",102331,"TXKM",5800,{"$f":"VLOOKUP(A30,CPU!$A$1:$N$4844,9)","v":0.47},{"$f":"VLOOKUP(A30,CPU!$A$1:$N$4844,10)","v":0.54},{"$f":"ROUND(F30*H30,2)","v":3132}]
["E",5,"DRENAGEM E OBRAS COMPLEMENTARES",{"$nulls":5},{"$f":"SUM(I32:I45)","v":750034.4800000001}]
[17,"5.1","CAIXA COLETORA DE SARJETA - CCS 01 - COM GRELHA DE FERRO - TCC 02 - AREIA E BRITA COMERCIAIS",2003517,"UNID",9,{"$f":"VLOOKUP(A32,CPU!$A$1:$N$4844,9)","v":4688.6732620886987},{"$f":"VLOOKUP(A32,CPU!$A$1:$N$4844,10)","v":5845.37},{"$f":"ROUND(F32*H32,2)","v":52608.33}]
[18,"5.2","SARJETA TRIANGULAR DE CONCRETO - STC 08 - ESCAVAÇÃO MECÂNICA - AREIA E BRITA COMERCIAIS","CPU.4","M",6600,{"$f":"VLOOKUP(A33,CPU!$A$1:$N$4844,9)","v":66.55},{"$f":"VLOOKUP(A33,CPU!$A$1:$N$4844,10)","v":82.97},{"$f":"ROUND(F33*H33,2)","v":547602}]
[18.100000000000001,"5.3","LOCAÇÃO DE REDE DE ÁGUA OU ESGOTO",99063,"M",80,{"$f":"VLOOKUP(A34,CPU!$A$1:$N$4844,9)","v":6.02},{"$f":"VLOOKUP(A34,CPU!$A$1:$N$4844,10)","v":7.51},{"$f":"ROUND(F34*H34,2)","v":600.79999999999995}]
[18.2,"5.4","ESCAVAÇÃO MECANIZADA DE VALA COM PROFUNDIDADE ATÉ 1,5 M, EM SOLO DE 1A CATEGORIA",90105,"M3",100,{"$f":"VLOOKUP(A35,CPU!$A$1:$N$4844,9)","v":8.870000000000001},{"$f":"VLOOKUP(A35,CPU!$A$1:$N$4844,10)","v":11.06},{"$f":"ROUND(F35*H35,2)","v":1106}]
[18.3,"5.5","PREPARO DE FUNDO DE VALA COM LARGURA MENOR QUE 1,5 M (ACERTO DO SOLO NATURAL)",101616,"M2",90,{"$f":"VLOOKUP(A36,CPU!$A$1:$N$4844,9)","v":6.07},{"$f":"VLOOKUP(A36,CPU!$A$1:$N$4844,10)","v":7.57},{"$f":"ROUND(F36*H36,2)","v":681.3}]
[18.399999999999999,"5.6","ESCORAMENTO DE VALA, TIPO PONTALETEAMENTO",101570,"M2",190,{"$f":"VLOOKUP(A37,CPU!$A$1:$N$4844,9)","v":26.669999999999998},{"$f":"VLOOKUP(A37,CPU!$A$1:$N$4844,10)","v":33.25},{"$f":"ROUND(F37*H37,2)","v":6317.5}]
[18.5,"5.7","TUBO DE CONCRETO PARA REDES COLETORAS DE ÁGUAS PLUVIAIS, DIÂMETRO DE 400 MM, JUNTA RÍGIDA - FORNECIMENTO E ASSENTAMENTO",92210,"M",78,{"$f":"VLOOKUP(A38,CPU!$A$1:$N$4844,9)","v":195.12999999999994},{"$f":"VLOOKUP(A38,CPU!$A$1:$N$4844,10)","v":243.27},18975.060000000001]
[18.600000000000001,"5.8","DISSIPADOR DE ENERGIA - DES 01 - AREIA E PEDRA DE MÃO COMERCIAIS",2003441,"UNID",4,{"$f":"VLOOKUP(A39,CPU!$A$1:$N$4844,9)","v":265.52},{"$f":"VLOOKUP(A39,CPU!$A$1:$N$4844,10)","v":331.02},{"$f":"ROUND(F39*H39,2)","v":1324.08}]
[18.7,"5.9","DESCIDA D'ÁGUA DE ATERROS EM DEGRAUS - DAD 03/04 (PADRÃO DNIT)","CPU.5","UNID",3,{"$f":"VLOOKUP(A40,CPU!$A$1:$N$4844,9)","v":843.56000000000006},{"$f":"VLOOKUP(A40,CPU!$A$1:$N$4844,10)","v":1051.67},{"$f":"ROUND(F40*H40,2)","v":3155.01}]
[18.8,"5.10","REATERRO MANUAL DE VALAS COM COMPACTAÇÃO MECANIZADA",93382,"M3",100,{"$f":"VLOOKUP(A41,CPU!$A$1:$N$4844,9)","v":34.64},{"$f":"VLOOKUP(A41,CPU!$A$1:$N$4844,10)","v":43.19},{"$f":"ROUND(F41*H41,2)","v":4319}]
[19,"5.11","PLACA DE REGULAMENTAÇÃO EM AÇO D = 0,60 M - PELÍCULA RETRORREFLETIVA TIPO I + SI - FORNECIMENTO E IMPLANTAÇÃO",5213440,"UN.",32,{"$f":"VLOOKUP(A42,CPU!$A$1:$N$4844,9)","v":264.51},{"$f":"VLOOKUP(A42,CPU!$A$1:$N$4844,10)","v":329.76},{"$f":"ROUND(F42*H42,2)","v":10552.32}]
[20,"5.12","PLACA DE ADVERTÊNCIA EM AÇO, LADO DE 0,60 M - PELÍCULA \nRETRORREFLETIVA TIPO I + SI - FORNECIMENTO E IMPLANTAÇÃO ",5213464,"UN.",4,{"$f":"VLOOKUP(A43,CPU!$A$1:$N$4844,9)","v":264.51},{"$f":"VLOOKUP(A43,CPU!$A$1:$N$4844,10)","v":329.76},{"$f":"ROUND(F43*H43,2)","v":1319.04}]
[21,"5.13","SUPORTE PARA PLACA DE SINALIZAÇÃO EM MADEIRA DE LEI TRATADA 8 X 8 CM - FORNECIMENTO E IMPLANTAÇÃO",5216111,"UN.",36,{"$f":"VLOOKUP(A44,CPU!$A$1:$N$4844,9)","v":225.70999999999998},{"$f":"VLOOKUP(A44,CPU!$A$1:$N$4844,10)","v":281.39},{"$f":"ROUND(F44*H44,2)","v":10130.040000000001}]
[22,"5.14","PINTURA DE EIXO VIÁRIO SOBRE ASFALTO COM TINTA RETRORREFLETIVA A BASE DE RESINA ACRÍLICA COM MICROESFERAS DE VIDRO, APLICAÇÃO MECÂNICA COM DEMARCADORA AUTOPROPELIDA",102512,"M",13200,{"$f":"VLOOKUP(A45,CPU!$A$1:$N$4844,9)","v":5.5500000000000007},{"$f":"VLOOKUP(A45,CPU!$A$1:$N$4844,10)","v":6.92},{"$f":"ROUND(F45*H45,2)","v":91344}]
["F",6,"FORNECIMENTOS - MATERIAL ASFÁLTICO (BDI DIFERENCIADO)",{"$nulls":5},{"$f":"SUM(I47:I49)","v":1897502.04}]
[23,"6.1","AQUISIÇÃO DE EMULSÃO ASFÁLTICA PARA IMPRIMAÇÃO (EAI) - EXCLUSIVE TRANSPORTE","CPU.7","T",32,{"$f":"VLOOKUP(A47,CPU!$A$1:$N$4844,9)","v":2812.65},{"$f":"VLOOKUP(A47,CPU!$A$1:$N$4844,10)","v":3234.55},{"$f":"ROUND(F47*H47,2)","v":103505.60000000001}]
[24,"6.2","AQUISIÇÃO DE EMULSAO ASFALTICA CATIONICA RR-1C - EXCLUSIVE TRANSPORTE","CPU.8","T",9.5,{"$f":"VLOOKUP(A48,CPU!$A$1:$N$4844,9)","v":2736.39},{"$f":"VLOOKUP(A48,CPU!$A$1:$N$4844,10)","v":3146.85},{"$f":"ROUND(F48*H48,2)","v":29895.08}]
[25,"6.3","AQUISIÇÃO DE CONCRETO BETUMINOSO USINADO A QUENTE (CBUQ) PARA PAVIMENTACAO ASFALTICA, PADRAO DNIT, FAIXA C, COM CAP 50/70 - EXCLUSIVE TRANSPORTE","CPU.9","T",2600.0020000000004,{"$f":"VLOOKUP(A49,CPU!$A$1:$N$4844,9)","v":590},{"$f":"VLOOKUP(A49,CPU!$A$1:$N$4844,10)","v":678.5},1764101.36]
[null,"TOTAL GERAL DA OBRA COM BDI ",{"$nulls":6},{"$f":"SUM(I9,I15,I23,I31,I46,I26)","v":3696706.93}]

{"sheet":"CPU","index":1,"n_rows":541,"n_cols":13,"rows_kept":541,"cut":false,"hidden":false,"merged":[[0,1,0,3],[0,4,0,7],[0,10,0,11],[1,2,1,5],[1,10,1,11],[2,2,2,3],[3,1,3,7],[9,1,9,3],[9,5,9,6],[10,1,10,6],[11,1,11,6],[12,1,12,6],[14,1,14,3],[14,4,14,7],[14,10,14,11],[15,2,15,5],[16,2,16,3],[17,1,17,7],[28,1,28,3],[28,5,28,6],[29,1,29,6],[30,1,30,6],[31,1,31,6],[33,1,33,3],[33,4,33,7],[33,10,33,11],[34,2,34,5],[35,2,35,3],[36,1,36,7],[43,1,43,3],[43,5,43,6],[44,1,44,6],[45,1,45,6],[46,1,46,6],[48,1,48,3],[48,4,48,7],[48,10,48,11],[49,2,49,5],[50,2,50,3],[51,1,51,7],[61,1,61,3],[61,5,61,6],[62,1,62,6],[63,1,63,6],[64,1,64,6],[66,1,66,3],[66,4,66,7],[66,10,66,11],[67,2,67,5],[68,2,68,3],[69,1,69,7],[77,1,77,3],[77,5,77,6],[78,1,78,6],[79,1,79,6],[80,1,80,6],[82,1,82,3],[82,4,82,7],[82,10,82,11],[83,2,83,5],[84,2,84,3],[85,1,85,7],[90,1,90,3],[90,5,90,6],[91,1,91,6],[92,1,92,6],[93,1,93,6],[95,1,95,3],[95,4,95,7],[96,2,96,5],[97,2,97,3],[98,1,98,7],[104,1,104,3],[104,5,104,6],[105,1,105,6],[106,1,106,6],[107,1,107,6],[109,1,109,3],[109,4,109,7],[109,10,109,11],[110,2,110,5],[111,2,111,3],[112,1,112,7],[122,1,122,3],[122,5,122,6],[123,1,123,6],[124,1,124,6],[125,1,125,6],[127,1,127,3],[127,4,127,7],[128,2,128,5],[129,2,129,3],[130,1,130,7],[141,1,141,3],[141,5,141,6],[142,1,142,6],[143,1,143,6],[144,1,144,6],[146,1,146,3],[146,4,146,7],[146,10,146,11],[147,2,147,5],[148,2,148,3],[149,1,149,7],[160,1,160,3],[160,5,160,6],[161,1,161,6],[162,1,162,6],[163,1,163,6],[165,1,165,3],[165,4,165,7],[165,10,165,11],[166,2,166,5],[167,2,167,3],[168,1,168,7],[179,1,179,3],[179,5,179,6],[180,1,180,6],[181,1,181,6],[182,1,182,6],[184,1,184,3],[184,4,184,7],[184,10,184,11],[185,2,185,5],[186,2,186,3],[187,1,187,7],[189,8,189,9],[201,1,201,3],[201,5,201,6],[202,1,202,6],[203,1,203,6],[204,1,204,6],[206,1,206,3],[206,4,206,7],[206,10,206,11],[207,2,207,5],[208,2,208,3],[209,1,209,7],[214,1,214,3],[214,5,214,6],[215,1,215,6],[216,1,216,6],[217,1,217,6],[219,1,219,3],[219,4,219,7],[220,2,220,5],[221,2,221,3],[222,1,222,7],[227,1,227,3],[227,5,227,6],[228,1,228,6],[229,1,229,6],[230,1,230,6],[270,1,270,3],[270,4,270,7],[270,10,270,11],[232,1,232,3],[232,4,232,7],[233,2,233,5],[234,2,234,3],[235,1,235,7],[240,1,240,3],[240,5,240,6],[241,1,241,6],[242,1,242,6],[243,1,243,6],[245,1,245,3],[245,4,245,7],[246,2,246,5],[247,2,247,3],[248,1,248,7],[271,2,271,5],[272,2,272,3],[273,1,273,7],[277,1,277,3],[277,5,277,6],[278,1,278,6],[279,1,279,6],[280,1,280,6],[282,1,282,3],[282,4,282,7],[282,10,282,11],[283,2,283,5],[284,2,284,3],[285,1,285,7],[295,1,295,3],[295,5,295,6],[296,1,296,6],[297,1,297,6],[298,1,298,6],[300,1,300,3],[300,4,300,7],[301,2,301,5],[302,2,302,3],[303,1,303,7],[312,1,312,3],[312,5,312,6],[313,1,313,6],[314,1,314,6],[315,1,315,6],[440,1,440,3],[440,4,440,7],[441,2,441,5],[442,2,442,3],[443,1,443,7],[450,1,450,3],[450,5,450,6],[451,1,451,6],[317,1,317,3],[317,4,317,7],[318,2,318,5],[319,2,319,3],[320,1,320,7],[331,1,331,3],[331,5,331,6],[332,1,332,6],[333,1,333,6],[334,1,334,6],[336,1,336,3],[336,4,336,7],[337,2,337,5],[338,2,338,3],[339,1,339,7],[452,1,452,6],[453,1,453,6],[470,1,470,3],[470,4,470,7],[471,2,471,5],[472,2,472,3],[473,1,473,7],[486,1,486,3],[486,5,486,6],[534,1,534,7],[537,1,537,3],[537,5,537,6],[516,1,516,6],[517,1,517,6],[518,1,518,6],[520,1,520,3],[520,4,520,7],[521,2,521,5],[522,2,522,3],[523,1,523,7],[526,1,526,3],[526,5,526,6],[487,1,487,6],[488,1,488,6],[489,1,489,6],[491,1,491,3],[491,4,491,7],[531,1,531,3],[531,4,531,7],[532,2,532,5],[533,2,533,3],[492,2,492,5],[493,2,493,3],[494,1,494,7],[504,1,504,3],[504,5,504,6],[509,0,518,0],[527,1,527,6],[528,1,528,6],[529,1,529,6],[505,1,505,6],[506,1,506,6],[507,1,507,6],[509,1,509,3],[509,4,509,7],[510,2,510,5],[511,2,511,3],[512,1,512,7],[515,1,515,3],[515,5,515,6],[232,0,243,0],[245,0,256,0],[258,0,268,0],[270,0,280,0],[282,0,298,0],[300,0,315,0],[440,0,453,0],[470,0,489,0],[491,0,507,0],[336,0,348,0],[365,0,379,0],[398,0,408,0],[425,0,438,0],[219,0,230,0],[0,0,13,0],[14,0,32,0],[33,0,47,0],[48,0,65,0],[66,0,81,0],[82,0,94,0],[95,0,107,0],[109,0,126,0],[127,0,144,0],[287,12,289,15],[520,0,529,0],[531,0,540,0],[15,8,16,9],[34,8,35,9],[455,0,468,0],[455,1,455,3],[455,4,455,7],[456,2,456,5],[457,2,457,3],[458,1,458,7],[465,1,465,3],[465,5,465,6],[466,1,466,6],[467,1,467,6],[468,1,468,6],[538,1,538,6],[539,1,539,6],[540,1,540,6],[146,0,164,0],[165,0,183,0],[184,0,205,0],[206,0,217,0],[317,0,334,0],[345,1,345,3],[345,5,345,6],[346,1,346,6],[347,1,347,6],[348,1,348,6],[350,0,363,0],[350,1,350,3],[350,4,350,7],[351,2,351,5],[352,2,352,3],[353,1,353,7],[360,1,360,3],[360,5,360,6],[361,1,361,6],[362,1,362,6],[363,1,363,6],[365,1,365,3],[365,4,365,7],[366,2,366,5],[367,2,367,3],[368,1,368,7],[376,1,376,3],[376,5,376,6],[377,1,377,6],[378,1,378,6],[379,1,379,6],[381,0,396,0],[381,1,381,3],[381,4,381,7],[382,2,382,5],[383,2,383,3],[384,1,384,7],[393,1,393,3],[393,5,393,6],[394,1,394,6],[395,1,395,6],[396,1,396,6],[398,1,398,3],[398,4,398,7],[399,2,399,5],[400,2,400,3],[401,1,401,7],[405,1,405,3],[405,5,405,6],[406,1,406,6],[407,1,407,6],[437,1,437,6],[408,1,408,6],[410,0,423,0],[410,1,410,3],[410,4,410,7],[411,2,411,5],[412,2,412,3],[413,1,413,7],[420,1,420,3],[420,5,420,6],[421,1,421,6],[422,1,422,6],[423,1,423,6],[438,1,438,6],[261,1,261,7],[265,1,265,3],[265,5,265,6],[266,1,266,6],[267,1,267,6],[268,1,268,6],[253,1,253,3],[253,5,253,6],[254,1,254,6],[255,1,255,6],[256,1,256,6],[258,1,258,3],[258,4,258,7],[259,2,259,5],[260,2,260,3],[425,1,425,3],[425,4,425,7],[426,2,426,5],[427,2,427,3],[428,1,428,7],[435,1,435,3],[435,5,435,6],[436,1,436,6]]}
[1,"CODEVASF",null,null," COMPOSIÇÃO DE PREÇO UNITÁRIO",null,null,null,{"$f":"H11","v":6452.78},{"$f":"H13","v":8044.68},"BDI CALCULADO:",null,{"$f":"ORÇAMENTO!I6","v":0.24670000000000003}]
[null,"OBRA:  ",{"$f":"ORÇAMENTO!C5","v":" PAVIMENTAÇÃO ASFÁLTICA EM CBUQ - ESTRADA PARA O POVOADO DIAMANTE - LAGOA DOURADA/MG"},null,null,null,"DATA: ",{"$f":"ORÇAMENTO!C6","v":" AGOSTO / 2023   "},null,null,"BDI DIFERENCIADO:",null,{"$f":"'BDI FORN'!D31/100","v":0.15}]
[null,"SERVIÇO:  ",{"$f":"VLOOKUP(A1,ORÇAMENTO!A10:I32,3)","v":"MOBILIZAÇÃO E DESMOBILIZAÇÃO"},null,"Referência:",{"$f":"VLOOKUP(A1,ORÇAMENTO!$A$10:$I$32,4)","v":"CPU.1"},"UNIDADE: ",{"$f":"VLOOKUP(A1,ORÇAMENTO!A10:I32,5)","v":"GL"}]
[]
[null,"TIPO ITEM","CODIGO ITEM","DESCRIÇÃO ITEM","UNIDADE ITEM","COEFICIENTE","PRECO UNITARIO","CUSTO TOTAL"]
[null,"COMPOSICAO",89876,"CAMINHÃO BASCULANTE 14 M3, COM CAVALO MECÂNICO DE CAPACIDADE MÁXIMA DE TRAÇÃO COMBINADO DE 36000 KG, POTÊNCIA 286 CV, INCLUSIVE SEMIREBOQUE COM CAÇAMBA METÁLICA","CHP DIURNO.",8,286.2,{"$f":"ROUNDDOWN(F6*G6,2)","v":2289.6}]
[null,"COMPOSICAO",89877,"CAMINHÃO BASCULANTE 14 M3, COM CAVALO MECÂNICO DE CAPACIDADE MÁXIMA DE TRAÇÃO COMBINADO DE 36000 KG, POTÊNCIA 286 CV, INCLUSIVE SEMIREBOQUE COM CAÇAMBA METÁLICA","CHI DIURNO.",16,82.81,{"$f":"ROUNDDOWN(F7*G7,2)","v":1324.96}]
[null,"COMPOSICAO",5914640,"TRANSPORTE COM CAVALO MECÂNICO COM SEMIRREBOQUE COM CAPACIDADE DE 30 T - RODOVIA PAVIMENTADA","T.KM",3870,0.56999999999999995,2205.9]
[null,"COMPOSIÇÃO",88316,"SERVENTE COM ENCARGOS COMPLEMENTARES","H",32,19.760000000000002,632.32000000000005]
[null,"PRODUÇÃO DA EQUIPE",null,null,1,"CUSTO ",null,{"$f":"SUM(H6:H9)","v":6452.78}]
[null,"TOTAL",{"$nulls":5},{"$f":"H10/E10","v":6452.78},"OK"]
[null,"BDI                %",{"$nulls":5},{"$f":"1+$M$1","v":1.2467000000000001}]
[null,"TOTAL DO SERVIÇO - R$",{"$nulls":5},{"$f":"ROUND(H11*H12,2)","v":8044.68}]
[]
[{"$f":"A1+1","v":2},"CODEVASF",null,null," COMPOSIÇÃO DE PREÇO UNITÁRIO",null,null,null,{"$f":"H30","v":190217.52},{"$f":"H32","v":237144.18}]
[null,"OBRA:  ",{"$f":"$C$2","v":" PAVIMENTAÇÃO ASFÁLTICA EM CBUQ - ESTRADA PARA O POVOADO DIAMANTE - LAGOA DOURADA/MG"},null,null,null,"DATA: ",{"$f":"$H$2","v":" AGOSTO / 2023   "}]
[null,"SERVIÇO:  ",{"$f":"VLOOKUP(A15,ORÇAMENTO!$A$10:$I$32,3)","v":"ADMINISTRAÇÃO LOCAL"},null,"SINAPI",{"$f":"VLOOKUP(A15,ORÇAMENTO!$A$10:$I$32,4)","v":"CPU.2"},"UNIDADE: ",{"$f":"VLOOKUP(A15,ORÇAMENTO!$A$10:$I$32,5)","v":"GL"}]
[]
[null,"TIPO ITEM","CODIGO ITEM","DESCRIÇÃO ITEM","UNIDADE ITEM","COEFICIENTE","PRECO UNITARIO","CUSTO TOTAL"]
[null,"INSUMO",14250,"ENERGIA ELÉTRICA","kwh",80,0.95,{"$f":"ROUNDDOWN(F20*G20,2)","v":76}]
[null,"INSUMO",44480,"TARIFA \"A\" - ÁGUA/ESGOTO ","m³",6,17.97,107.82]
[null,"COTAÇÃO","MERC.","TELEFONE (PLANO CONTROLE)","UNID",3,59.9,179.7]
[null,"INSUMO","ED-50155 SEINFRA","BANHEIRO QUÍMICO 110 X 120 X 230 CM COM MANUTENÇÃO (CONSIDERANDO OBRAS SIMULTÂNEAS)","MÊS",2,515,1030]
[null,"COMPOSICAO",90777,"Engenheiro Civil Júnior com encargos complementares","H",55,114.12,6276.6]
[null,"COMPOSICAO",90776,"Encarregado Geral com encargos complementares","H",220,57.73,12700.6]
[null,"COMPOSICAO",88321,"Tecnico de Laboratório com encargos complementares","H",110,45.45,4999.5]
[null,"COMPOSICAO",100309,"Tecnico em Segurança do Trabalho com encargos complementares","H",110,45.71,{"$f":"ROUNDDOWN(F27*G27,2)","v":5028.1000000000004}]
[null,"COMPOSICAO",90772,"Auxiliar de escritório com encargos complementares","H",55,23.72,1304.5999999999999]
[null,"PRODUÇÃO DA EQUIPE",null,null,{"$f":"1/6","v":0.16666666666666666},"CUSTO ",null,{"$f":"SUM(H20:H28)","v":31702.92}]
[null,"TOTAL",{"$nulls":5},{"$f":"ROUND(H29/E29,2)","v":190217.52},"OK"]
[null,"BDI                %",{"$nulls":5},{"$f":"1+$M$1","v":1.2467000000000001}]
[null,"TOTAL DO SERVIÇO - R$",{"$nulls":5},{"$f":"ROUND(H30*H31,2)","v":237144.18}]
[]
[{"$f":"A15+1","v":3},"CODEVASF",null,null," COMPOSIÇÃO DE PREÇO UNITÁRIO",null,null,null,{"$f":"H45","v":19074.54},{"$f":"H47","v":23780.23}]
[null,"OBRA:  ",{"$f":"$C$2","v":" PAVIMENTAÇÃO ASFÁLTICA EM CBUQ - ESTRADA PARA O POVOADO DIAMANTE - LAGOA DOURADA/MG"},null,null,null,"DATA: ",{"$f":"$H$2","v":" AGOSTO / 2023   "}]
[null,"SERVIÇO:  ",{"$f":"VLOOKUP(A34,ORÇAMENTO!$A$10:$I$32,3)","v":"CANTEIRO DE OBRAS"},null,"SINAPI",{"$f":"VLOOKUP(A34,ORÇAMENTO!$A$10:$I$32,4)","v":"CPU.3"},"UNIDADE: ",{"$f":"VLOOKUP(A34,ORÇAMENTO!$A$10:$I$32,5)","v":"GL"}]
[]
[null,"TIPO ITEM","CODIGO ITEM","DESCRIÇÃO ITEM","UNIDADE ITEM","COEFICIENTE","PRECO UNITARIO","CUSTO TOTAL"]
[null,"INSUMO",10775,"ALUGUEL DE IMÓVEL OU CONTEINER QUE ATENDA AOS REQUISITOS MÍNIMOS PARA INSTALAÇÃO DO CANTEIRO DE OBRAS","MÊS",6,995,{"$f":"ROUNDDOWN(F39*G39,2)","v":5970}]
[null,"INSUMO",10779,"LOCACAO DE CONTAINER 2,30 X 4,30 M, ALT. 2,50 M, P/ SANITARIO, C/ 5 BACIAS, 1 LAVATORIO E 4 MICTORIOS ","MÊS",6,1243.75,{"$f":"ROUNDDOWN(F40*G40,2)","v":7462.5}]
[null,"INSUMO",10776,"LOCACAO DE CONTAINER 2,30 X 6,00 M, ALT. 2,50 M, PARA ESCRITORIO, SEM DIVISORIAS INTERNAS E SEM SANITARIO","MÊS",6,777.34,4664.04]
[null,"INSUMO","37525","TELA PLASTICA TECIDA LISTRADA BRANCA E LARANJA, TIPO GUARDA CORPO, EM POLIETILENO MONOFILADO, ROLO 1,20 X 50 M (L X C)","M",200,3.69,738]
[null,"COMPOSICAO"," - ","PLACA DE SINALIZAÇÃO - \"PERIGO - OBRAS A FRENTE\" - FORNECIMENTO E MOVIMENTAÇÃO","UNID.",12,20,240]
[null,"PRODUÇÃO DA EQUIPE",null,null,1,"CUSTO ",null,{"$f":"SUM(H39:H43)","v":19074.54}]
[null,"TOTAL",{"$nulls":5},{"$f":"H44/E44","v":19074.54},"OK"]
[null,"BDI                %",{"$nulls":5},{"$f":"1+$M$1","v":1.2467000000000001}]
[null,"TOTAL DO SERVIÇO - R$",{"$nulls":5},{"$f":"ROUND(H45*H46,2)","v":23780.23}]
[]
[{"$f":"A34+1","v":4},"CODEVASF",null,null," COMPOSIÇÃO DE PREÇO UNITÁRIO",null,null,null,{"$f":"H63","v":350.51000000000005},{"$f":"H65","v":436.98}]
[null,"OBRA:  ",{"$f":"$C$2","v":" PAVIMENTAÇÃO ASFÁLTICA EM CBUQ - ESTRADA PARA O POVOADO DIAMANTE - LAGOA DOURADA/MG"},null,null,null,"DATA: ",{"$f":"$H$2","v":" AGOSTO / 2023   "}]
[null,"SERVIÇO:  ",{"$f":"VLOOKUP(A49,ORÇAMENTO!$A$10:$I$32,3)","v":"PLACA DE OBRA EM CHAPA DE AÇO GALVANIZADO"},null,"SINAPI",{"$f":"VLOOKUP(A49,ORÇAMENTO!$A$10:$I$32,4)","v":103689},"UNIDADE: ",{"$f":"VLOOKUP(A49,ORÇAMENTO!$A$10:$I$32,5)","v":"M2"}]
[]
[null,"TIPO ITEM","CODIGO ITEM","DESCRIÇÃO ITEM","UNIDADE ITEM","COEFICIENTE","PRECO UNITARIO","CUSTO TOTAL"]
[null,"INSUMO","4509","SARRAFO *2,5 X 10* CM EM PINUS, MISTA OU EQUIVALENTE DA REGIAO - BRUTA","M","3,2083000","4,41",{"$f":"ROUNDDOWN(F54*G54,2)","v":14.14}]
[null,"INSUMO","4813","PLACA DE OBRA (PARA CONSTRUCAO CIVIL) EM CHAPA GALVANIZADA *N. 22*, ADESIVADA, DE *2,4 X 1,2* M (SEM POSTES PARA FIXACAO)","M2","1,0000000","250,00",250]
[null,"INSUMO","5065","PREGO DE ACO POLIDO COM CABECA 10 X 10 (7/8 X 17)","KG","0,0113000","36,57",{"$f":"ROUNDDOWN(F56*G56,2)","v":0.41}]
[null,"INSUMO","5069","PREGO DE ACO POLIDO COM CABECA 17 X 27 (2 1/2 X 11)","KG","0,0132000","19,59",0.25]
[null,"COMPOSICAO","88262","CARPINTEIRO DE FORMAS COM ENCARGOS COMPLEMENTARES","H","0,3729000","27,05",10.08]
[null,"COMPOSICAO","88316","SERVENTE COM ENCARGOS COMPLEMENTARES","H","1,1186000","19,76",22.1]
[null,"COMPOSICAO","102234","PINTURA IMUNIZANTE PARA MADEIRA, 2 DEMÃOS","M2","0,5000000","21,58",10.79]
[null,"COMPOSICAO",4115,"MADEIRA ROLICA TRATADA, D = 12 A 15 CM, EM EUCALIPTO OU EQUIVALENTE DA REGIAO","M",2,21.37,42.74]
[null,"PRODUÇÃO DA EQUIPE",null,null,1,"CUSTO ",null,{"$f":"SUM(H54:H61)","v":350.51000000000005}]
[null,"TOTAL",{"$nulls":5},{"$f":"H62/E62","v":350.51000000000005},"OK"]
[null,"BDI                %",{"$nulls":5},{"$f":"1+$M$1","v":1.2467000000000001}]
[null,"TOTAL DO SERVIÇO - R$",{"$nulls":5},{"$f":"ROUND(H63*H64,2)","v":436.98}]
[]
[{"$f":"A49+1","v":5},"CODEVASF",null,null," COMPOSIÇÃO DE PREÇO UNITÁRIO",null,null,null,{"$f":"H79","v":0.32999999999999996},{"$f":"H81","v":0.41}]
[null,"OBRA:  ",{"$f":"$C$2","v":" PAVIMENTAÇÃO ASFÁLTICA EM CBUQ - ESTRADA PARA O POVOADO DIAMANTE - LAGOA DOURADA/MG"},null,null,null,"DATA: ",{"$f":"$H$2","v":" AGOSTO / 2023   "}]
[null,"SERVIÇO:  ",{"$f":"VLOOKUP(A67,ORÇAMENTO!$A$10:$I$32,3)","v":"SERVIÇOS TOPOGRÁFICOS PARA PAVIMENTAÇÃO, INCLUSIVE NOTA DE SERVIÇO, ACOMPANHAMENTO E GREIDE"},null,"SINAPI",{"$f":"VLOOKUP(A67,ORÇAMENTO!$A$10:$I$32,4)","v":78472},"UNIDADE: ",{"$f":"VLOOKUP(A67,ORÇAMENTO!$A$10:$I$32,5)","v":"M2"}]
[]
[null,"TIPO ITEM","CODIGO ITEM","DESCRIÇÃO ITEM","UNIDADE ITEM","COEFICIENTE","PRECO UNITARIO","CUSTO TOTAL"]
[null,"COMPOSICAO",88253,"AUXILIAR DE TOPÓGRAFO COM ENCARGOS COMPLEMENTARES","H",2.5000000000000001E-3,21.57,{"$f":"ROUNDDOWN(F72*G72,2)","v":0.05}]
[null,"COMPOSICAO",88288,"NIVELADOR COM ENCARGOS COMPLEMENTARES","H",2.5000000000000001E-3,26.99,{"$f":"ROUNDDOWN(F73*G73,2)","v":0.06}]
[null,"COMPOSICAO",88316,"SERVENTE COM ENCARGOS COMPLEMENTARES","H",7.4999999999999997E-3,19.760000000000002,0.14000000000000001]
[null,"COMPOSICAO",88597,"DESENHISTA DETALHISTA COM ENCARGOS COMPLEMENTARES ","H",2E-3,29.72,0.05]
[null,"COMPOSICAO",92145,"CAMINHONETE CABINE SIMPLES COM MOTOR 1.6 FLEX, CÂMBIO MANUAL, POTÊNCIA 101/104 CV, 2 PORTAS","CHP",5.0000000000000001E-4,73.33,0.03]
[{"$nulls":7},{"$f":"ROUNDDOWN(F77*G77,2)","v":0}]
[null,"PRODUÇÃO DA EQUIPE",null,null,1,"CUSTO ",null,{"$f":"SUM(H72:H77)","v":0.32999999999999996}]
[null,"TOTAL",{"$nulls":5},{"$f":"H78/E78","v":0.32999999999999996},"OK"]
[null,"BDI                %",{"$nulls":5},{"$f":"1+$M$1","v":1.2467000000000001}]
[null,"TOTAL DO SERVIÇO - R$",{"$nulls":5},{"$f":"ROUND(H79*H80,2)","v":0.41}]
[]
[{"$f":"A67+1","v":6},"CODEVASF",null,null," COMPOSIÇÃO DE PREÇO UNITÁRIO",null,null,null,{"$f":"H92","v":2.0300000000000002},{"$f":"H94","v":2.5299999999999998}]
[null,"OBRA:  ",{"$f":"$C$2","v":" PAVIMENTAÇÃO ASFÁLTICA EM CBUQ - ESTRADA PARA O POVOADO DIAMANTE - LAGOA DOURADA/MG"},null,null,null,"DATA: ",{"$f":"$H$2","v":" AGOSTO / 2023   "}]
[null,"SERVIÇO:  ",{"$f":"VLOOKUP(A83,ORÇAMENTO!$A$10:$I$32,3)","v":"ESCAVAÇÃO HORIZONTAL EM SOLO DE 1A CATEGORIA "},null,"SINAPI",{"$f":"VLOOKUP(A83,ORÇAMENTO!$A$10:$I$32,4)","v":101116},"UNIDADE: ",{"$f":"VLOOKUP(A83,ORÇAMENTO!$A$10:$I$32,5)","v":"M3"}]
[]
[null,"TIPO ITEM","CODIGO ITEM","DESCRIÇÃO ITEM","UNIDADE ITEM","COEFICIENTE","PRECO UNITARIO","CUSTO TOTAL"]
[null,"COMPOSICAO","5847","TRATOR DE ESTEIRAS, POTÊNCIA 170 HP, PESO OPERACIONAL 19 T, CAÇAMBA 5,2 M3","CHP","0,0048000","231,82",{"$f":"ROUNDDOWN(F88*G88,2)","v":1.1100000000000001}]
[null,"COMPOSICAO","5849","TRATOR DE ESTEIRAS, POTÊNCIA 170 HP, PESO OPERACIONAL 19 T, CAÇAMBA 5,2 M3","CHI","0,0082000","82,14",0.67]
[null,"COMPOSICAO","88316","SERVENTE COM ENCARGOS COMPLEMENTARES","H","0,0131000","19,76",0.25]
[null,"PRODUÇÃO DA EQUIPE",null,null,1,"CUSTO ",null,{"$f":"SUM(H88:H90)","v":2.0300000000000002}]
[null,"TOTAL",{"$nulls":5},{"$f":"H91/E91","v":2.0300000000000002},"OK"]
[null,"BDI                %",{"$nulls":5},{"$f":"1+$M$1","v":1.2467000000000001}]
[null,"TOTAL DO SERVIÇO - R$",{"$nulls":5},{"$f":"ROUND(H92*H93,2)","v":2.5299999999999998}]
[]
[7,"CODEVASF",null,null," COMPOSIÇÃO DE PREÇO UNITÁRIO",null,null,null,{"$f":"H106","v":6.32},{"$f":"H108","v":7.88}]
[null,"OBRA:  ",{"$f":"$C$2","v":" PAVIMENTAÇÃO ASFÁLTICA EM CBUQ - ESTRADA PARA O POVOADO DIAMANTE - LAGOA DOURADA/MG"},null,null,null,"DATA: ",{"$f":"$H$2","v":" AGOSTO / 2023   "}]
[null,"SERVIÇO:  ",{"$f":"VLOOKUP(A96,ORÇAMENTO!$A$10:$I$32,3)","v":"CARGA, MANOBRA E DESCARGA DE SOLOS E MATERIAIS GRANULARES EM CAMINHÃO BASCULANTE"},null,"SINAPI",{"$f":"VLOOKUP(A96,ORÇAMENTO!$A$10:$I$32,4)","v":100976},"UNIDADE: ",{"$f":"VLOOKUP(A96,ORÇAMENTO!$A$10:$I$32,5)","v":"M3"}]
[]
[null,"TIPO ITEM","CODIGO ITEM","DESCRIÇÃO ITEM","UNIDADE ITEM","COEFICIENTE","PRECO UNITARIO","CUSTO TOTAL"]
[null,"COMPOSICAO","5940","PÁ CARREGADEIRA SOBRE RODAS, POTÊNCIA LÍQUIDA 128 HP, CAPACIDADE DA CAÇAMBA 1,7 A 2,8 M3, PESO OPERACIONAL 11632 KG","CHP","0,0083000","205,93",{"$f":"ROUNDDOWN(F101*G101,2)","v":1.7}]
[null,"COMPOSICAO","5942","PÁ CARREGADEIRA SOBRE RODAS, POTÊNCIA LÍQUIDA 128 HP, CAPACIDADE DA CAÇAMBA 1,7 A 2,8 M3, PESO OPERACIONAL 11632 KG","CHI","0,0074000","90,02",0.66]
[null,"COMPOSICAO","89883","CAMINHÃO BASCULANTE 18 M3, COM CAVALO MECÂNICO DE CAPACIDADE MÁXIMA DE TRAÇÃO COMBINADO DE 45000 KG, POTÊNCIA 330 CV, INCLUSIVE SEMIREBOQUE COM CAÇAMBA METÁLICA","CHP",1.00053E-2,"314,64",3.14]
[null,"COMPOSICAO","89884","CAMINHÃO BASCULANTE 18 M3, COM CAVALO MECÂNICO DE CAPACIDADE MÁXIMA DE TRAÇÃO COMBINADO DE 45000 KG, POTÊNCIA 330 CV, INCLUSIVE SEMIREBOQUE COM CAÇAMBA METÁLICA","CHI","0,0095000","86,36",0.82]
[null,"PRODUÇÃO DA EQUIPE",null,null,1,"CUSTO ",null,{"$f":"SUM(H101:H104)","v":6.32}]
[null,"TOTAL",{"$nulls":5},{"$f":"H105/E105","v":6.32},"OK"]
[null,"BDI                %",{"$nulls":5},{"$f":"1+$M$1","v":1.2467000000000001}]
[null,"TOTAL DO SERVIÇO - R$",{"$nulls":5},{"$f":"ROUND(H106*H107,2)","v":7.88}]
[]
[8,"CODEVASF",null,null," COMPOSIÇÃO DE PREÇO UNITÁRIO",null,null,null,{"$f":"H124","v":1.1299999999999999},{"$f":"H126","v":1.41}]
[null,"OBRA:  ",{"$f":"$C$2","v":" PAVIMENTAÇÃO ASFÁLTICA EM CBUQ - ESTRADA PARA O POVOADO DIAMANTE - LAGOA DOURADA/MG"},null,null,null,"DATA: ",{"$f":"$H$2","v":" AGOSTO / 2023   "}]
[null,"SERVIÇO:  ",{"$f":"VLOOKUP(A110,ORÇAMENTO!$A$10:$I$32,3)","v":"REGULARIZAÇÃO E COMPACTAÇÃO DO SUBLEITO "},null,"SICRO",{"$f":"VLOOKUP(A110,ORÇAMENTO!$A$10:$I$32,4)","v":100577},"UNIDADE: ","M2"]
[]
[null,"TIPO ITEM","CODIGO ITEM","DESCRIÇÃO ITEM","UNIDADE ITEM","COEFICIENTE","PRECO UNITARIO","CUSTO TOTAL"]
[null,"COMPOSICAO","5901","CAMINHÃO PIPA 10.000 L TRUCADO, PESO BRUTO TOTAL 23.000 KG, CARGA ÚTIL MÁXIMA 15.935 KG, DISTÂNCIA ENTRE EIXOS 4,8 M, POTÊNCIA 230 CV, INCLUSIVE TANQUE DE AÇO PARA TRANSPORTE DE ÁGUA - CHP DIURNO. AF_06/2014","CHP","0,0010000","264,71",{"$f":"ROUNDDOWN(F115*G115,2)","v":0.26}]
[null,"COMPOSICAO","5903","CAMINHÃO PIPA 10.000 L TRUCADO, PESO BRUTO TOTAL 23.000 KG, CARGA ÚTIL MÁXIMA 15.935 KG, DISTÂNCIA ENTRE EIXOS 4,8 M, POTÊNCIA 230 CV, INCLUSIVE TANQUE DE AÇO PARA TRANSPORTE DE ÁGUA - CHI DIURNO. AF_06/2014","CHI","0,0020000","67,26",{"$f":"ROUNDDOWN(F116*G116,2)","v":0.13}]
[null,"COMPOSICAO","5932","MOTONIVELADORA POTÊNCIA BÁSICA LÍQUIDA (PRIMEIRA MARCHA) 125 HP, PESO BRUTO 13032 KG, LARGURA DA LÂMINA DE 3,7 M - CHP DIURNO. AF_06/2014","CHP","0,0001000","244,89",0.02]
[null,"COMPOSICAO","5934","MOTONIVELADORA POTÊNCIA BÁSICA LÍQUIDA (PRIMEIRA MARCHA) 125 HP, PESO BRUTO 13032 KG, LARGURA DA LÂMINA DE 3,7 M - CHI DIURNO. AF_06/2014","CHI","0,0030000","101,62",0.3]
[null,"COMPOSICAO","88316","SERVENTE COM ENCARGOS COMPLEMENTARES","H","0,0030000","19,76",0.05]
[null,"COMPOSICAO","96463","ROLO COMPACTADOR DE PNEUS, ESTATICO, PRESSAO VARIAVEL, POTENCIA 110 HP, PESO SEM/COM LASTRO 10,8/27 T, LARGURA DE ROLAGEM 2,30 M - CHP DIURNO. AF_06/2017","CHP","0,0010000","203,13",0.2]
[null,"COMPOSICAO","96464","ROLO COMPACTADOR DE PNEUS, ESTATICO, PRESSAO VARIAVEL, POTENCIA 110 HP, PESO SEM/COM LASTRO 10,8/27 T, LARGURA DE ROLAGEM 2,30 M - CHI DIURNO. AF_06/2017","CHI","0,0020000","89,07",0.17]
[]
[null,"PRODUÇÃO DA EQUIPE",null,null,1,"CUSTO ",null,{"$f":"SUM(H115:H122)","v":1.1299999999999999}]
[null,"TOTAL",{"$nulls":5},{"$f":"H123/E123","v":1.1299999999999999},"OK"]
[null,"BDI                %",{"$nulls":5},{"$f":"1+$M$1","v":1.2467000000000001}]
[null,"TOTAL DO SERVIÇO - R$",{"$nulls":5},{"$f":"ROUND(H124*H125,2)","v":1.41}]
[]
[9,"CODEVASF",null,null," COMPOSIÇÃO DE PREÇO UNITÁRIO",null,null,null,{"$f":"H143","v":11.61},{"$f":"H145","v":14.47}]
[null,"OBRA:  ",{"$f":"$C$2","v":" PAVIMENTAÇÃO ASFÁLTICA EM CBUQ - ESTRADA PARA O POVOADO DIAMANTE - LAGOA DOURADA/MG"},null,null,null,"DATA: ",{"$f":"$H$2","v":" AGOSTO / 2023   "}]
[null,"SERVIÇO:  ",{"$f":"VLOOKUP(A128,ORÇAMENTO!$A$10:$I$32,3)","v":"EXECUÇÃO E COMPACTAÇÃO DE BASE E OU SUB BASE PARA PAVIMENTAÇÃO DE SOLOS DE COMPORTAMENTO LATERITICO - EXCLUSIVE SOLO, ESCAVAÇÃO, CARGA E TRANSPORTE (CASCALHO FORNECIDO PELA PREFEITURA)"},null,"SINAPI",{"$f":"VLOOKUP(A128,ORÇAMENTO!$A$10:$I$32,4)","v":96388},"UNIDADE: ",{"$f":"VLOOKUP(A128,ORÇAMENTO!$A$10:$I$32,5)","v":"M3"}]
[]
[null,"TIPO ITEM","CODIGO ITEM","DESCRIÇÃO ITEM","UNIDADE ITEM","COEFICIENTE","PRECO UNITARIO","CUSTO TOTAL"]
[null,"COMPOSICAO","5684","ROLO COMPACTADOR VIBRATÓRIO DE UM CILINDRO AÇO LISO, POTÊNCIA 80 HP, PESO OPERACIONAL MÁXIMO 8,1 T, IMPACTO DINÂMICO 16,15 / 9,5 T, LARGURA DE TRABALHO 1,68 M - CHP DIURNO. AF_06/2014","CHP","0,0030000","148,46",{"$f":"ROUNDDOWN(F133*G133,2)","v":0.44}]
[null,"COMPOSICAO","5685","ROLO COMPACTADOR VIBRATÓRIO DE UM CILINDRO AÇO LISO, POTÊNCIA 80 HP, PESO OPERACIONAL MÁXIMO 8,1 T, IMPACTO DINÂMICO 16,15 / 9,5 T, LARGURA DE TRABALHO 1,68 M - CHI DIURNO. AF_06/2014","CHI","0,0230000","65,46",1.5]
[null,"COMPOSICAO","5901","CAMINHÃO PIPA 10.000 L TRUCADO, PESO BRUTO TOTAL 23.000 KG, CARGA ÚTIL MÁXIMA 15.935 KG, DISTÂNCIA ENTRE EIXOS 4,8 M, POTÊNCIA 230 CV, INCLUSIVE TANQUE DE AÇO PARA TRANSPORTE DE ÁGUA - CHP DIURNO. AF_06/2014","CHP","0,0040000","264,71",1.05]
[null,"COMPOSICAO","5903","CAMINHÃO PIPA 10.000 L TRUCADO, PESO BRUTO TOTAL 23.000 KG, CARGA ÚTIL MÁXIMA 15.935 KG, DISTÂNCIA ENTRE EIXOS 4,8 M, POTÊNCIA 230 CV, INCLUSIVE TANQUE DE AÇO PARA TRANSPORTE DE ÁGUA - CHI DIURNO. AF_06/2014","CHI","0,0220000","67,26",1.47]
[null,"COMPOSICAO","5932","MOTONIVELADORA POTÊNCIA BÁSICA LÍQUIDA (PRIMEIRA MARCHA) 125 HP, PESO BRUTO 13032 KG, LARGURA DA LÂMINA DE 3,7 M - CHP DIURNO. AF_06/2014","CHP","0,0080000","244,89",1.95]
[null,"COMPOSICAO","5934","MOTONIVELADORA POTÊNCIA BÁSICA LÍQUIDA (PRIMEIRA MARCHA) 125 HP, PESO BRUTO 13032 KG, LARGURA DA LÂMINA DE 3,7 M - CHI DIURNO. AF_06/2014","CHI","0,0190000","101,62",1.93]
[null,"COMPOSICAO","88316","SERVENTE COM ENCARGOS COMPLEMENTARES","H","0,0260000","19,76",0.51]
[null,"COMPOSICAO","96463","ROLO COMPACTADOR DE PNEUS, ESTATICO, PRESSAO VARIAVEL, POTENCIA 110 HP, PESO SEM/COM LASTRO 10,8/27 T, LARGURA DE ROLAGEM 2,30 M - CHP DIURNO. AF_06/2017","CHP","0,0040000","203,13",0.81]
[null,"COMPOSICAO","96464","ROLO COMPACTADOR DE PNEUS, ESTATICO, PRESSAO VARIAVEL, POTENCIA 110 HP, PESO SEM/COM LASTRO 10,8/27 T, LARGURA DE ROLAGEM 2,30 M - CHI DIURNO. AF_06/2017","CHI","0,0220000","89,07",1.95]
[null,"PRODUÇÃO DA EQUIPE",null,null,1,"CUSTO ",null,{"$f":"SUM(H133:H141)","v":11.61}]
[null,"TOTAL",{"$nulls":5},{"$f":"H142/E142","v":11.61},"OK"]
[null,"BDI                %",{"$nulls":5},{"$f":"1+$M$1","v":1.2467000000000001}]
[null,"TOTAL DO SERVIÇO - R$",{"$nulls":5},{"$f":"ROUND(H143*H144,2)","v":14.47}]
[]
[10,"CODEVASF",null,null," COMPOSIÇÃO DE PREÇO UNITÁRIO",null,null,null,{"$f":"H162","v":1.1200000000000001},{"$f":"H164","v":1.4}]
[null,"OBRA:  ",{"$f":"$C$2","v":" PAVIMENTAÇÃO ASFÁLTICA EM CBUQ - ESTRADA PARA O POVOADO DIAMANTE - LAGOA DOURADA/MG"},null,null,null,"DATA: ",{"$f":"$H$2","v":" AGOSTO / 2023   "}]
[null,"SERVIÇO:  ",{"$f":"VLOOKUP(A147,ORÇAMENTO!$A$10:$I$32,3)","v":"IMPRIMAÇÃO COM EMULSÃO ASFÁLTICA (EAI)"},null,"SINAPI",{"$f":"VLOOKUP(A147,ORÇAMENTO!$A$10:$I$32,4)","v":96401},"UNIDADE: ",{"$f":"VLOOKUP(A147,ORÇAMENTO!$A$10:$I$32,5)","v":"M2"}]
[]
[null,"TIPO ITEM","CODIGO ITEM","DESCRIÇÃO ITEM","UNIDADE ITEM","COEFICIENTE","PRECO UNITARIO","CUSTO TOTAL"]
[null,"COMPOSICAO",5839,"VASSOURA MECÂNICA REBOCÁVEL COM ESCOVA CILÍNDRICA, LARGURA ÚTIL DE VARRIMENTO DE 2,44 M ","CHP","0,0020000",9.77,{"$f":"ROUNDDOWN(F152*G152,2)","v":0.01}]
[null,"COMPOSICAO",5841,"VASSOURA MECÂNICA REBOCÁVEL COM ESCOVA CILÍNDRICA, LARGURA ÚTIL DE VARRIMENTO DE 2,44 M ","CHI","0,0040000",4.6500000000000004,0.01]
[null,"INSUMO","ANP","EMULSÃO ASFÁLTICA PARA IMPRIMAÇÃO - EAI (FORNECIMENTO COM BDI DIFERENCIADO)","T",{"$f":"1.3/1000","v":1.2999999999999999E-3},null,0]
[null,"COMPOSICAO",83362,"ESPARGIDOR DE ASFALTO PRESSURIZADO, TANQUE 6 M3 COM ISOLAÇÃO TÉRMICA, AQUECIDO COM 2 MAÇARICOS, COM BARRA ESPARGIDORA 3,60 M, MONTADO SOBRE CAMINHÃO  TOCO, PBT 14.300 KG, POTÊNCIA 185 CV","CHP","0,0010000",232.92,0.23]
[null,"COMPOSICAO",88316,"SERVENTE COM ENCARGOS COMPLEMENTARES","H","0,0060000",19.760000000000002,0.11]
[null,"COMPOSICAO",89035,"TRATOR DE PNEUS, POTÊNCIA 85 CV, TRAÇÃO 4X4, PESO COM LASTRO DE 4.675 KG ","CHP","0,0020000",119.96,0.23]
[null,"COMPOSICAO",89036,"TRATOR DE PNEUS, POTÊNCIA 85 CV, TRAÇÃO 4X4, PESO COM LASTRO DE 4.675 KG ","CHI","0,0040000",52.19,0.2]
[null,"COMPOSICAO",91486,"ESPARGIDOR DE ASFALTO PRESSURIZADO, TANQUE 6 M3 COM ISOLAÇÃO TÉRMICA, AQUECIDO COM 2 MAÇARICOS, COM BARRA ESPARGIDORA 3,60 M, MONTADO SOBRE CAMINHÃO  TOCO, PBT 14.300 KG, POTÊNCIA 185 CV","CHI","0,0050000",66.180000000000007,0.33]
[{"$nulls":7},0]
[null,"PRODUÇÃO DA EQUIPE",null,null,1,"CUSTO ",null,{"$f":"SUM(H152:H160)","v":1.1200000000000001}]
[null,"TOTAL",{"$nulls":5},{"$f":"H161/E161","v":1.1200000000000001},"OK"]
[null,"BDI                %",{"$nulls":5},{"$f":"1+$M$1","v":1.2467000000000001}]
[null,"TOTAL DO SERVIÇO - R$",{"$nulls":5},{"$f":"ROUND(H162*H163,2)","v":1.4}]
[]
[11,"CODEVASF",null,null," COMPOSIÇÃO DE PREÇO UNITÁRIO",null,null,null,{"$f":"H181","v":0.93000000000000016},{"$f":"H183","v":1.1599999999999999}]
[null,"OBRA:  ",{"$f":"$C$2","v":" PAVIMENTAÇÃO ASFÁLTICA EM CBUQ - ESTRADA PARA O POVOADO DIAMANTE - LAGOA DOURADA/MG"},null,null,null,"DATA: ",{"$f":"$H$2","v":" AGOSTO / 2023   "}]
[null,"SERVIÇO:  ",{"$f":"VLOOKUP(A166,ORÇAMENTO!$A$10:$I$32,3)","v":"PINTURA DE LIGAÇÃO COM EMULSÃO ASFÁLTICA RR-1C"},null,"SINAPI",{"$f":"VLOOKUP(A166,ORÇAMENTO!$A$10:$I$32,4)","v":96402},"UNIDADE: ","M2"]
[]
[null,"TIPO ITEM","CODIGO ITEM","DESCRIÇÃO ITEM","UNIDADE ITEM","COEFICIENTE","PRECO UNITARIO","CUSTO TOTAL"]
[null,"COMPOSICAO",5839,"VASSOURA MECÂNICA REBOCÁVEL COM ESCOVA CILÍNDRICA, LARGURA ÚTIL DE VARRIMENTO DE 2,44 M","CHP","0,0020000",9.77,{"$f":"ROUNDDOWN(F171*G171,2)","v":0.01}]
[null,"COMPOSICAO",5841,"VASSOURA MECÂNICA REBOCÁVEL COM ESCOVA CILÍNDRICA, LARGURA ÚTIL DE VARRIMENTO DE 2,44 M","CHI","0,0040000",4.6500000000000004,0.01]
[null,"INSUMO",41903,"EMULSAO ASFALTICA CATIONICA RR-2C PARA USO EM PAVIMENTACAO ASFALTICA (FORNECIMENTO COM BDI DIFERENCIADO)","KG","0,4500000",null,0]
[null,"COMPOSICAO",83362,"ESPARGIDOR DE ASFALTO PRESSURIZADO, TANQUE 6 M3 COM ISOLAÇÃO TÉRMICA, AQUECIDO COM 2 MAÇARICOS, COM BARRA ESPARGIDORA 3,60 M, MONTADO SOBRE CAMINHÃO  TOCO, PBT 14.300 KG, POTÊNCIA 185 CV","CHP","0,0004000",232.92,0.09]
[null,"COMPOSICAO",88316,"SERVENTE COM ENCARGOS COMPLEMENTARES","H","0,0055000",19.760000000000002,0.1]
[null,"COMPOSICAO",89035,"TRATOR DE PNEUS, POTÊNCIA 85 CV, TRAÇÃO 4X4, PESO COM LASTRO DE 4.675 KG","CHP","0,0017000",119.96,0.2]
[null,"COMPOSICAO",89036,"TRATOR DE PNEUS, POTÊNCIA 85 CV, TRAÇÃO 4X4, PESO COM LASTRO DE 4.675 KG","CHI","0,0038000",52.19,0.19]
[null,"COMPOSICAO",91486,"ESPARGIDOR DE ASFALTO PRESSURIZADO, TANQUE 6 M3 COM ISOLAÇÃO TÉRMICA, AQUECIDO COM 2 MAÇARICOS, COM BARRA ESPARGIDORA 3,60 M, MONTADO SOBRE CAMINHÃO  TOCO, PBT 14.300 KG, POTÊNCIA 185 CV","CHI","0,0051000",66.180000000000007,0.33]
[{"$nulls":7},0]
[null,"PRODUÇÃO DA EQUIPE",null,null,1,"CUSTO ",null,{"$f":"SUM(H171:H179)","v":0.93000000000000016}]
[null,"TOTAL",{"$nulls":5},{"$f":"H180/E180","v":0.93000000000000016},"OK"]
[null,"BDI                %",{"$nulls":5},{"$f":"1+$M$1","v":1.2467000000000001}]
[null,"TOTAL DO SERVIÇO - R$",{"$nulls":5},{"$f":"ROUND(H181*H182,2)","v":1.1599999999999999}]
[]
[12,"CODEVASF",null,null," COMPOSIÇÃO DE PREÇO UNITÁRIO",null,null,null,{"$f":"H203","v":121.32},{"$f":"H205","v":151.25}]
[null,"OBRA:  ",{"$f":"$C$2","v":" PAVIMENTAÇÃO ASFÁLTICA EM CBUQ - ESTRADA PARA O POVOADO DIAMANTE - LAGOA DOURADA/MG"},null,null,null,"DATA: ",{"$f":"$H$2","v":" AGOSTO / 2023   "}]
[null,"SERVIÇO:  ",{"$f":"VLOOKUP(A185,ORÇAMENTO!$A$10:$I$32,3)","v":"EXECUÇÃO DE PAVIMENTO COM APLICAÇÃO DE CONCRETO ASFÁLTICO USINADO A QUENTE (CBUQ), CAMADA DE ROLAMENTO - EXCLUSIVE TRANSPORTE"},null,"SINAPI",{"$f":"VLOOKUP(A185,ORÇAMENTO!$A$10:$I$32,4)","v":95995},"UNIDADE: ",{"$f":"VLOOKUP(A185,ORÇAMENTO!$A$10:$I$32,5)","v":"M3"}]
[]
[null,"TIPO ITEM","CODIGO ITEM","DESCRIÇÃO ITEM","UNIDADE ITEM","COEFICIENTE","PRECO UNITARIO","CUSTO TOTAL"]
[null,"INSUMO",1518,"CONCRETO BETUMINOSO USINADO A QUENTE (CBUQ) PARA PAVIMENTACAO ASFALTICA, PADRAO DNIT, FAIXA C, COM CAP 50/70 - AQUISICAO POSTO USINA (FORNECIMENTO COM BDI DIFERENCIADO)","T","2,5548000",null,{"$f":"ROUNDDOWN(F190*G190,2)","v":0}]
[null,"COMPOSICAO","5835","VIBROACABADORA DE ASFALTO SOBRE ESTEIRAS, LARGURA DE PAVIMENTAÇÃO 1,90 M A 5,30 M, POTÊNCIA 105 HP CAPACIDADE 450 T/H","CHP","0,0464000","366,49",17]
[null,"COMPOSICAO","5837","VIBROACABADORA DE ASFALTO SOBRE ESTEIRAS, LARGURA DE PAVIMENTAÇÃO 1,90 M A 5,30 M, POTÊNCIA 105 HP CAPACIDADE 450 T/H ","CHI","0,0949000","147,82",14.02]
[null,"COMPOSICAO",88314,"RASTELEIRO COM ENCARGOS COMPLEMENTARES","H","1,1301000","26,52",29.97]
[null,"COMPOSICAO",91386,"CAMINHÃO BASCULANTE 10 M3, TRUCADO CABINE SIMPLES, PESO BRUTO TOTAL 23.000 KG, CARGA ÚTIL MÁXIMA 15.935 KG, DISTÂNCIA ENTRE EIXOS 4,80 M, POTÊNCIA 230 CV INCLUSIVE CAÇAMBA METÁLICA ","CHP","0,0464000","228,50",10.6]
[null,"COMPOSICAO",95631,"ROLO COMPACTADOR VIBRATORIO TANDEM, ACO LISO, POTENCIA 125 HP, PESO SEM/COM LASTRO 10,20/11,65 T, LARGURA DE TRABALHO 1,73 M ","CHP","0,0805000","210,29",16.920000000000002]
[null,"COMPOSICAO",95632,"ROLO COMPACTADOR VIBRATORIO TANDEM, ACO LISO, POTENCIA 125 HP, PESO SEM/COM LASTRO 10,20/11,65 T, LARGURA DE TRABALHO 1,73 M ","CHI","0,0607000","83,23",5.05]
[null,"COMPOSICAO",96155,"TRATOR DE PNEUS COM POTÊNCIA DE 85 CV, TRAÇÃO 4X4, COM VASSOURA MECÂNICA ACOPLADA ","CHI","0,1071000","56,63",6.06]
[null,"COMPOSICAO",96157,"TRATOR DE PNEUS COM POTÊNCIA DE 85 CV, TRAÇÃO 4X4, COM VASSOURA MECÂNICA ACOPLADA","CHP","0,0341000","128,67",4.38]
[null,"COMPOSICAO",96463,"ROLO COMPACTADOR DE PNEUS, ESTATICO, PRESSAO VARIAVEL, POTENCIA 110 HP, PESO SEM/COM LASTRO 10,8/27 T, LARGURA DE ROLAGEM 2,30 M ","CHP","0,0419000","203,13",8.51]
[null,"COMPOSICAO",96464,"ROLO COMPACTADOR DE PNEUS, ESTATICO, PRESSAO VARIAVEL, POTENCIA 110 HP, PESO SEM/COM LASTRO 10,8/27 T, LARGURA DE ROLAGEM 2,30 M ","CHI","0,0990000","89,07",8.81]
[{"$nulls":7},0]
[null,"PRODUÇÃO DA EQUIPE",null,null,1,"CUSTO ",null,{"$f":"SUM(H190:H201)","v":121.32}]
[null,"TOTAL",{"$nulls":5},{"$f":"H202/E202","v":121.32},"OK"]
[null,"BDI                %",{"$nulls":5},{"$f":"1+$M$1","v":1.2467000000000001}]
[null,"TOTAL DO SERVIÇO - R$",{"$nulls":5},{"$f":"ROUND(H203*H204,2)","v":151.25}]
[]
[13,"CODEVASF",null,null," COMPOSIÇÃO DE PREÇO UNITÁRIO",null,null,null,{"$f":"H216","v":1.6099999999999999},{"$f":"H218","v":2.0099999999999998}]
[null,"OBRA:  ",{"$f":"$C$2","v":" PAVIMENTAÇÃO ASFÁLTICA EM CBUQ - ESTRADA PARA O POVOADO DIAMANTE - LAGOA DOURADA/MG"},null,null,null,"DATA: ",{"$f":"$H$2","v":" AGOSTO / 2023   "}]
[null,"SERVIÇO:  ",{"$f":"VLOOKUP(A207,ORÇAMENTO!$A$10:$I$32,3)","v":"TRANSPORTE COM CAMINHÃO BASCULANTE, EM VIA URBANA PAVIMENTADA"},null,"SINAPI",{"$f":"VLOOKUP(A207,ORÇAMENTO!$A$10:$I$32,4)","v":95877},"UNIDADE: ",{"$f":"VLOOKUP(A207,ORÇAMENTO!$A$10:$I$32,5)","v":"M3XKM"}]
[]
[null,"TIPO ITEM","CODIGO ITEM","DESCRIÇÃO ITEM","UNIDADE ITEM","COEFICIENTE","PRECO UNITARIO","CUSTO TOTAL"]
[null,"COMPOSICAO","89883","CAMINHÃO BASCULANTE 18 M3, COM CAVALO MECÂNICO DE CAPACIDADE MÁXIMA DE TRAÇÃO COMBINADO DE 45000 KG, POTÊNCIA 330 CV, INCLUSIVE SEMIREBOQUE COM CAÇAMBA METÁLICA","CHP",4.5999999999999999E-3,"314,64",{"$f":"ROUNDDOWN(F212*G212,2)","v":1.44}]
[null,"COMPOSICAO","89884","CAMINHÃO BASCULANTE 18 M3, COM CAVALO MECÂNICO DE CAPACIDADE MÁXIMA DE TRAÇÃO COMBINADO DE 45000 KG, POTÊNCIA 330 CV, INCLUSIVE SEMIREBOQUE COM CAÇAMBA METÁLICA","CHI",2E-3,"86,36",0.17]
[{"$nulls":7},0]
[null,"PRODUÇÃO DA EQUIPE",null,null,1,"CUSTO ",null,{"$f":"SUM(H212:H214)","v":1.6099999999999999}]
[null,"TOTAL",{"$nulls":5},{"$f":"H215/E215","v":1.6099999999999999},"OK"]
[null,"BDI                %",{"$nulls":5},{"$f":"1+$M$1","v":1.2467000000000001}]
[null,"TOTAL DO SERVIÇO - R$",{"$nulls":5},{"$f":"ROUND(H216*H217,2)","v":2.0099999999999998}]
[]
[14,"CODEVASF",null,null," COMPOSIÇÃO DE PREÇO UNITÁRIO",null,null,null,{"$f":"H229","v":1.92},{"$f":"H231","v":2.39}]
[null,"OBRA:  ",{"$f":"$C$2","v":" PAVIMENTAÇÃO ASFÁLTICA EM CBUQ - ESTRADA PARA O POVOADO DIAMANTE - LAGOA DOURADA/MG"},null,null,null,"DATA: ",{"$f":"$H$2","v":" AGOSTO / 2023   "}]
[null,"SERVIÇO:  ",{"$f":"VLOOKUP(A220,ORÇAMENTO!$A$10:$I$32,3)","v":"TRANSPORTE COM CAMINHÃO CARROCERIA 9T, EM VIA URBANA PAVIMENTADA"},null,"SINAPI",{"$f":"VLOOKUP(A220,ORÇAMENTO!$A$10:$I$32,4)","v":100947},"UNIDADE: ",{"$f":"VLOOKUP(A220,ORÇAMENTO!$A$10:$I$32,5)","v":"TXKM"}]
[]
[null,"TIPO ITEM","CODIGO ITEM","DESCRIÇÃO ITEM","UNIDADE ITEM","COEFICIENTE","PRECO UNITARIO","CUSTO TOTAL"]
[null,"COMPOSICAO","5824","CAMINHÃO TOCO, PBT 16.000 KG, CARGA ÚTIL MÁX. 10.685 KG, DIST. ENTRE EIXOS 4,8 M, POTÊNCIA 189 CV, INCLUSIVE CARROCERIA FIXA ABERTA DE MADEIRA P/ TRANSPORTE GERAL DE CARGA SECA, DIMEN. APROX. 2,5 X 7,00 X 0,50 M ","CHP",9.2999999999999992E-3,"183,71",{"$f":"ROUNDDOWN(F225*G225,2)","v":1.7}]
[null,"COMPOSICAO","5826","CAMINHÃO TOCO, PBT 16.000 KG, CARGA ÚTIL MÁX. 10.685 KG, DIST. ENTRE EIXOS 4,8 M, POTÊNCIA 189 CV, INCLUSIVE CARROCERIA FIXA ABERTA DE MADEIRA P/ TRANSPORTE GERAL DE CARGA SECA, DIMEN. APROX. 2,5 X 7,00 X 0,50 M ","CHI","0,0040000","57,00",0.22]
[{"$nulls":7},0]
[null,"PRODUÇÃO DA EQUIPE",null,null,1,"CUSTO ",null,{"$f":"SUM(H225:H227)","v":1.92}]
[null,"TOTAL",{"$nulls":5},{"$f":"H228/E228","v":1.92},"OK"]
[null,"BDI                %",{"$nulls":5},{"$f":"1+$M$1","v":1.2467000000000001}]
[null,"TOTAL DO SERVIÇO - R$",{"$nulls":5},{"$f":"ROUND(H229*H230,2)","v":2.39}]
[]
[15,"CODEVASF",null,null," COMPOSIÇÃO DE PREÇO UNITÁRIO",null,null,null,{"$f":"H242","v":1.08},{"$f":"H244","v":1.24}]
[null,"OBRA:  ",{"$f":"$C$2","v":" PAVIMENTAÇÃO ASFÁLTICA EM CBUQ - ESTRADA PARA O POVOADO DIAMANTE - LAGOA DOURADA/MG"},null,null,null,"DATA: ",{"$f":"$H$2","v":" AGOSTO / 2023   "}]
[null,"SERVIÇO:  ",{"$f":"VLOOKUP(A233,ORÇAMENTO!$A$10:$I$32,3)","v":"TRANSPORTE DE MASSA ASFÁLTICA COM CAMINHÃO BASCULANTE, EM VIA URBANA PAVIMENTADA (BDI DIFERENCIADO)"},null,"SINAPI",{"$f":"VLOOKUP(A233,ORÇAMENTO!$A$10:$I$32,4)","v":95880},"UNIDADE: ",{"$f":"VLOOKUP(A233,ORÇAMENTO!$A$10:$I$32,5)","v":"TXKM"}]
[]
[null,"TIPO ITEM","CODIGO ITEM","DESCRIÇÃO ITEM","UNIDADE ITEM","COEFICIENTE","PRECO UNITARIO","CUSTO TOTAL"]
[null,"COMPOSICAO","89883","CAMINHÃO BASCULANTE 18 M3, COM CAVALO MECÂNICO DE CAPACIDADE MÁXIMA DE TRAÇÃO COMBINADO DE 45000 KG, POTÊNCIA 330 CV, INCLUSIVE SEMIREBOQUE COM CAÇAMBA METÁLICA","CHP",3.0999999999999999E-3,"314,64",{"$f":"ROUNDDOWN(F238*G238,2)","v":0.97}]
[null,"COMPOSICAO","89884","CAMINHÃO BASCULANTE 18 M3, COM CAVALO MECÂNICO DE CAPACIDADE MÁXIMA DE TRAÇÃO COMBINADO DE 45000 KG, POTÊNCIA 330 CV, INCLUSIVE SEMIREBOQUE COM CAÇAMBA METÁLICA","CHI",1.2999999999999999E-3,"86,36",0.11]
[{"$nulls":7},0]
[null,"PRODUÇÃO DA EQUIPE",null,null,1,"CUSTO ",null,{"$f":"SUM(H238:H240)","v":1.08}]
[null,"TOTAL",{"$nulls":5},{"$f":"H241/E241","v":1.08},"OK"]
[null,"BDI                %",{"$nulls":5},{"$f":"1+$M$2","v":1.1499999999999999}]
[null,"TOTAL DO SERVIÇO - R$",{"$nulls":5},{"$f":"ROUND(H242*H243,2)","v":1.24}]
[]
[15.1,"CODEVASF",null,null," COMPOSIÇÃO DE PREÇO UNITÁRIO",null,null,null,{"$f":"H255","v":0.64999999999999991},{"$f":"H257","v":0.75}]
[null,"OBRA:  ",{"$f":"$C$2","v":" PAVIMENTAÇÃO ASFÁLTICA EM CBUQ - ESTRADA PARA O POVOADO DIAMANTE - LAGOA DOURADA/MG"},null,null,null,"DATA: ",{"$f":"$H$2","v":" AGOSTO / 2023   "}]
[null,"SERVIÇO:  ",{"$f":"VLOOKUP(A246,ORÇAMENTO!$A$10:$I$32,3)","v":"TRANSPORTE COM CAMINHÃO BASCULANTE EM VIA URBANA PAVIMENTADA, ADICIONAL PARA DMT EXCEDENTE A 30 KM  (BDI DIFERENCIADO)"},null,"SINAPI",{"$f":"VLOOKUP(A246,ORÇAMENTO!$A$10:$I$32,4)","v":95427},"UNIDADE: ",{"$f":"VLOOKUP(A246,ORÇAMENTO!$A$10:$I$32,5)","v":"TXKM"}]
[]
[null,"TIPO ITEM","CODIGO ITEM","DESCRIÇÃO ITEM","UNIDADE ITEM","COEFICIENTE","PRECO UNITARIO","CUSTO TOTAL"]
[null,"COMPOSICAO","89883","CAMINHÃO BASCULANTE 18 M3, COM CAVALO MECÂNICO DE CAPACIDADE MÁXIMA DE TRAÇÃO COMBINADO DE 45000 KG, POTÊNCIA 330 CV, INCLUSIVE SEMIREBOQUE COM CAÇAMBA METÁLICA","CHP",1.9E-3,"314,64",{"$f":"ROUNDDOWN(F251*G251,2)","v":0.59}]
[null,"COMPOSICAO","89884","CAMINHÃO BASCULANTE 18 M3, COM CAVALO MECÂNICO DE CAPACIDADE MÁXIMA DE TRAÇÃO COMBINADO DE 45000 KG, POTÊNCIA 330 CV, INCLUSIVE SEMIREBOQUE COM CAÇAMBA METÁLICA","CHI",8.0000000000000004E-4,"86,36",0.06]
[{"$nulls":7},0]
[null,"PRODUÇÃO DA EQUIPE",null,null,1,"CUSTO ",null,{"$f":"SUM(H251:H253)","v":0.64999999999999991}]
[null,"TOTAL",{"$nulls":5},{"$f":"H254/E254","v":0.64999999999999991},"OK"]
[null,"BDI                %",{"$nulls":5},{"$f":"1+$M$2","v":1.1499999999999999}]
[null,"TOTAL DO SERVIÇO - R$",{"$nulls":5},{"$f":"ROUND(H255*H256,2)","v":0.75}]
[]
[16,"CODEVASF",null,null," COMPOSIÇÃO DE PREÇO UNITÁRIO",null,null,null,{"$f":"H267","v":1.2000000000000002},{"$f":"H269","v":1.38}]
[null,"OBRA:  ",{"$f":"$C$2","v":" PAVIMENTAÇÃO ASFÁLTICA EM CBUQ - ESTRADA PARA O POVOADO DIAMANTE - LAGOA DOURADA/MG"},null,null,null,"DATA: ",{"$f":"$H$2","v":" AGOSTO / 2023   "}]
[null,"SERVIÇO:  ",{"$f":"VLOOKUP(A259,ORÇAMENTO!$A$10:$I$32,3)","v":"TRANSPORTE COM CAMINHÃO TANQUE DE TRANSPORTE DE MATERIAL ASFÁLTICO, EM VIA URBANA PAVIMENTADA, DMT ATÉ 30KM (BDI DIFERENCIADO)"},null,"SINAPI",{"$f":"VLOOKUP(A259,ORÇAMENTO!$A$10:$I$32,4)","v":102330},"UNIDADE: ",{"$f":"VLOOKUP(A259,ORÇAMENTO!$A$10:$I$32,5)","v":"TXKM"}]
[]
[null,"TIPO ITEM","CODIGO ITEM","DESCRIÇÃO ITEM","UNIDADE ITEM","COEFICIENTE","PRECO UNITARIO","CUSTO TOTAL"]
[null,"COMPOSICAO","91645","CAMINHÃO DE TRANSPORTE DE MATERIAL ASFÁLTICO 30.000 L, COM CAVALO MECÂNICO DE CAPACIDADE MÁXIMA DE TRAÇÃO COMBINADO DE 66.000 KG, POTÊNCIA 360 CV, INCLUSIVE TANQUE DE ASFALTO COM SERPENTINA ","CHP",2.8E-3,"394,83",{"$f":"ROUNDDOWN(F264*G264,2)","v":1.1000000000000001}]
[null,"COMPOSICAO","91646","CAMINHÃO DE TRANSPORTE DE MATERIAL ASFÁLTICO 30.000 L, COM CAVALO MECÂNICO DE CAPACIDADE MÁXIMA DE TRAÇÃO COMBINADO DE 66.000 KG, POTÊNCIA 360 CV, INCLUSIVE TANQUE DE ASFALTO COM SERPENTINA","CHI",1.1999999999999999E-3,"90,79",0.1]
[null,"PRODUÇÃO DA EQUIPE",null,null,1,"CUSTO ",null,{"$f":"SUM(H264:H265)","v":1.2000000000000002}]
[null,"TOTAL",{"$nulls":5},{"$f":"H266/E266","v":1.2000000000000002},"OK"]
[null,"BDI                %",{"$nulls":5},{"$f":"1+$M$2","v":1.1499999999999999}]
[null,"TOTAL DO SERVIÇO - R$",{"$nulls":5},{"$f":"ROUND(H267*H268,2)","v":1.38}]
[]
[16.100000000000001,"CODEVASF",null,null," COMPOSIÇÃO DE PREÇO UNITÁRIO",null,null,null,{"$f":"H279","v":0.47},{"$f":"H281","v":0.54}]
[null,"OBRA:  ",{"$f":"$C$2","v":" PAVIMENTAÇÃO ASFÁLTICA EM CBUQ - ESTRADA PARA O POVOADO DIAMANTE - LAGOA DOURADA/MG"},null,null,null,"DATA: ",{"$f":"$H$2","v":" AGOSTO / 2023   "}]
[null,"SERVIÇO:  ",{"$f":"VLOOKUP(A271,ORÇAMENTO!$A$10:$I$32,3)","v":"TRANSPORTE COM CAMINHÃO TANQUE DE TRANSPORTE DE MATERIAL ASFÁLTICO, EM VIA URBANA PAVIMENTADA ADICIONAL PARA DMT EXCEDENTE A 30 KM (BDI DIFERENCIADO)"},null,"SINAPI",{"$f":"VLOOKUP(A271,ORÇAMENTO!$A$10:$I$32,4)","v":102331},"UNIDADE: ",{"$f":"VLOOKUP(A271,ORÇAMENTO!$A$10:$I$32,5)","v":"TXKM"}]
[]
[null,"TIPO ITEM","CODIGO ITEM","DESCRIÇÃO ITEM","UNIDADE ITEM","COEFICIENTE","PRECO UNITARIO","CUSTO TOTAL"]
[null,"COMPOSICAO","91645","CAMINHÃO DE TRANSPORTE DE MATERIAL ASFÁLTICO 30.000 L, COM CAVALO MECÂNICO DE CAPACIDADE MÁXIMA DE TRAÇÃO COMBINADO DE 66.000 KG, POTÊNCIA 360 CV, INCLUSIVE TANQUE DE ASFALTO COM SERPENTINA ","CHP","0,0011000","394,83",{"$f":"ROUNDDOWN(F276*G276,2)","v":0.43}]
[null,"COMPOSICAO","91646","CAMINHÃO DE TRANSPORTE DE MATERIAL ASFÁLTICO 30.000 L, COM CAVALO MECÂNICO DE CAPACIDADE MÁXIMA DE TRAÇÃO COMBINADO DE 66.000 KG, POTÊNCIA 360 CV, INCLUSIVE TANQUE DE ASFALTO COM SERPENTINA","CHI","0,0005000","90,79",0.04]
[null,"PRODUÇÃO DA EQUIPE",null,null,1,"CUSTO ",null,{"$f":"SUM(H276:H277)","v":0.47}]
[null,"TOTAL",{"$nulls":5},{"$f":"H278/E278","v":0.47},"OK"]
[null,"BDI                %",{"$nulls":5},{"$f":"1+$M$2","v":1.1499999999999999}]
[null,"TOTAL DO SERVIÇO - R$",{"$nulls":5},{"$f":"ROUND(H279*H280,2)","v":0.54}]
[]
[17,"CODEVASF",null,null," COMPOSIÇÃO DE PREÇO UNITÁRIO",null,null,null,{"$f":"H297","v":4688.6732620886987},{"$f":"H299","v":5845.37}]
[null,"OBRA:  ",{"$f":"$C$2","v":" PAVIMENTAÇÃO ASFÁLTICA EM CBUQ - ESTRADA PARA O POVOADO DIAMANTE - LAGOA DOURADA/MG"},null,null,null,"DATA: ",{"$f":"$H$2","v":" AGOSTO / 2023   "}]
[null,"SERVIÇO:  ",{"$f":"VLOOKUP(A283,ORÇAMENTO!$A$10:$I$32,3)","v":"CAIXA COLETORA DE SARJETA - CCS 01 - COM GRELHA DE FERRO - TCC 02 - AREIA E BRITA COMERCIAIS"},null,"SICRO",2003517,"UNIDADE: ",{"$f":"VLOOKUP(A283,ORÇAMENTO!$A$10:$I$32,5)","v":"UNID"}]
[]
[null,"TIPO ITEM","CODIGO ITEM","DESCRIÇÃO ITEM","UNIDADE ITEM","COEFICIENTE","PRECO UNITARIO","CUSTO TOTAL"]
[null,"INSUMO",568,"CANTONEIRA (ABAS IGUAIS) EM ACO CARBONO, 50,8 MM X 9,53 MM (L X E), 6,99 KG/M","Kg",41.5,{"$f":"59.36/6.99","v":8.4921316165951364},{"$f":"F288*G288","v":352.42346208869816}]
[null,"INSUMO",21009,"TUBO ACO GALVANIZADO COM COSTURA, CLASSE LEVE, DN 20 MM ( 3/4\"), E = 2,25 MM","M",0.14000000000000001,26.92,{"$f":"F289*G289","v":3.7688000000000006}]
[null,"INSUMO",101616,"PREPARO DE FUNDO DE VALA COM LARGURA MENOR QUE 1,5 M (ACERTO DO SOLO NATURAL)","M2",5,6.07,{"$f":"F290*G290","v":30.35}]
[null,"INSUMO",96544,"ARMAÇÃO DE BLOCO, VIGA BALDRAME OU SAPATA UTILIZANDO AÇO CA-50","kg",11.5,17.260000000000002,198.49]
[null,"INSUMO",94964,"CONCRETO FCK = 20MPA, TRAÇO 1:2,7:3 (EM MASSA SECA DE CIMENTO/ AREIA MÉDIA/ BRITA 1) - PREPARO MECÂNICO COM BETONEIRA 400 L.","M³",2.2000000000000002,484.42,1065.7240000000002]
[null,"INSUMO",93358,"ESCAVAÇÃO MANUAL DE VALA COM PROFUNDIDADE MENOR OU IGUAL A 1,30 M","M³",15,78.17,1172.55]
[null,"COMPOSICAO",102727,"FABRICAÇÃO, MONTAGEM E DESMONTAGEM DE FÔRMA PARA BOCA PARA BUEIRO, EM CHAPA DE MADEIRA COMPENSADA RESINADA, E = 17 MM, 2 UTILIZAÇÕES","M²",20.3,91.89,1865.3670000000002]
[{"$nulls":7},{"$f":"ROUNDDOWN(F295*G295,2)","v":0}]
[null,"PRODUÇÃO DA EQUIPE",null,null,1,"CUSTO ",null,{"$f":"SUM(H288:H294)","v":4688.6732620886987}]
[null,"TOTAL",{"$nulls":5},{"$f":"H296/E296","v":4688.6732620886987},"OK"]
[null,"BDI                %",{"$nulls":5},{"$f":"1+$M$1","v":1.2467000000000001}]
[null,"TOTAL DO SERVIÇO - R$",{"$nulls":5},{"$f":"ROUND(H297*H298,2)","v":5845.37}]
[]
[18,"CODEVASF",null,null," COMPOSIÇÃO DE PREÇO UNITÁRIO",null,null,null,{"$f":"H314","v":66.55},{"$f":"H316","v":82.97}]
[null,"OBRA:  ",{"$f":"$C$2","v":" PAVIMENTAÇÃO ASFÁLTICA EM CBUQ - ESTRADA PARA O POVOADO DIAMANTE - LAGOA DOURADA/MG"},null,null,null,"DATA: ",{"$f":"$H$2","v":" AGOSTO / 2023   "}]
[null,"SERVIÇO:  ",{"$f":"VLOOKUP(A301,ORÇAMENTO!$A$10:$I$50,3)","v":"SARJETA TRIANGULAR DE CONCRETO - STC 08 - ESCAVAÇÃO MECÂNICA - AREIA E BRITA COMERCIAIS"},null,"SICRO",{"$f":"VLOOKUP(A301,ORÇAMENTO!$A$10:$I$50,4)","v":"CPU.4"},"UNIDADE: ",{"$f":"VLOOKUP(A301,ORÇAMENTO!$A$10:$I$50,5)","v":"M"}]
[]
[null,"TIPO ITEM","CODIGO ITEM","DESCRIÇÃO ITEM","UNIDADE ITEM","COEFICIENTE","PRECO UNITARIO","CUSTO TOTAL"]
[null,"INSUMO",101616,"PREPARO DE FUNDO DE VALA COM LARGURA MENOR QUE 1,5 M (ACERTO DO SOLO NATURAL)","M2",0.13739999999999999,6.07,{"$f":"ROUNDDOWN(F306*G306,2)","v":0.83}]
[null,"INSUMO",94964,"CONCRETO FCK = 20MPA, TRAÇO 1:2,7:3 (EM MASSA SECA DE CIMENTO/ AREIA MÉDIA/ BRITA 1) - PREPARO MECÂNICO COM BETONEIRA 400 L.","M3",6.6400000000000001E-2,484.42,32.159999999999997]
[null,"INSUMO",2003842,"ENCHIMENTO DE JUNTA DE CONCRETO COM ARGAMASSA ASFÁLTICA DE DENSIDADE 1.700 KG/M³ - ESPESSURA DE 1 CM","KG",9.4100000000000003E-2,60.57,5.69]
[null,"INSUMO",2004519,"ESCAVAÇÃO MECÂNICA DE VALA TRAPEZOIDAL OU TRIANGULAR EM MATERIAL DE 1ª CATEGORIA PARA DRENAGEM SUPERFICIAL COM RETROESCAVADEIRA - 0,10 M² ≤ SEÇÃO < 0,15 M²","M3",0.12139999999999999,26.76,3.24]
[null,"COMPOSICAO",102727,"FABRICAÇÃO, MONTAGEM E DESMONTAGEM DE FÔRMA PARA BOCA PARA BUEIRO, EM CHAPA DE MADEIRA COMPENSADA RESINADA, E = 17 MM, 2 UTILIZAÇÕES","M2",0.2482,91.98,22.82]
[null,"COMPOSICAO",3108022,"GUIA DE MADEIRA DE 2,5 X 8,0 CM - CONFECÇÃO E INSTALAÇÃO","M",0.45800000000000002,3.96,1.81]
[{"$nulls":7},0]
[null,"PRODUÇÃO DA EQUIPE",null,null,1,"CUSTO ",null,{"$f":"SUM(H306:H311)","v":66.55}]
[null,"TOTAL",{"$nulls":5},{"$f":"H313/E313","v":66.55},"OK"]
[null,"BDI                %",{"$nulls":5},{"$f":"1+$M$1","v":1.2467000000000001}]
[null,"TOTAL DO SERVIÇO - R$",{"$nulls":5},{"$f":"ROUND(H314*H315,2)","v":82.97}]
[]
[18.100000000000001,"CODEVASF",null,null," COMPOSIÇÃO DE PREÇO UNITÁRIO",null,null,null,{"$f":"H333","v":6.02},{"$f":"H335","v":7.51}]
[null,"OBRA:  ",{"$f":"$C$2","v":" PAVIMENTAÇÃO ASFÁLTICA EM CBUQ - ESTRADA PARA O POVOADO DIAMANTE - LAGOA DOURADA/MG"},null,null,null,"DATA: ",{"$f":"$H$2","v":" AGOSTO / 2023   "}]
[null,"SERVIÇO:  ",{"$f":"VLOOKUP(A318,ORÇAMENTO!$A$10:$I$48,3)","v":"LOCAÇÃO DE REDE DE ÁGUA OU ESGOTO"},null,"SINAPI",{"$f":"VLOOKUP(A318,ORÇAMENTO!$A$10:$I$52,4)","v":99063},"UNIDADE: ",{"$f":"VLOOKUP(A318,ORÇAMENTO!$A$10:$I$52,5)","v":"M"}]
[]
[null,"TIPO ITEM","CODIGO ITEM","DESCRIÇÃO ITEM","UNIDADE ITEM","COEFICIENTE","PRECO UNITARIO","CUSTO TOTAL"]
[null,"INSUMO","4433","CAIBRO NAO APARELHADO *6 X 6* CM, EM MACARANDUBA OU EQUIV. REGIAO - BRUTA","M",{"$f":"0.05*1.1","v":5.5000000000000007E-2},"42,73",{"$f":"ROUNDDOWN(F323*G323,2)","v":2.35}]
[null,"INSUMO","5068","PREGO DE ACO POLIDO COM CABECA 17 X 21 ","KG",{"$f":"0.05*0.0452","v":2.2599999999999999E-3},"19,23",0.04]
[null,"INSUMO","10567","TABUA *2,5 X 23* CM EM PINUS, MISTA OU EQUIVALENTE DA REGIAO - BRUTA","M",{"$f":"0.05*0.8663","v":4.3314999999999999E-2},"9,83",0.42]
[null,"COMPOSICAO","88239","AJUDANTE DE CARPINTEIRO COM ENCARGOS COMPLEMENTARES","H",{"$f":"0.05*0.8044","v":4.0220000000000006E-2},"21,78",0.87]
[null,"COMPOSICAO","88262","CARPINTEIRO DE FORMAS COM ENCARGOS COMPLEMENTARES","H",{"$f":"0.05*1.6088","v":8.0440000000000011E-2},"27,05",2.17]
[null,"COMPOSICAO","91692","SERRA CIRCULAR DE BANCADA COM MOTOR ELÉTRICO POTÊNCIA DE 5HP, COM COIFA","CHP",{"$f":"0.05*0.0066","v":3.3E-4},"35,13",0.01]
[null,"COMPOSICAO","91693","SERRA CIRCULAR DE BANCADA COM MOTOR ELÉTRICO POTÊNCIA DE 5HP, COM COIFA","CHI",{"$f":"0.05*0.0289","v":1.4450000000000001E-3},"33,81",0.04]
[null,"COMPOSICAO","99062","MARCAÇÃO DE PONTOS EM GABARITO OU CAVALETE","UN",{"$f":"0.05*1","v":0.05},"2,50",0.12]
[{"$nulls":7},0]
[null,"PRODUÇÃO DA EQUIPE",null,null,1,"CUSTO ",null,{"$f":"SUM(H323:H330)","v":6.02}]
[null,"TOTAL",{"$nulls":5},{"$f":"H332/E332","v":6.02},"OK"]
[null,"BDI                %",{"$nulls":5},{"$f":"1+$M$1","v":1.2467000000000001}]
[null,"TOTAL DO SERVIÇO - R$",{"$nulls":5},{"$f":"ROUND(H333*H334,2)","v":7.51}]
[]
[18.2,"CODEVASF",null,null," COMPOSIÇÃO DE PREÇO UNITÁRIO",null,null,null,{"$f":"H347","v":8.870000000000001},{"$f":"H349","v":11.06}]
[null,"OBRA:  ",{"$f":"$C$2","v":" PAVIMENTAÇÃO ASFÁLTICA EM CBUQ - ESTRADA PARA O POVOADO DIAMANTE - LAGOA DOURADA/MG"},null,null,null,"DATA: ",{"$f":"$H$2","v":" AGOSTO / 2023   "}]
[null,"SERVIÇO:  ",{"$f":"VLOOKUP(A337,ORÇAMENTO!$A$10:$I$48,3)","v":"ESCAVAÇÃO MECANIZADA DE VALA COM PROFUNDIDADE ATÉ 1,5 M, EM SOLO DE 1A CATEGORIA"},null,"SINAPI",{"$f":"VLOOKUP(A337,ORÇAMENTO!$A$10:$I$52,4)","v":90105},"UNIDADE: ",{"$f":"VLOOKUP(A337,ORÇAMENTO!$A$10:$I$52,5)","v":"M3"}]
[]
[null,"TIPO ITEM","CODIGO ITEM","DESCRIÇÃO ITEM","UNIDADE ITEM","COEFICIENTE","PRECO UNITARIO","CUSTO TOTAL"]
[null,"COMPOSICAO","5678","RETROESCAVADEIRA SOBRE RODAS COM CARREGADEIRA, TRAÇÃO 4X4, POTÊNCIA LÍQ. 88 HP, CAÇAMBA CARREG. CAP. MÍN. 1 M3, CAÇAMBA RETRO CAP. 0,26 M3, PESO OPERACIONAL MÍN. 6.674 KG, PROFUNDIDADE ESCAVAÇÃO MÁX. 4,37 M","CHP",3.2399999999999998E-2,"144,90",{"$f":"ROUNDDOWN(F342*G342,2)","v":4.6900000000000004}]
[null,"COMPOSICAO","5679","RETROESCAVADEIRA SOBRE RODAS COM CARREGADEIRA, TRAÇÃO 4X4, POTÊNCIA LÍQ. 88 HP, CAÇAMBA CARREG. CAP. MÍN. 1 M3, CAÇAMBA RETRO CAP. 0,26 M3, PESO OPERACIONAL MÍN. 6.674 KG, PROFUNDIDADE ESCAVAÇÃO MÁX. 4,37 M","CHI",3.9199999999999999E-2,"70,73",2.77]
[null,"COMPOSICAO","88316","SERVENTE COM ENCARGOS COMPLEMENTARES","H",7.17E-2,"19,76",1.41]
[{"$nulls":7},0]
[null,"PRODUÇÃO DA EQUIPE",null,null,1,"CUSTO ",null,{"$f":"SUM(H342:H344)","v":8.870000000000001}]
[null,"TOTAL",{"$nulls":5},{"$f":"H346/E346","v":8.870000000000001},"OK"]
[null,"BDI                %",{"$nulls":5},{"$f":"1+$M$1","v":1.2467000000000001}]
[null,"TOTAL DO SERVIÇO - R$",{"$nulls":5},{"$f":"ROUND(H347*H348,2)","v":11.06}]
[]
[18.3,"CODEVASF",null,null," COMPOSIÇÃO DE PREÇO UNITÁRIO",null,null,null,{"$f":"H362","v":6.07},{"$f":"H364","v":7.57}]
[null,"OBRA:  ",{"$f":"$C$2","v":" PAVIMENTAÇÃO ASFÁLTICA EM CBUQ - ESTRADA PARA O POVOADO DIAMANTE - LAGOA DOURADA/MG"},null,null,null,"DATA: ",{"$f":"$H$2","v":" AGOSTO / 2023   "}]
[null,"SERVIÇO:  ",{"$f":"VLOOKUP(A351,ORÇAMENTO!$A$10:$I$48,3)","v":"PREPARO DE FUNDO DE VALA COM LARGURA MENOR QUE 1,5 M (ACERTO DO SOLO NATURAL)"},null,"SINAPI",{"$f":"VLOOKUP(A351,ORÇAMENTO!$A$10:$I$52,4)","v":101616},"UNIDADE: ",{"$f":"VLOOKUP(A351,ORÇAMENTO!$A$10:$I$52,5)","v":"M2"}]
[]
[null,"TIPO ITEM","CODIGO ITEM","DESCRIÇÃO ITEM","UNIDADE ITEM","COEFICIENTE","PRECO UNITARIO","CUSTO TOTAL"]
[null,"COMPOSICAO","88309","PEDREIRO COM ENCARGOS COMPLEMENTARES","H","0,1020000","27,45",{"$f":"ROUNDDOWN(F356*G356,2)","v":2.79}]
[null,"COMPOSICAO","88316","SERVENTE COM ENCARGOS COMPLEMENTARES","H","0,1531000","19,76",3.02]
[null,"COMPOSICAO","91533","COMPACTADOR DE SOLOS DE PERCUSSÃO (SOQUETE) COM MOTOR A GASOLINA 4 TEMPOS, POTÊNCIA 4 CV","CHP","0,0036000","40,60",0.14000000000000001]
[null,"COMPOSICAO","91534","COMPACTADOR DE SOLOS DE PERCUSSÃO (SOQUETE) COM MOTOR A GASOLINA 4 TEMPOS, POTÊNCIA 4 CV","CHI","0,0036000","34,40",0.12]
[{"$nulls":7},0]
[null,"PRODUÇÃO DA EQUIPE",null,null,1,"CUSTO ",null,{"$f":"SUM(H356:H359)","v":6.07}]
[null,"TOTAL",{"$nulls":5},{"$f":"H361/E361","v":6.07},"OK"]
[null,"BDI                %",{"$nulls":5},{"$f":"1+$M$1","v":1.2467000000000001}]
[null,"TOTAL DO SERVIÇO - R$",{"$nulls":5},{"$f":"ROUND(H362*H363,2)","v":7.57}]
[]
[18.399999999999999,"CODEVASF",null,null," COMPOSIÇÃO DE PREÇO UNITÁRIO",null,null,null,{"$f":"H378","v":26.669999999999998},{"$f":"H380","v":33.25}]
[null,"OBRA:  ",{"$f":"$C$2","v":" PAVIMENTAÇÃO ASFÁLTICA EM CBUQ - ESTRADA PARA O POVOADO DIAMANTE - LAGOA DOURADA/MG"},null,null,null,"DATA: ",{"$f":"$H$2","v":" AGOSTO / 2023   "}]
[null,"SERVIÇO:  ",{"$f":"VLOOKUP(A366,ORÇAMENTO!$A$10:$I$48,3)","v":"ESCORAMENTO DE VALA, TIPO PONTALETEAMENTO"},null,"SINAPI",{"$f":"VLOOKUP(A366,ORÇAMENTO!$A$10:$I$52,4)","v":101570},"UNIDADE: ",{"$f":"VLOOKUP(A366,ORÇAMENTO!$A$10:$I$52,5)","v":"M2"}]
[]
[null,"TIPO ITEM","CODIGO ITEM","DESCRIÇÃO ITEM","UNIDADE ITEM","COEFICIENTE","PRECO UNITARIO","CUSTO TOTAL"]
[null,"INSUMO","5061","PREGO DE ACO POLIDO COM CABECA 18 X 27 (2 1/2 X 10)","KG","0,0096000","18,90",{"$f":"ROUNDDOWN(F371*G371,2)","v":0.18}]
[null,"INSUMO","6189","TABUA NAO APARELHADA *2,5 X 30* CM, EM MACARANDUBA, ANGELIM OU EQUIVALENTE DA REGIAO - BRUTA","M","0,2173000","45,06",9.7899999999999991]
[null,"INSUMO","21138","MOURAO ROLICO DE MADEIRA TRATADA, D = 8 A 11 CM, H = 2,20 M, EM EUCALIPTO OU EQUIVALENTE DA REGIAO (PARA CERCA)","M","0,0543000","7,68",0.41]
[null,"COMPOSICAO","88262","CARPINTEIRO DE FORMAS COM ENCARGOS COMPLEMENTARES","H","0,4591000","27,05",12.41]
[null,"COMPOSICAO","88316","SERVENTE COM ENCARGOS COMPLEMENTARES","H","0,1967000","19,76",3.88]
[{"$nulls":7},0]
[null,"PRODUÇÃO DA EQUIPE",null,null,1,"CUSTO ",null,{"$f":"SUM(H371:H375)","v":26.669999999999998}]
[null,"TOTAL",{"$nulls":5},{"$f":"H377/E377","v":26.669999999999998},"OK"]
[null,"BDI                %",{"$nulls":5},{"$f":"1+$M$1","v":1.2467000000000001}]
[null,"TOTAL DO SERVIÇO - R$",{"$nulls":5},{"$f":"ROUND(H378*H379,2)","v":33.25}]
[]
[18.5,"CODEVASF",null,null," COMPOSIÇÃO DE PREÇO UNITÁRIO",null,null,null,{"$f":"H395","v":195.12999999999994},{"$f":"H397","v":243.27}]
[null,"OBRA:  ",{"$f":"$C$2","v":" PAVIMENTAÇÃO ASFÁLTICA EM CBUQ - ESTRADA PARA O POVOADO DIAMANTE - LAGOA DOURADA/MG"},null,null,null,"DATA: ",{"$f":"$H$2","v":" AGOSTO / 2023   "}]
[null,"SERVIÇO:  ",{"$f":"VLOOKUP(A382,ORÇAMENTO!$A$10:$I$48,3)","v":"TUBO DE CONCRETO PARA REDES COLETORAS DE ÁGUAS PLUVIAIS, DIÂMETRO DE 400 MM, JUNTA RÍGIDA - FORNECIMENTO E ASSENTAMENTO"},null,"SINAPI",{"$f":"VLOOKUP(A382,ORÇAMENTO!$A$10:$I$52,4)","v":92210},"UNIDADE: ",{"$f":"VLOOKUP(A382,ORÇAMENTO!$A$10:$I$52,5)","v":"M"}]
[]
[null,"TIPO ITEM","CODIGO ITEM","DESCRIÇÃO ITEM","UNIDADE ITEM","COEFICIENTE","PRECO UNITARIO","CUSTO TOTAL"]
[null,"COMPOSICAO",5678,"RETROESCAVADEIRA SOBRE RODAS COM CARREGADEIRA, TRAÇÃO 4X4, POTÊNCIA LÍQ. 88 HP, CAÇAMBA CARREG. CAP. MÍN. 1 M3, CAÇAMBA RETRO CAP. 0,26 M3","CHP","0,0740000","207,13",{"$f":"ROUNDDOWN(F387*G387,2)","v":15.32}]
[null,"COMPOSICAO",5679,"RETROESCAVADEIRA SOBRE RODAS COM CARREGADEIRA, TRAÇÃO 4X4, POTÊNCIA LÍQ. 88 HP, CAÇAMBA CARREG. CAP. MÍN. 1 M3, CAÇAMBA RETRO CAP. 0,26 M3","CHI","0,1550000","95,48",14.79]
[null,"INSUMO","7745","TUBO DE CONCRETO ARMADO PARA AGUAS PLUVIAIS, CLASSE PA-1, COM ENCAIXE PONTA E BOLSA, DIAMETRO NOMINAL DE 400 MM","M","1,0300000","134,88",138.91999999999999]
[null,"COMPOSICAO","88246","ASSENTADOR DE TUBOS COM ENCARGOS COMPLEMENTARES","H","0,3460000","32,20",11.14]
[null,"COMPOSICAO","88316","SERVENTE COM ENCARGOS COMPLEMENTARES","H","0,6920000","19,76",13.67]
[null,"COMPOSICAO",88629,"ARGAMASSA TRAÇO 1:3 (EM VOLUME DE CIMENTO E AREIA MÉDIA ÚMIDA), PREPARO MANUAL. AF_08/2019","M3",2E-3,"645,53",1.29]
[{"$nulls":7},0]
[null,"PRODUÇÃO DA EQUIPE",null,null,1,"CUSTO ",null,{"$f":"SUM(H387:H393)","v":195.12999999999994}]
[null,"TOTAL",{"$nulls":5},{"$f":"H394/E394","v":195.12999999999994},"OK"]
[null,"BDI                %",{"$nulls":5},{"$f":"1+$M$1","v":1.2467000000000001}]
[null,"TOTAL DO SERVIÇO - R$",{"$nulls":5},{"$f":"ROUND(H395*H396,2)","v":243.27}]
[]
[18.600000000000001,"CODEVASF",null,null," COMPOSIÇÃO DE PREÇO UNITÁRIO",null,null,null,{"$f":"H407","v":265.52},{"$f":"H409","v":331.02}]
[null,"OBRA:  ",{"$f":"$C$2","v":" PAVIMENTAÇÃO ASFÁLTICA EM CBUQ - ESTRADA PARA O POVOADO DIAMANTE - LAGOA DOURADA/MG"},null,null,null,"DATA: ",{"$f":"$H$2","v":" AGOSTO / 2023   "}]
[null,"SERVIÇO:  ",{"$f":"VLOOKUP(A399,ORÇAMENTO!$A$10:$I$48,3)","v":"DISSIPADOR DE ENERGIA - DES 01 - AREIA E PEDRA DE MÃO COMERCIAIS"},null,"SICRO",{"$f":"VLOOKUP(A399,ORÇAMENTO!$A$10:$I$52,4)","v":2003441},"UNIDADE: ",{"$f":"VLOOKUP(A399,ORÇAMENTO!$A$10:$I$52,5)","v":"UNID"}]
[]
[null,"TIPO ITEM","CODIGO ITEM","DESCRIÇÃO ITEM","UNIDADE ITEM","COEFICIENTE","PRECO UNITARIO","CUSTO TOTAL"]
[null,"INSUMO",93358,"ESCAVAÇÃO MANUAL DE VALA COM PROFUNDIDADE MENOR OU IGUAL A 1,30 M","M3",0.33,78.17,{"$f":"ROUNDDOWN(F404*G404,2)","v":25.79}]
[null,"INSUMO",103800,"PEDRA ARGAMASSADA COM CIMENTO E AREIA 1:3 - AREIA E PEDRA DE MÃO COMERCIAL - FORNECIMENTO E ASSENTAMENTO","M3",0.48,499.44,239.73]
[null,"PRODUÇÃO DA EQUIPE",null,null,1,"CUSTO ",null,{"$f":"SUM(H404:H405)","v":265.52}]
[null,"TOTAL",{"$nulls":5},{"$f":"H406/E406","v":265.52},"OK"]
[null,"BDI                %",{"$nulls":5},{"$f":"1+$M$1","v":1.2467000000000001}]
[null,"TOTAL DO SERVIÇO - R$",{"$nulls":5},{"$f":"ROUND(H407*H408,2)","v":331.02}]
[]
[18.7,"CODEVASF",null,null," COMPOSIÇÃO DE PREÇO UNITÁRIO",null,null,null,{"$f":"H422","v":843.56000000000006},{"$f":"H424","v":1051.67}]
[null,"OBRA:  ",{"$f":"$C$2","v":" PAVIMENTAÇÃO ASFÁLTICA EM CBUQ - ESTRADA PARA O POVOADO DIAMANTE - LAGOA DOURADA/MG"},null,null,null,"DATA: ",{"$f":"$H$2","v":" AGOSTO / 2023   "}]
[null,"SERVIÇO:  ",{"$f":"VLOOKUP(A411,ORÇAMENTO!$A$10:$I$48,3)","v":"DESCIDA D'ÁGUA DE ATERROS EM DEGRAUS - DAD 03/04 (PADRÃO DNIT)"},null,"SINAPI",{"$f":"VLOOKUP(A411,ORÇAMENTO!$A$10:$I$52,4)","v":"CPU.5"},"UNIDADE: ",{"$f":"VLOOKUP(A411,ORÇAMENTO!$A$10:$I$52,5)","v":"UNID"}]
[]
[null,"TIPO ITEM","CODIGO ITEM","DESCRIÇÃO ITEM","UNIDADE ITEM","COEFICIENTE","PRECO UNITARIO","CUSTO TOTAL"]
[null,"COMPOSIÇÃO",94969,"CONCRETO FCK = 15MPA, TRAÇO 1:3,4:3,5 (EM MASSA SECA DE CIMENTO/ AREIA MÉDIA/ BRITA 1) - PREPARO MECÂNICO COM BETONEIRA 600 L","M3",0.99,434.71,{"$f":"ROUNDDOWN(F416*G416,2)","v":430.36}]
[null,"COMPOSIÇÃO",97086,"FABRICAÇÃO, MONTAGEM E DESMONTAGEM DE FORMA PARA RADIER, PISO DE CONCRETO OU LAJE SOBRE SOLO, EM MADEIRA SERRADA, 4 UTILIZAÇÕES","M2",1.77,144.26,{"$f":"ROUNDDOWN(F417*G417,2)","v":255.34}]
[null,"COMPOSIÇÃO",93358,"ESCAVAÇÃO MANUAL DE VALA COM PROFUNDIDADE MENOR OU IGUAL A 1,30 M","M3",0.54,78.17,{"$f":"ROUNDDOWN(F418*G418,2)","v":42.21}]
[null,"COMPOSICAO",92800,"CORTE E DOBRA DE AÇO CA-60, DIÂMETRO DE 5,0MM","M3",11.96,9.67,115.65]
[{"$nulls":7},0]
[null,"PRODUÇÃO DA EQUIPE",null,null,1,"CUSTO ",null,{"$f":"SUM(H416:H419)","v":843.56000000000006}]
[null,"TOTAL",{"$nulls":5},{"$f":"H421/E421","v":843.56000000000006},"OK"]
[null,"BDI                %",{"$nulls":5},{"$f":"1+$M$1","v":1.2467000000000001}]
[null,"TOTAL DO SERVIÇO - R$",{"$nulls":5},{"$f":"ROUND(H422*H423,2)","v":1051.67}]
[]
[18.8,"CODEVASF",null,null," COMPOSIÇÃO DE PREÇO UNITÁRIO",null,null,null,{"$f":"H437","v":34.64},{"$f":"H439","v":43.19}]
[null,"OBRA:  ",{"$f":"$C$2","v":" PAVIMENTAÇÃO ASFÁLTICA EM CBUQ - ESTRADA PARA O POVOADO DIAMANTE - LAGOA DOURADA/MG"},null,null,null,"DATA: ",{"$f":"$H$2","v":" AGOSTO / 2023   "}]
[null,"SERVIÇO:  ",{"$f":"VLOOKUP(A426,ORÇAMENTO!$A$10:$I$48,3)","v":"REATERRO MANUAL DE VALAS COM COMPACTAÇÃO MECANIZADA"},null,"SINAPI",{"$f":"VLOOKUP(A426,ORÇAMENTO!$A$10:$I$52,4)","v":93382},"UNIDADE: ",{"$f":"VLOOKUP(A426,ORÇAMENTO!$A$10:$I$52,5)","v":"M3"}]
[]
[null,"TIPO ITEM","CODIGO ITEM","DESCRIÇÃO ITEM","UNIDADE ITEM","COEFICIENTE","PRECO UNITARIO","CUSTO TOTAL"]
[null,"COMPOSIÇÃO",95606,"UMIDIFICAÇÃO DE MATERIAL PARA VALAS COM CAMINHÃO PIPA 10000L. AF_11/2016","M3",1,1.95,{"$f":"ROUNDDOWN(F431*G431,2)","v":1.95}]
[null,"COMPOSICAO","88316","SERVENTE COM ENCARGOS COMPLEMENTARES","H",0.65,19.760000000000002,12.84]
[null,"COMPOSICAO","91533","COMPACTADOR DE SOLOS DE PERCUSSÃO (SOQUETE) COM MOTOR A GASOLINA 4 TEMPOS, POTÊNCIA 4 CV","CHP","0,2740000",40.6,11.12]
[null,"COMPOSICAO","91534","COMPACTADOR DE SOLOS DE PERCUSSÃO (SOQUETE) COM MOTOR A GASOLINA 4 TEMPOS, POTÊNCIA 4 CV","CHI","0,2540000",34.4,8.73]
[{"$nulls":7},0]
[null,"PRODUÇÃO DA EQUIPE",null,null,1,"CUSTO ",null,{"$f":"SUM(H431:H434)","v":34.64}]
[null,"TOTAL",{"$nulls":5},{"$f":"H436/E436","v":34.64},"OK"]
[null,"BDI                %",{"$nulls":5},{"$f":"1+$M$1","v":1.2467000000000001}]
[null,"TOTAL DO SERVIÇO - R$",{"$nulls":5},{"$f":"ROUND(H437*H438,2)","v":43.19}]
[]
[19,"CODEVASF",null,null," COMPOSIÇÃO DE PREÇO UNITÁRIO",null,null,null,{"$f":"H452","v":264.51},{"$f":"H454","v":329.76}]
[null,"OBRA:  ",{"$f":"$C$2","v":" PAVIMENTAÇÃO ASFÁLTICA EM CBUQ - ESTRADA PARA O POVOADO DIAMANTE - LAGOA DOURADA/MG"},null,null,null,"DATA: ",{"$f":"$H$2","v":" AGOSTO / 2023   "}]
[null,"SERVIÇO:  ",{"$f":"VLOOKUP(A441,ORÇAMENTO!$A$10:$I$48,3)","v":"PLACA DE REGULAMENTAÇÃO EM AÇO D = 0,60 M - PELÍCULA RETRORREFLETIVA TIPO I + SI - FORNECIMENTO E IMPLANTAÇÃO"},null,"SICRO",{"$f":"VLOOKUP(A441,ORÇAMENTO!$A$10:$I$52,4)","v":5213440},"UNIDADE: ",{"$f":"VLOOKUP(A441,ORÇAMENTO!$A$10:$I$52,5)","v":"UN."}]
[]
[null,"TIPO ITEM","CODIGO ITEM","DESCRIÇÃO ITEM","UNIDADE ITEM","COEFICIENTE","PRECO UNITARIO","CUSTO TOTAL"]
[null,"INSUMO","5824","CAMINHÃO TOCO, PBT 16.000 KG, CARGA ÚTIL MÁX. 10.685 KG, DIST. ENTRE EIXOS 4,8 M, POTÊNCIA 189 CV, INCLUSIVE CARROCERIA FIXA ABERTA DE MADEIRA P/ TRANSPORTE GERAL DE CARGA SECA","CHP",{"$f":"0.3/3","v":9.9999999999999992E-2},183.71,{"$f":"ROUNDDOWN(F446*G446,2)","v":18.37}]
[null,"INSUMO","5826","CAMINHÃO TOCO, PBT 16.000 KG, CARGA ÚTIL MÁX. 10.685 KG, DIST. ENTRE EIXOS 4,8 M, POTÊNCIA 189 CV, INCLUSIVE CARROCERIA FIXA ABERTA DE MADEIRA P/ TRANSPORTE GERAL DE CARGA SECA","CHI",{"$f":"0.7/3","v":0.23333333333333331},57,13.3]
[null,"INSUMO",88277,"MONTADOR (TUBO AÇO/EQUIPAMENTOS) COM ENCARGOS COMPLEMENTARES","H",{"$f":"1/3","v":0.33333333333333331},35.44,11.81]
[null,"INSUMO",88316,"SERVENTE  COM ENCARGOS COMPLEMENTARES","H",{"$f":"2/3","v":0.66666666666666663},19.760000000000002,13.17]
[null,"INSUMO",34723,"PLACA DE SINALIZACAO EM CHAPA DE ACO NUM 16 COM PINTURA REFLETIVA","M2",0.35993999999999998,577.5,{"$f":"ROUNDDOWN(F450*G450,2)","v":207.86}]
[null,"PRODUÇÃO DA EQUIPE",null,null,1,"CUSTO ",null,{"$f":"SUM(H446:H450)","v":264.51}]
[null,"TOTAL",{"$nulls":5},{"$f":"H451/E451","v":264.51},"OK"]
[null,"BDI                %",{"$nulls":5},{"$f":"1+$M$1","v":1.2467000000000001}]
[null,"TOTAL DO SERVIÇO - R$",{"$nulls":5},{"$f":"ROUND(H452*H453,2)","v":329.76}]
[]
[20,"CODEVASF",null,null," COMPOSIÇÃO DE PREÇO UNITÁRIO",null,null,null,{"$f":"H467","v":264.51},{"$f":"H469","v":329.76}]
[null,"OBRA:  ",{"$f":"$C$2","v":" PAVIMENTAÇÃO ASFÁLTICA EM CBUQ - ESTRADA PARA O POVOADO DIAMANTE - LAGOA DOURADA/MG"},null,null,null,"DATA: ",{"$f":"$H$2","v":" AGOSTO / 2023   "}]
[null,"SERVIÇO:  ",{"$f":"VLOOKUP(A456,ORÇAMENTO!$A$10:$I$48,3)","v":"PLACA DE ADVERTÊNCIA EM AÇO, LADO DE 0,60 M - PELÍCULA \nRETRORREFLETIVA TIPO I + SI - FORNECIMENTO E IMPLANTAÇÃO "},null,"SICRO",{"$f":"VLOOKUP(A456,ORÇAMENTO!$A$10:$I$52,4)","v":5213464},"UNIDADE: ","UN."]
[]
[null,"TIPO ITEM","CODIGO ITEM","DESCRIÇÃO ITEM","UNIDADE ITEM","COEFICIENTE","PRECO UNITARIO","CUSTO TOTAL"]
[null,"COMPOSICAO","5824","CAMINHÃO TOCO, PBT 16.000 KG, CARGA ÚTIL MÁX. 10.685 KG, DIST. ENTRE EIXOS 4,8 M, POTÊNCIA 189 CV, INCLUSIVE CARROCERIA FIXA ABERTA DE MADEIRA P/ TRANSPORTE GERAL DE CARGA SECA, DIMEN. APROX. 2,5 X 7,00 X 0,50 M ","CHP",{"$f":"0.3/3","v":9.9999999999999992E-2},183.71,{"$f":"ROUNDDOWN(F461*G461,2)","v":18.37}]
[null,"COMPOSICAO","5826","CAMINHÃO TOCO, PBT 16.000 KG, CARGA ÚTIL MÁX. 10.685 KG, DIST. ENTRE EIXOS 4,8 M, POTÊNCIA 189 CV, INCLUSIVE CARROCERIA FIXA ABERTA DE MADEIRA P/ TRANSPORTE GERAL DE CARGA SECA, DIMEN. APROX. 2,5 X 7,00 X 0,50 M ","CHI",{"$f":"0.7/3","v":0.23333333333333331},57,13.3]
[null,"COMPOSICAO",88277,"MONTADOR (TUBO AÇO/EQUIPAMENTOS) COM ENCARGOS COMPLEMENTARES","H",{"$f":"1/3","v":0.33333333333333331},35.44,11.81]
[null,"COMPOSICAO",88316,"SERVENTE  COM ENCARGOS COMPLEMENTARES","H",{"$f":"2/3","v":0.66666666666666663},19.760000000000002,13.17]
[null,"COMPOSICAO",34723,"PLACA DE SINALIZACAO EM CHAPA DE ACO NUM 16 COM PINTURA REFLETIVA","M2",0.35993999999999998,577.5,{"$f":"ROUNDDOWN(F465*G465,2)","v":207.86}]
[null,"PRODUÇÃO DA EQUIPE",null,null,1,"CUSTO ",null,{"$f":"SUM(H461:H465)","v":264.51}]
[null,"TOTAL",{"$nulls":5},{"$f":"H466/E466","v":264.51},"OK"]
[null,"BDI                %",{"$nulls":5},{"$f":"1+$M$1","v":1.2467000000000001}]
[null,"TOTAL DO SERVIÇO - R$",{"$nulls":5},{"$f":"ROUND(H467*H468,2)","v":329.76}]
[]
[21,"CODEVASF",null,null," COMPOSIÇÃO DE PREÇO UNITÁRIO",null,null,null,{"$f":"H488","v":225.70999999999998},{"$f":"H490","v":281.39}]
[null,"OBRA:  ",{"$f":"$C$2","v":" PAVIMENTAÇÃO ASFÁLTICA EM CBUQ - ESTRADA PARA O POVOADO DIAMANTE - LAGOA DOURADA/MG"},null,null,null,"DATA: ",{"$f":"$H$2","v":" AGOSTO / 2023   "}]
[null,"SERVIÇO:  ",{"$f":"VLOOKUP(A471,ORÇAMENTO!$A$10:$I$48,3)","v":"SUPORTE PARA PLACA DE SINALIZAÇÃO EM MADEIRA DE LEI TRATADA 8 X 8 CM - FORNECIMENTO E IMPLANTAÇÃO"},null,"SICRO",{"$f":"VLOOKUP(A471,ORÇAMENTO!$A$10:$I$52,4)","v":5216111},"UNIDADE: ","UN."]
[]
[null,"TIPO ITEM","CODIGO ITEM","DESCRIÇÃO ITEM","UNIDADE ITEM","COEFICIENTE","PRECO UNITARIO","CUSTO TOTAL"]
[null,"INSUMO","5824","CAMINHÃO TOCO, PBT 16.000 KG, CARGA ÚTIL MÁX. 10.685 KG, DIST. ENTRE EIXOS 4,8 M, POTÊNCIA 189 CV, INCLUSIVE CARROCERIA FIXA ABERTA DE MADEIRA P/ TRANSPORTE GERAL DE CARGA SECA, DIMEN. APROX. 2,5 X 7,00 X 0,50 M ","CHP",{"$f":"0.3/4","v":7.4999999999999997E-2},183.71,{"$f":"ROUNDDOWN(F476*G476,2)","v":13.77}]
[null,"INSUMO","5826","CAMINHÃO TOCO, PBT 16.000 KG, CARGA ÚTIL MÁX. 10.685 KG, DIST. ENTRE EIXOS 4,8 M, POTÊNCIA 189 CV, INCLUSIVE CARROCERIA FIXA ABERTA DE MADEIRA P/ TRANSPORTE GERAL DE CARGA SECA, DIMEN. APROX. 2,5 X 7,00 X 0,50 M ","CHI",{"$f":"0.7/4","v":0.17499999999999999},57,9.9700000000000006]
[null,"INSUMO",88262,"CARPINTEIRO DE FORMAS COM ENCARGOS COMPLEMENTARES","H",{"$f":"1/4","v":0.25},30.59,7.64]
[null,"INSUMO",88310,"PINTOR COM ENCARGOS COMPLEMENTARES","H",{"$f":"0.5/4","v":0.125},28.66,3.58]
[null,"INSUMO",88316,"SERVENTE COM ENCARGOS COMPLEMENTARES","H",1,19.760000000000002,19.760000000000002]
[null,"INSUMO","M0789","Conjunto para fixação de placas em aço galvanizado composto por barra chata, abraçadeira, parafusos, porcas e arruelas","Kg",0.69699999999999995,23.997399999999999,{"$f":"ROUNDDOWN(F481*G481,2)","v":16.72}]
[null,"INSUMO",20209,"CAIBRO APARELHADO *7,5 X 7,5* CM, EM MACARANDUBA, ANGELIM OU EQUIVALENTE","M",3,44.6,133.80000000000001]
[null,"INSUMO",7311,"TINTA ESMALTE SINTETICO PREMIUM ACETINADO","L",0.25622,44.48,11.39]
[null,"INSUMO",102487,"CONCRETO CICLÓPICO FCK = 15MPA, 30% PEDRA DE MÃO EM VOLUME REAL, INCLUSIVE LANÇAMENTO","M³",3.7499999999999999E-3,576.04,2.16]
[null,"INSUMO",93358,"ESCAVAÇÃO MANUAL DE VALA COM PROFUNDIDADE MENOR OU IGUAL A 1,30 M","M³",5.6550000000000003E-2,78.17,4.42]
[null,"INSUMO",96995,"REATERRO MANUAL APILOADO COM SOQUETE","M³",5.28E-2,47.39,2.5]
[null,"PRODUÇÃO DA EQUIPE",null,null,1,"CUSTO ",null,{"$f":"SUM(H476:H486)","v":225.70999999999998}]
[null,"TOTAL",{"$nulls":5},{"$f":"H487/E487","v":225.70999999999998},"OK"]
[null,"BDI                %",{"$nulls":5},{"$f":"1+$M$1","v":1.2467000000000001}]
[null,"TOTAL DO SERVIÇO - R$",{"$nulls":5},{"$f":"ROUND(H488*H489,2)","v":281.39}]
[]
[22,"CODEVASF",null,null," COMPOSIÇÃO DE PREÇO UNITÁRIO",null,null,null,{"$f":"H506","v":5.5500000000000007},{"$f":"H508","v":6.92}]
[null,"OBRA:  ",{"$f":"$C$2","v":" PAVIMENTAÇÃO ASFÁLTICA EM CBUQ - ESTRADA PARA O POVOADO DIAMANTE - LAGOA DOURADA/MG"},null,null,null,"DATA: ",{"$f":"$H$2","v":" AGOSTO / 2023   "}]
[null,"SERVIÇO:  ",{"$f":"VLOOKUP(A492,ORÇAMENTO!$A$10:$I$48,3)","v":"PINTURA DE EIXO VIÁRIO SOBRE ASFALTO COM TINTA RETRORREFLETIVA A BASE DE RESINA ACRÍLICA COM MICROESFERAS DE VIDRO, APLICAÇÃO MECÂNICA COM DEMARCADORA AUTOPROPELIDA"},null,"SINAPI",{"$f":"VLOOKUP(A492,ORÇAMENTO!$A$10:$I$52,4)","v":102512},"UNIDADE: ",{"$f":"VLOOKUP(A492,ORÇAMENTO!$A$10:$I$52,5)","v":"M"}]
[]
[null,"TIPO ITEM","CODIGO ITEM","DESCRIÇÃO ITEM","UNIDADE ITEM","COEFICIENTE","PRECO UNITARIO","CUSTO TOTAL"]
[null,"INSUMO",5318,"DILUENTE AGUARRAS","L",2E-3,"26,76",{"$f":"ROUNDDOWN(F497*G497,2)","v":0.05}]
[null,"INSUMO",7343,"TINTA ACRILICA A BASE DE SOLVENTE, PARA SINALIZACAO HORIZONTAL VIARIA (NBR 11862)","L",4.2999999999999997E-2,"17,71",0.76]
[null,"INSUMO",44477,"MICROESFERAS DE VIDRO PARA SINALIZACAO HORIZONTAL VIARIA, TIPO II-A (DROP-ON)","KG",2.5000000000000001E-2,"10,74",0.26]
[null,"INSUMO",44478," MICROESFERAS DE VIDRO PARA SINALIZACAO HORIZONTAL VIARIA, TIPO I-B (PREMIX)","KG",1.0999999999999999E-2,"10,74",0.11]
[null,"COMPOSIÇÃO",88310,"PINTOR COM ENCARGOS COMPLEMENTARES","H",3.4000000000000002E-2,"28,66",0.97]
[null,"COMPOSIÇÃO",88316,"SERVENTE COM ENCARGOS COMPLEMENTARES","H",1.4E-2,"19,76",0.27]
[null,"COMPOSIÇÃO",95133,"MÁQUINA DEMARCADORA DE FAIXA DE TRÁFEGO À FRIO, AUTOPROPELIDA, POTÊNCIA 38 HP","CHP",2.9999999999999997E-4,"173,43",0.05]
[null,"COMPOSIÇÃO",96159,"MÁQUINA DEMARCADORA DE FAIXA DE TRÁFEGO À FRIO, AUTOPROPELIDA, POTÊNCIA 38 HP","CHI",3.3399999999999999E-2,"92,42",3.08]
[null,"PRODUÇÃO DA EQUIPE",null,null,1,"CUSTO ",null,{"$f":"SUM(H497:H504)","v":5.5500000000000007}]
[null,"TOTAL",{"$nulls":5},{"$f":"H505/E505","v":5.5500000000000007},"OK"]
[null,"BDI                %",{"$nulls":5},{"$f":"1+$M$1","v":1.2467000000000001}]
[null,"TOTAL DO SERVIÇO - R$",{"$nulls":5},{"$f":"ROUND(H506*H507,2)","v":6.92}]
[]
[23,"CODEVASF",null,null," COMPOSIÇÃO DE PREÇO UNITÁRIO",null,null,null,{"$f":"H517","v":2812.65},{"$f":"H519","v":3234.55}]
[null,"OBRA:  ",{"$f":"$C$2","v":" PAVIMENTAÇÃO ASFÁLTICA EM CBUQ - ESTRADA PARA O POVOADO DIAMANTE - LAGOA DOURADA/MG"},null,null,null,"DATA: ",{"$f":"$H$2","v":" AGOSTO / 2023   "}]
[null,"SERVIÇO:  ",{"$f":"VLOOKUP(A510,ORÇAMENTO!$A$10:$I$57,3)","v":"AQUISIÇÃO DE EMULSÃO ASFÁLTICA PARA IMPRIMAÇÃO (EAI) - EXCLUSIVE TRANSPORTE"},null,"SEINFRA",{"$f":"VLOOKUP(A510,ORÇAMENTO!$A$10:$I$57,4)","v":"CPU.7"},"UNIDADE: ",{"$f":"VLOOKUP(A510,ORÇAMENTO!$A$10:$I$57,5)","v":"T"}]
[]
[null,"TIPO ITEM","CODIGO ITEM","DESCRIÇÃO ITEM","UNIDADE ITEM","COEFICIENTE","PRECO UNITARIO","CUSTO TOTAL"]
[null,"INSUMO","ANP","EMULSÃO ASFÁLTICA PARA SERVIÇO DE IMPRIMAÇÃO (CUSTO ANP, INCLUINDO ICMS 18%)","T",1,{"$f":"2.30638*1000*1.2195122","v":2812.6585478359998},{"$f":"ROUNDDOWN(F515*G515,2)","v":2812.65}]
[null,"PRODUÇÃO DA EQUIPE",null,null,1,"CUSTO ",null,{"$f":"SUM(H515:H515)","v":2812.65}]
[null,"TOTAL",{"$nulls":5},{"$f":"H516/E516","v":2812.65}]
[null,"BDI                %",{"$nulls":5},{"$f":"1+$M$2","v":1.1499999999999999}]
[null,"TOTAL DO SERVIÇO - R$",{"$nulls":5},{"$f":"ROUND(H517*H518,2)","v":3234.55},"OK"]
[]
[24,"CODEVASF",null,null," COMPOSIÇÃO DE PREÇO UNITÁRIO",null,null,null,{"$f":"H528","v":2736.39},{"$f":"H530","v":3146.85}]
[null,"OBRA:  ",{"$f":"$C$2","v":" PAVIMENTAÇÃO ASFÁLTICA EM CBUQ - ESTRADA PARA O POVOADO DIAMANTE - LAGOA DOURADA/MG"},null,null,null,"DATA: ",{"$f":"$H$2","v":" AGOSTO / 2023   "}]
[null,"SERVIÇO:  ",{"$f":"VLOOKUP(A521,ORÇAMENTO!$A$10:$I$57,3)","v":"AQUISIÇÃO DE EMULSAO ASFALTICA CATIONICA RR-1C - EXCLUSIVE TRANSPORTE"},null,"SINAPI",{"$f":"VLOOKUP(A521,ORÇAMENTO!$A$10:$I$57,4)","v":"CPU.8"},"UNIDADE: ",{"$f":"VLOOKUP(A521,ORÇAMENTO!$A$10:$I$57,5)","v":"T"}]
[]
[null,"TIPO ITEM","CODIGO ITEM","DESCRIÇÃO ITEM","UNIDADE ITEM","COEFICIENTE","PRECO UNITARIO","CUSTO TOTAL"]
[null,"INSUMO","ANP","EMULSÃO ASFÁLTICA CATIÔNICA RR-1C(CUSTO ANP, INCLUINDO ICMS 18%)","T",1,{"$f":"2.24384*1.2195122*1000","v":2736.390254848},{"$f":"ROUNDDOWN(F526*G526,2)","v":2736.39}]
[null,"PRODUÇÃO DA EQUIPE",null,null,1,"CUSTO ",null,{"$f":"SUM(H526:H526)","v":2736.39}]
[null,"TOTAL",{"$nulls":5},{"$f":"H527/E527","v":2736.39},"OK"]
[null,"BDI                %",{"$nulls":5},{"$f":"1+$M$2","v":1.1499999999999999}]
[null,"TOTAL DO SERVIÇO - R$",{"$nulls":5},{"$f":"ROUND(H528*H529,2)","v":3146.85}]
[]
[25,"CODEVASF",null,null," COMPOSIÇÃO DE PREÇO UNITÁRIO",null,null,null,{"$f":"H539","v":590},{"$f":"H541","v":678.5}]
[null,"OBRA:  ",{"$f":"$C$2","v":" PAVIMENTAÇÃO ASFÁLTICA EM CBUQ - ESTRADA PARA O POVOADO DIAMANTE - LAGOA DOURADA/MG"},null,null,null,"DATA: ",{"$f":"$H$2","v":" AGOSTO / 2023   "}]
[null,"SERVIÇO:  ",{"$f":"VLOOKUP(A532,ORÇAMENTO!$A$10:$I$57,3)","v":"AQUISIÇÃO DE CONCRETO BETUMINOSO USINADO A QUENTE (CBUQ) PARA PAVIMENTACAO ASFALTICA, PADRAO DNIT, FAIXA C, COM CAP 50/70 - EXCLUSIVE TRANSPORTE"},null,"SINAPI",{"$f":"VLOOKUP(A532,ORÇAMENTO!$A$10:$I$57,4)","v":"CPU.9"},"UNIDADE: ",{"$f":"VLOOKUP(A532,ORÇAMENTO!$A$10:$I$57,5)","v":"T"}]
[]
[null,"TIPO ITEM","CODIGO ITEM","DESCRIÇÃO ITEM","UNIDADE ITEM","COEFICIENTE","PRECO UNITARIO","CUSTO TOTAL"]
[null,"INSUMO",1518,"CONCRETO BETUMINOSO USINADO A QUENTE (CBUQ) PARA PAVIMENTACAO ASFALTICA, PADRAO DNIT, FAIXA C, COM CAP 50/70 - AQUISICAO POSTO USINA","T",1,590,{"$f":"ROUNDDOWN(F537*G537,2)","v":590}]
[null,"PRODUÇÃO DA EQUIPE",null,null,1,"CUSTO ",null,{"$f":"SUM(H537:H537)","v":590}]
[null,"TOTAL",{"$nulls":5},{"$f":"H538/E538","v":590},"OK"]
[null,"BDI                %",{"$nulls":5},{"$f":"1+$M$2","v":1.1499999999999999}]
[null,"TOTAL DO SERVIÇO - R$",{"$nulls":5},{"$f":"ROUND(H539*H540,2)","v":678.5}]

{"sheet":"BDI SERV","index":2,"n_rows":37,"n_cols":20,"rows_kept":37,"cut":false,"hidden":false,"merged":[[36,0,36,5],[3,1,4,1],[3,2,4,2],[0,1,2,4],[32,0,34,5],[28,0,28,5],[30,1,30,2],[31,1,31,2]]}
[null,"DETALHAMENTO DO BDI - SERVIÇOS"]
[]
[]
[null,"Item","Descrição dos Serviços","%","%"]
[null,null,null,"PV","CD"]
[]
[null,1,"ADMINISTRAÇÃO CENTRAL"," ",4.01]
[null,"1.1","ESCRITÓRIO CENTRAL"," "," "]
[null,"1.2","VIAGENS"," "," "]
[null,"1.3","OUTROS"," "," "]
[null," "," "," "," "]
[null,2,"IMPOSTOS E TAXAS",{"$f":"SUM(D13:D16)","v":8.65},{"$f":"SUM(E13:E16)","v":10.82}]
[null,"2.1","ISS (*)",5,{"$f":"ROUND(D13*1.2515,2)","v":6.26}]
[null,"2.2","PIS",0.65,0.81]
[null,"2.3","Cofins",3,3.75]
[null,"2.4","CONTRIBUIÇÃO PREVIDENCIÁRIA SOBRE A RENDA BRUTA",0,0]
[]
[null,3,"TAXA DE RISCO"," ",{"$f":"SUM(E19:E22)","v":0.96}]
[null,"3.1","SEGURO",null,0.2]
[null,"3.2","RISCO",null,0.56000000000000005]
[null,"3.3","GARANTIA",null,0.2]
[{"$nulls":19},{"$f":"1/0.82","v":1.2195121951219512}]
[null,4,"DESPESAS FINANCEIRAS"," ",1.1100000000000001]
[]
[null,5,"LUCRO",null,7.3]
[]
[null," ","BDI - CALCULADO"," ",{"$f":"ROUND((((1+(E7+E18)/100)*(1+E23/100)*(1+E25/100)/(1-D12/100)-1)*100),2)","v":24.67}]
[]
["BDI = ((1+((AC+S+R+G)/100))x(1+DF/100)x(1+L/100)/(1-I/100)-1)*100"]
[]
[null,"BDI (CALCULADO):",null,{"$f":"ROUND((((1+((E7+E18)/100))*(1+E23/100)*(1+E25/100))/(1-D12/100)-1)*100,2)","v":24.67},"%"]
[null," "]
["(*) ISS CONFORME LEI Nº 836/1978 E LEI COMPLEMENTAR Nº 244 / 2021 "]
[]
[]
[]
["BDI EM CONFORMIDADE COM OS ACÓRDÃOS Nº 2369/2011 e ACÓRDÃO Nº 2.622/2013 - TCU - PLENÁRIO"]

{"sheet":"BDI FORN","index":3,"n_rows":37,"n_cols":5,"rows_kept":37,"cut":false,"hidden":false,"merged":[[0,1,2,4],[28,0,28,5],[30,1,30,2],[31,1,31,2],[36,0,36,5],[3,1,4,1],[3,2,4,2],[32,0,34,5]]}
[null,"DETALHAMENTO DO BDI - FORNECIMENTO \n(MATERIAL ASFÁLTICO)"]
[]
[]
[null,"Item","Descrição dos Serviços","%","%"]
[null,null,null,"PV","CD"]
[]
[null,1,"ADMINISTRAÇÃO CENTRAL"," ",3.72]
[null,"1.1","ESCRITÓRIO CENTRAL"," "," "]
[null,"1.2","VIAGENS"," "," "]
[null,"1.3","OUTROS"," "," "]
[null," "," "," "," "]
[null,2,"IMPOSTOS E TAXAS",{"$f":"SUM(D13:D16)","v":3.65},{"$f":"SUM(E13:E16)","v":4.5600000000000005}]
[null,"2.1","ISS (*)",null,{"$f":"ROUND(D13*1.2515,2)","v":0}]
[null,"2.2","PIS",0.65,0.81]
[null,"2.3","Cofins",3,3.75]
[null,"2.4","CONTRIBUIÇÃO PREVIDENCIÁRIA SOBRE A RENDA BRUTA",0,0]
[]
[null,3,"TAXA DE RISCO"," ",{"$f":"SUM(E19:E22)","v":0.82000000000000006}]
[null,"3.1","SEGURO",null,0.16]
[null,"3.2","RISCO",null,0.5]
[null,"3.3","GARANTIA",null,0.16]
[]
[null,4,"DESPESAS FINANCEIRAS"," ",0.94]
[]
[null,5,"LUCRO",null,5]
[]
[null," ","BDI - CALCULADO"," ",{"$f":"ROUND((((1+(E7+E18)/100)*(1+E23/100)*(1+E25/100)/(1-D12/100)-1)*100),2)","v":15}]
[]
["BDI = ((1+((AC+S+R+G)/100))x(1+DF/100)x(1+L/100)/(1-I/100)-1)*100"]
[]
[null,"BDI (CALCULADO):",null,{"$f":"ROUND((((1+((E7+E18)/100))*(1+E23/100)*(1+E25/100))/(1-D12/100)-1)*100,2)","v":15},"%"]
[null," "]
[]
[]
[]
[]
["BDI EM CONFORMIDADE COM OS ACÓRDÃOS Nº 2369/2011 e ACÓRDÃO Nº 2.622/2013 - TCU - PLENÁRIO"]

{"sheet":"CRONOGRAMA","index":4,"n_rows":21,"n_cols":12,"rows_kept":21,"cut":false,"hidden":false,"merged":[[0,1,0,11],[3,1,3,10],[5,0,6,0],[5,2,6,2],[1,2,2,4],[1,6,1,11],[2,6,2,11],[7,0,8,0],[9,0,10,0],[11,0,12,0],[15,0,16,0],[1,1,2,1],[5,1,6,1],[7,1,8,1],[9,1,10,1],[11,1,12,1],[15,1,16,1],[13,0,14,0],[17,1,18,2],[20,1,24,11],[7,2,8,2],[9,2,10,2],[11,2,12,2],[15,2,16,2],[13,1,14,1],[13,2,14,2]]}
[null,"CRONOGRAMA FÍSICO-FINANCEIRO"]
[null,"OBRA: ",{"$f":"ORÇAMENTO!C5","v":" PAVIMENTAÇÃO ASFÁLTICA EM CBUQ - ESTRADA PARA O POVOADO DIAMANTE - LAGOA DOURADA/MG"},null,null,"VALOR:",{"$f":"ORÇAMENTO!I50","v":3696706.93}]
[{"$nulls":5},"PRAZO: ","180 DIAS "]
[]
[null,"ITEM","ETAPAS/DESCRIÇAO","FISICO/  FINANCEIRO","TOTAL    ETAPAS","MÊS 1","MÊS 2","MÊS 3","MÊS 4","MÊS 5","MÊS 6","TOTAL"]
["A",{"$f":"VLOOKUP(A6,ORÇAMENTO!$A$9:$I$50,2)","v":1},{"$f":"VLOOKUP(A6,ORÇAMENTO!$A$9:$I$50,3)","v":"SERVIÇOS PRELIMINARES "},"FISICO ",{"$f":"ROUND(E7/$G$2,4)","v":7.6399999999999996E-2},0.25,0.15,0.15,0.15,0.15,0.15,{"$f":"SUM(F6:K6)","v":1}]
[null,null,null,"FINANCEIRO",{"$f":"ORÇAMENTO!I9","v":282536.90999999997},{"$f":"ROUND($E$7*F6,2)","v":70634.23},{"$f":"ROUND($E$7*G6,2)","v":42380.54},{"$f":"ROUND($E$7*H6,2)","v":42380.54},{"$f":"ROUND($E$7*I6,2)","v":42380.54},42380.54,42380.54,{"$f":"SUM(F7:K7)","v":282536.93}]
["B",{"$f":"VLOOKUP(A8,ORÇAMENTO!$A$9:$I$50,2)","v":2},{"$f":"VLOOKUP(A8,ORÇAMENTO!$A$9:$I$50,3)","v":"TERRAPLANAGEM E PAVIMENTAÇÃO"},"FISICO ",{"$f":"ROUND(E9/$G$2,4)","v":0.10970000000000001},0.1,0.2,0.2,0.2,0.2,0.1,{"$f":"SUM(F8:K8)","v":0.99999999999999989}]
[null,null,null,"FINANCEIRO",{"$f":"ORÇAMENTO!I15","v":405644.5},{"$f":"ROUND($E$9*F8,2)","v":40564.449999999997},{"$f":"ROUND($E$9*G8,2)","v":81128.899999999994},{"$f":"ROUND($E$9*H8,2)","v":81128.899999999994},{"$f":"ROUND($E$9*I8,2)","v":81128.899999999994},81128.899999999994,40564.449999999997,{"$f":"SUM(F9:K9)","v":405644.50000000006}]
["C",{"$f":"VLOOKUP(A10,ORÇAMENTO!$A$9:$I$50,2)","v":3},{"$f":"VLOOKUP(A10,ORÇAMENTO!$A$9:$I$50,3)","v":"TRANSPORTE DE MATERIAIS"},"FISICO ",{"$f":"ROUND(E11/$G$2,4)","v":6.0400000000000002E-2},0.1,0.2,0.2,0.2,0.2,0.1,{"$f":"SUM(F10:K10)","v":0.99999999999999989}]
[null,null,null,"FINANCEIRO",{"$f":"ORÇAMENTO!I23","v":223251},{"$f":"ROUND($E$11*F10,2)","v":22325.1},{"$f":"ROUND($E$11*G10,2)","v":44650.2},{"$f":"ROUND($E$11*H10,2)","v":44650.2},{"$f":"ROUND($E$11*I10,2)","v":44650.2},44650.2,22325.1,{"$f":"SUM(F11:K11)-0.04","v":223250.95999999996}]
["D",{"$f":"VLOOKUP(A12,ORÇAMENTO!$A$9:$I$50,2)","v":4},{"$f":"VLOOKUP(A12,ORÇAMENTO!$A$9:$I$50,3)","v":"TRANSPORTE DE MATERIAL ASFÁLTICO (BDI DIFERENCIADO)"},"FISICO ",{"$f":"ROUND(E13/$G$2,4)","v":3.73E-2},0.05,0.2,0.25,0.25,0.2,0.05,{"$f":"SUM(F12:K12)","v":1}]
[null,null,null,"FINANCEIRO",{"$f":"ORÇAMENTO!I26","v":137738},{"$f":"ROUND($E$13*F12,2)","v":6886.9},{"$f":"ROUND($E$13*G12,2)","v":27547.599999999999},{"$f":"ROUND($E$13*H12,2)","v":34434.5},{"$f":"ROUND($E$13*I12,2)","v":34434.5},27547.599999999999,6886.9,{"$f":"SUM(F13:K13)-0.02","v":137737.98000000001}]
["E",{"$f":"VLOOKUP(A14,ORÇAMENTO!$A$9:$I$50,2)","v":5},{"$f":"VLOOKUP(A14,ORÇAMENTO!$A$9:$I$50,3)","v":"DRENAGEM E OBRAS COMPLEMENTARES"},"FISICO ",{"$f":"ROUND(E15/$G$2,4)","v":0.2029},0.1,0.2,0.2,0.2,0.2,0.1,{"$f":"SUM(F14:K14)","v":0.99999999999999989}]
[null,null,null,"FINANCEIRO",{"$f":"ORÇAMENTO!I31","v":750034.4800000001},{"$f":"ROUND($E$15*F14,2)","v":75003.45},150006.9,150006.9,{"$f":"ROUND($E$15*I14,2)","v":150006.9},150006.9,75003.45,{"$f":"SUM(F15:K15)-0.02","v":750034.48}]
["F",{"$f":"VLOOKUP(A16,ORÇAMENTO!$A$9:$I$50,2)","v":6},{"$f":"VLOOKUP(A16,ORÇAMENTO!$A$9:$I$50,3)","v":"FORNECIMENTOS - MATERIAL ASFÁLTICO (BDI DIFERENCIADO)"},"FISICO ",{"$f":"ROUND(E17/$G$2,4)","v":0.51329999999999998},0.05,0.2,0.25,0.25,0.2,0.05,{"$f":"SUM(F16:K16)","v":1}]
[null,null,null,"FINANCEIRO",{"$f":"ORÇAMENTO!I46","v":1897502.04},{"$f":"ROUND($E$17*F16,2)","v":94875.1},{"$f":"ROUND($E$17*G16,2)","v":379500.41},{"$f":"ROUND($E$17*H16,2)","v":474375.51},{"$f":"ROUND($E$17*I16,2)","v":474375.51},379500.41,94875.1,{"$f":"SUM(F17:K17)-0.02","v":1897502.02}]
[null,"TOTAL",null,"FISICO ",{"$f":"SUM(F18:K18)","v":1.0000000108204412},{"$f":"F19/$E$19","v":8.3936659268794123E-2},{"$f":"G19/$E$19","v":0.19617853504010391},{"$f":"H19/$E$19","v":0.2237062784958179},0.2237062784958179,0.19617853504010391,7.6293724479803426E-2,{"$f":"SUM(F18:K18)","v":1.0000000108204412}]
[null,null,null,"FINANCEIRO",{"$f":"E11+E9+E7+E13+E17+E15","v":3696706.93},{"$f":"F11+F9+F7+F13+F17+F15","v":310289.23},{"$f":"G11+G9+G7+G13+G17+G15","v":725214.54999999993},826976.55,{"$f":"I11+I9+I7+I13+I17+I15","v":826976.55},725214.54999999993,282035.53999999998,{"$f":"SUM(F19:K19)-0.04","v":3696706.9299999997}]
[]
[null,"OBSERVAÇÕES:"]