{"text_format":"2","workbook":"xlsx","n_sheets":5,"sheets":["ORÇAMENTO","CPU","BDI SERV","BDI FORN","CRONOGRAMA"],"not_rendered":{"charts":0,"images":2,"macros":0,"external_links":0,"defined_names":5,"comments":1,"pivot_tables":0},"unopened":[],"bounds":{"document_bytes":16777216,"sheet_cells":100000,"run_cost":"one","rows_first":2000,"rows_last":500,"rows_between":2000,"halvings":0,"cell_chars":16384,"cell_head_chars":4096},"cells_cut":0,"cells_raw":0,"read":"whole","date_system":"1900"}

{"sheet":"ORÇAMENTO","index":0,"n_rows":50,"n_cols":9,"rows_kept":50,"cut":false,"hidden":false,"merged":[[6,1,6,2],[6,6,6,7],[49,1,49,2],[0,0,7,0],[0,2,0,8],[1,2,1,8],[2,2,2,8],[4,2,4,8],[5,6,5,7]]}
["<---- NUMERAR SERVIÇOS PARA CPU",null,"Ministério do Desenvolvimento Regional"]
[null,null,"Companhia de Desenvolvimento dos Vales do São Francisco e do Parnaíba"]
[null,null,"1ª Superintendência Regional"]
[]
[null,"OBRA: "," PAVIMENTAÇÃO ASFÁLTICA EM CBUQ - ESTRADA PARA O POVOADO DIAMANTE - LAGOA DOURADA/MG"]
[null,"DATA:"," AGOSTO / 2023   ",null,null,null,"BDI Serviços:",null,{"$f":"'BDI SERV'!D31/100","v":0.24670000000000003}]
[null,"PRAZO DE EXECUÇÃO:     180 DIAS",{"$nulls":4},"BDI Serviços:",null,{"$f":"'BDI FORN'!D31/100","v":0.15}]
[null,"ITEM","DISCRIMINAÇÃO","REFER.","UNID.","QUANT.","P. UNITÁRIO","P.UNIT.C/ BDI","P. TOTAL"]
["A",1,"SERVIÇOS PRELIMINARES ",{"$nulls":5},{"$f":"SUM(I10:I14)","v":282536.90999999997}]
[1,"1.1","MOBILIZAÇÃO E DESMOBILIZAÇÃO","CPU.1","GL",1,{"$f":"VLOOKUP(A10,CPU!$A$1:$N$4844,9)","v":6452.78},{"$f":"VLOOKUP(A10,CPU!$A$1:$N$4844,10)","v":8044.68},{"$f":"ROUND(F10*H10,2)","v":8044.68}]
[2,"1.2","ADMINISTRAÇÃO LOCAL","CPU.2","GL",1,{"$f":"VLOOKUP(A11,CPU!$A$1:$N$4844,9)","v":190217.52},{"$f":"VLOOKUP(A11,CPU!$A$1:$N$4844,10)","v":237144.18},{"$f":"ROUND(F11*H11,2)","v":237144.18}]
[3,"1.3","CANTEIRO DE OBRAS","CPU.3","GL",1,{"$f":"VLOOKUP(A12,CPU!$A$1:$N$4844,9)","v":19074.54},{"$f":"VLOOKUP(A12,CPU!$A$1:$N$4844,10)","v":23780.23},{"$f":"ROUND(F12*H12,2)","v":23780.23}]
[4,"1.4","PLACA DE OBRA EM CHAPA DE AÇO GALVANIZADO",103689,"M2",9,{"$f":"VLOOKUP(A13,CPU!$A$1:$N$4844,9)","v":350.51000000000005},{"$f":"VLOOKUP(A13,CPU!$A$1:$N$4844,10)","v":436.98},{"$f":"ROUND(F13*H13,2)","v":3932.82}]
[5,"1.5","SERVIÇOS TOPOGRÁFICOS PARA PAVIMENTAÇÃO, INCLUSIVE NOTA DE SERVIÇO, ACOMPANHAMENTO E GREIDE",78472,"M2",23499.996999999999,{"$f":"VLOOKUP(A14,CPU!$A$1:$N$4844,9)","v":0.32999999999999996},{"$f":"VLOOKUP(A14,CPU!$A$1:$N$4844,10)","v":0.41},{"$f":"ROUND(F14*H14,2)","v":9635}]
["B",2,"TERRAPLANAGEM E PAVIMENTAÇÃO",{"$nulls":5},{"$f":"SUM(I16:I22)","v":405644.5}]
[6,"2.1","ESCAVAÇÃO HORIZONTAL EM SOLO DE 1A CATEGORIA ",101116,"M3",9500,{"$f":"VLOOKUP(A16,CPU!$A$1:$N$4844,9)","v":2.0300000000000002},{"$f":"VLOOKUP(A16,CPU!$A$1:$N$4844,10)","v":2.5299999999999998},{"$f":"ROUND(F16*H16,2)","v":24035}]
[7,"2.2","CARGA, MANOBRA E DESCARGA DE SOLOS E MATERIAIS GRANULARES EM CAMINHÃO BASCULANTE",100976,"M3",9500,{"$f":"VLOOKUP(A17,CPU!$A$1:$N$4844,9)","v":6.32},{"$f":"VLOOKUP(A17,CPU!$A$1:$N$4844,10)","v":7.88},{"$f":"ROUND(F17*H17,2)","v":74860}]
[8,"2.3","REGULARIZAÇÃO E COMPACTAÇÃO DO SUBLEITO ",100577,"M2",23500,{"$f":"VLOOKUP(A18,CPU!$A$1:$N$4844,9)","v":1.1299999999999999},{"$f":"VLOOKUP(A18,CPU!$A$1:$N$4844,10)","v":1.41},33135]
[9,"2.4","EXECUÇÃO E COMPACTAÇÃO DE BASE E OU SUB BASE PARA PAVIMENTAÇÃO DE SOLOS DE COMPORTAMENTO LATERITICO - EXCLUSIVE SOLO, ESCAVAÇÃO, CARGA E TRANSPORTE (CASCALHO FORNECIDO PELA PREFEITURA)",96388,"M3",4700,{"$f":"VLOOKUP(A19,CPU!$A$1:$N$4844,9)","v":11.61},{"$f":"VLOOKUP(A19,CPU!$A$1:$N$4844,10)","v":14.47},68009]
[10,"2.5","IMPRIMAÇÃO COM EMULSÃO ASFÁLTICA (EAI)",96401,"M2",23500,{"$f":"VLOOKUP(A20,CPU!$A$1:$N$4844,9)","v":1.1200000000000001},{"$f":"VLOOKUP(A20,CPU!$A$1:$N$4844,10)","v":1.4},32900]
[11,"2.6","PINTURA DE LIGAÇÃO COM EMULSÃO ASFÁLTICA RR-1C",96402,"M2",19800,{"$f":"VLOOKUP(A21,CPU!$A$1:$N$4844,9)","v":0.93000000000000016},{"$f":"VLOOKUP(A21,CPU!$A$1:$N$4844,10)","v":1.1599999999999999},22968]
[12,"2.7","EXECUÇÃO DE PAVIMENTO COM APLICAÇÃO DE CONCRETO ASFÁLTICO USINADO A QUENTE (CBUQ), CAMADA DE ROLAMENTO - EXCLUSIVE TRANSPORTE",95995,"M3",990,{"$f":"VLOOKUP(A22,CPU!$A$1:$N$4844,9)","v":121.32},{"$f":"VLOOKUP(A22,CPU!$A$1:$N$4844,10)","v":151.25},149737.5]
["C",3,"TRANSPORTE DE MATERIAIS",{"$nulls":5},{"$f":"SUM(I24:I25)","v":223251}]
[13,"3.1","TRANSPORTE COM CAMINHÃO BASCULANTE, EM VIA URBANA PAVIMENTADA",95877,"M3XKM",110000.00185152001,{"$f":"VLOOKUP(A24,CPU!$A$1:$N$4844,9)","v":1.6099999999999999},{"$f":"VLOOKUP(A24,CPU!$A$1:$N$4844,10)","v":2.0099999999999998},{"$f":"ROUND(F24*H24,2)","v":221100}]
[14,"3.2","TRANSPORTE COM CAMINHÃO CARROCERIA 9T, EM VIA URBANA PAVIMENTADA",100947,"TXKM",900,{"$f":"VLOOKUP(A25,CPU!$A$1:$N$4844,9)","v":1.92},{"$f":"VLOOKUP(A25,CPU!$A$1:$N$4844,10)","v":2.39},{"$f":"ROUND(F25*H25,2)","v":2151}]
["D",4,"TRANSPORTE DE MATERIAL ASFÁLTICO (BDI DIFERENCIADO)",{"$nulls":5},{"$f":"SUM(I27:I30)","v":137738}]
[15,"4.1","TRANSPORTE DE MASSA ASFÁLTICA COM CAMINHÃO BASCULANTE, EM VIA URBANA PAVIMENTADA (BDI DIFERENCIADO)",95880,"TXKM",80000,{"$f":"VLOOKUP(A27,CPU!$A$1:$N$4844,9)","v":1.08},{"$f":"VLOOKUP(A27,CPU!$A$1:$N$4844,10)","v":1.24},{"$f":"ROUND(F27*H27,2)","v":99200}]
[15.1,"4.2","TRANSPORTE COM CAMINHÃO BASCULANTE EM VIA URBANA PAVIMENTADA, ADICIONAL PARA DMT EXCEDENTE A 30 KM  (BDI DIFERENCIADO)",95427,"TXKM",45000,{"$f":"VLOOKUP(A28,CPU!$A$1:$N$4844,9)","v":0.64999999999999991},{"$f":"VLOOKUP(A28,CPU!$A$1:$N$4844,10)","v":0.75},{"$f":"ROUND(F28*H28,2)","v":33750}]
[16,"4.3","TRANSPORTE COM CAMINHÃO TANQUE DE TRANSPORTE DE MATERIAL ASFÁLTICO, EM VIA URBANA PAVIMENTADA, DMT ATÉ 30KM (BDI DIFERENCIADO)",102330,"TXKM",1200,{"$f":"VLOOKUP(A29,CPU!$A$1:$N$4844,9)","v":1.2000000000000002},{"$f":"VLOOKUP(A29,CPU!$A$1:$N$4844,10)","v":1.38},1656]
[16.100000000000001,"4.4","TRANSPORTE COM CAMINHÃO TANQUE DE TRANSPORTE DE MATERIAL ASFÁLTICO, EM VIA URBANA PAVIMENTADA ADICIONAL PARA DMT EXCEDENTE A 30 KM (BDI DIFERENCIADO)",102331,"TXKM",5800,{"$f":"VLOOKUP(A30,CPU!$A$1:$N$4844,9)","v":0.47},{"$f":"VLOOKUP(A30,CPU!$A$1:$N$4844,10)","v":0.54},{"$f":"ROUND(F30*H30,2)","v":3132}]
{"$rows_left_out":21}
{"sheet":"CPU","index":1,"n_rows":541,"n_cols":13,"rows_kept":541,"cut":false,"hidden":false,"merged":[[0,1,0,3],[0,4,0,7],[0,10,0,11],[1,2,1,5],[1,10,1,11],[2,2,2,3],[3,1,3,7],[9,1,9,3],[9,5,9,6],[10,1,10,6],[11,1,11,6],[12,1,12,6],[14,1,14,3],[14,4,14,7],[14,10,14,11],[15,2,15,5],[16,2,16,3],[17,1,17,7],[28,1,28,3],[28,5,28,6],[29,1,29,6],[30,1,30,6],[31,1,31,6],[33,1,33,3],[33,4,33,7],[33,10,33,11],[34,2,34,5],[35,2,35,3],[36,1,36,7],[43,1,43,3],[43,5,43,6],[44,1,44,6],[45,1,45,6],[46,1,46,6],[48,1,48,3],[48,4,48,7],[48,10,48,11],[49,2,49,5],[50,2,50,3],[51,1,51,7],[61,1,61,3],[61,5,61,6],[62,1,62,6],[63,1,63,6],[64,1,64,6],[66,1,66,3],[66,4,66,7],[66,10,66,11],[67,2,67,5],[68,2,68,3],[69,1,69,7],[77,1,77,3],[77,5,77,6],[78,1,78,6],[79,1,79,6],[80,1,80,6],[82,1,82,3],[82,4,82,7],[82,10,82,11],[83,2,83,5],[84,2,84,3],[85,1,85,7],[90,1,90,3],[90,5,90,6],[91,1,91,6],[92,1,92,6],[93,1,93,6],[95,1,95,3],[95,4,95,7],[96,2,96,5],[97,2,97,3],[98,1,98,7],[104,1,104,3],[104,5,104,6],[105,1,105,6],[106,1,106,6],[107,1,107,6],[109,1,109,3],[109,4,109,7],[109,10,109,11],[110,2,110,5],[111,2,111,3],[112,1,112,7],[122,1,122,3],[122,5,122,6],[123,1,123,6],[124,1,124,6],[125,1,125,6],[127,1,127,3],[127,4,127,7],[128,2,128,5],[129,2,129,3],[130,1,130,7],[141,1,141,3],[141,5,141,6],[142,1,142,6],[143,1,143,6],[144,1,144,6],[146,1,146,3],[146,4,146,7],[146,10,146,11],[147,2,147,5],[148,2,148,3],[149,1,149,7],[160,1,160,3],[160,5,160,6],[161,1,161,6],[162,1,162,6],[163,1,163,6],[165,1,165,3],[165,4,165,7],[165,10,165,11],[166,2,166,5],[167,2,167,3],[168,1,168,7],[179,1,179,3],[179,5,179,6],[180,1,180,6],[181,1,181,6],[182,1,182,6],[184,1,184,3],[184,4,184,7],[184,10,184,11],[185,2,185,5],[186,2,186,3],[187,1,187,7],[189,8,189,9],[201,1,201,3],[201,5,201,6],[202,1,202,6],[203,1,203,6],[204,1,204,6],[206,1,206,3],[206,4,206,7],[206,10,206,11],[207,2,207,5],[208,2,208,3],[209,1,209,7],[214,1,214,3],[214,5,214,6],[215,1,215,6],[216,1,216,6],[217,1,217,6],[219,1,219,3],[219,4,219,7],[220,2,220,5],[221,2,221,3],[222,1,222,7],[227,1,227,3],[227,5,227,6],[228,1,228,6],[229,1,229,6],[230,1,230,6],[270,1,270,3],[270,4,270,7],[270,10,270,11],[232,1,232,3],[232,4,232,7],[233,2,233,5],[234,2,234,3],[235,1,235,7],[240,1,240,3],[240,5,240,6],[241,1,241,6],[242,1,242,6],[243,1,243,6],[245,1,245,3],[245,4,245,7],[246,2,246,5],[247,2,247,3],[248,1,248,7],[271,2,271,5],[272,2,272,3],[273,1,273,7],[277,1,277,3],[277,5,277,6],[278,1,278,6],[279,1,279,6],[280,1,280,6],[282,1,282,3],[282,4,282,7],[282,10,282,11],[283,2,283,5],[284,2,284,3],[285,1,285,7],[295,1,295,3],[295,5,295,6],[296,1,296,6],[297,1,297,6],[298,1,298,6],[300,1,300,3],[300,4,300,7],[301,2,301,5],[302,2,302,3],[303,1,303,7],[312,1,312,3],[312,5,312,6],[313,1,313,6],[314,1,314,6],[315,1,315,6],[440,1,440,3],[440,4,440,7],[441,2,441,5],[442,2,442,3],[443,1,443,7],[450,1,450,3],[450,5,450,6],[451,1,451,6],[317,1,317,3],[317,4,317,7],[318,2,318,5],[319,2,319,3],[320,1,320,7],[331,1,331,3],[331,5,331,6],[332,1,332,6],[333,1,333,6],[334,1,334,6],[336,1,336,3],[336,4,336,7],[337,2,337,5],[338,2,338,3],[339,1,339,7],[452,1,452,6],[453,1,453,6],[470,1,470,3],[470,4,470,7],[471,2,471,5],[472,2,472,3],[473,1,473,7],[486,1,486,3],[486,5,486,6],[534,1,534,7],[537,1,537,3],[537,5,537,6],[516,1,516,6],[517,1,517,6],[518,1,518,6],[520,1,520,3],[520,4,520,7],[521,2,521,5],[522,2,522,3],[523,1,523,7],[526,1,526,3],[526,5,526,6],[487,1,487,6],[488,1,488,6],[489,1,489,6],[491,1,491,3],[491,4,491,7],[531,1,531,3],[531,4,531,7],[532,2,532,5],[533,2,533,3],[492,2,492,5],[493,2,493,3],[494,1,494,7],[504,1,504,3],[504,5,504,6],[509,0,518,0],[527,1,527,6],[528,1,528,6],[529,1,529,6],[505,1,505,6],[506,1,506,6],[507,1,507,6],[509,1,509,3],[509,4,509,7],[510,2,510,5],[511,2,511,3],[512,1,512,7],[515,1,515,3],[515,5,515,6],[232,0,243,0],[245,0,256,0],[258,0,268,0],[270,0,280,0],[282,0,298,0],[300,0,315,0],[440,0,453,0],[470,0,489,0],[491,0,507,0],[336,0,348,0],[365,0,379,0],[398,0,408,0],[425,0,438,0],[219,0,230,0],[0,0,13,0],[14,0,32,0],[33,0,47,0],[48,0,65,0],[66,0,81,0],[82,0,94,0],[95,0,107,0],[109,0,126,0],[127,0,144,0],[287,12,289,15],[520,0,529,0],[531,0,540,0],[15,8,16,9],[34,8,35,9],[455,0,468,0],[455,1,455,3],[455,4,455,7],[456,2,456,5],[457,2,457,3],[458,1,458,7],[465,1,465,3],[465,5,465,6],[466,1,466,6],[467,1,467,6],[468,1,468,6],[538,1,538,6],[539,1,539,6],[540,1,540,6],[146,0,164,0],[165,0,183,0],[184,0,205,0],[206,0,217,0],[317,0,334,0],[345,1,345,3],[345,5,345,6],[346,1,346,6],[347,1,347,6],[348,1,348,6],[350,0,363,0],[350,1,350,3],[350,4,350,7],[351,2,351,5],[352,2,352,3],[353,1,353,7],[360,1,360,3],[360,5,360,6],[361,1,361,6],[362,1,362,6],[363,1,363,6],[365,1,365,3],[365,4,365,7],[366,2,366,5],[367,2,367,3],[368,1,368,7],[376,1,376,3],[376,5,376,6],[377,1,377,6],[378,1,378,6],[379,1,379,6],[381,0,396,0],[381,1,381,3],[381,4,381,7],[382,2,382,5],[383,2,383,3],[384,1,384,7],[393,1,393,3],[393,5,393,6],[394,1,394,6],[395,1,395,6],[396,1,396,6],[398,1,398,3],[398,4,398,7],[399,2,399,5],[400,2,400,3],[401,1,401,7],[405,1,405,3],[405,5,405,6],[406,1,406,6],[407,1,407,6],[437,1,437,6],[408,1,408,6],[410,0,423,0],[410,1,410,3],[410,4,410,7],[411,2,411,5],[412,2,412,3],[413,1,413,7],[420,1,420,3],[420,5,420,6],[421,1,421,6],[422,1,422,6],[423,1,423,6],[438,1,438,6],[261,1,261,7],[265,1,265,3],[265,5,265,6],[266,1,266,6],[267,1,267,6],[268,1,268,6],[253,1,253,3],[253,5,253,6],[254,1,254,6],[255,1,255,6],[256,1,256,6],[258,1,258,3],[258,4,258,7],[259,2,259,5],[260,2,260,3],[425,1,425,3],[425,4,425,7],[426,2,426,5],[427,2,427,3],[428,1,428,7],[435,1,435,3],[435,5,435,6],[436,1,436,6]]}
[1,"CODEVASF",null,null," COMPOSIÇÃO DE PREÇO UNITÁRIO",null,null,null,{"$f":"H11","v":6452.78},{"$f":"H13","v":8044.68},"BDI CALCULADO:",null,{"$f":"ORÇAMENTO!I6","v":0.24670000000000003}]
[null,"OBRA:  ",{"$f":"ORÇAMENTO!C5","v":" PAVIMENTAÇÃO ASFÁLTICA EM CBUQ - ESTRADA PARA O POVOADO DIAMANTE - LAGOA DOURADA/MG"},null,null,null,"DATA: ",{"$f":"ORÇAMENTO!C6","v":" AGOSTO / 2023   "},null,null,"BDI DIFERENCIADO:",null,{"$f":"'BDI FORN'!D31/100","v":0.15}]
[null,"SERVIÇO:  ",{"$f":"VLOOKUP(A1,ORÇAMENTO!A10:I32,3)","v":"MOBILIZAÇÃO E DESMOBILIZAÇÃO"},null,"Referência:",{"$f":"VLOOKUP(A1,ORÇAMENTO!$A$10:$I$32,4)","v":"CPU.1"},"UNIDADE: ",{"$f":"VLOOKUP(A1,ORÇAMENTO!A10:I32,5)","v":"GL"}]
[]
[null,"TIPO ITEM","CODIGO ITEM","DESCRIÇÃO ITEM","UNIDADE ITEM","COEFICIENTE","PRECO UNITARIO","CUSTO TOTAL"]
[null,"COMPOSICAO",89876,"CAMINHÃO BASCULANTE 14 M3, COM CAVALO MECÂNICO DE CAPACIDADE MÁXIMA DE TRAÇÃO COMBINADO DE 36000 KG, POTÊNCIA 286 CV, INCLUSIVE SEMIREBOQUE COM CAÇAMBA METÁLICA","CHP DIURNO.",8,286.2,{"$f":"ROUNDDOWN(F6*G6,2)","v":2289.6}]
[null,"COMPOSICAO",89877,"CAMINHÃO BASCULANTE 14 M3, COM CAVALO MECÂNICO DE CAPACIDADE MÁXIMA DE TRAÇÃO COMBINADO DE 36000 KG, POTÊNCIA 286 CV, INCLUSIVE SEMIREBOQUE COM CAÇAMBA METÁLICA","CHI DIURNO.",16,82.81,{"$f":"ROUNDDOWN(F7*G7,2)","v":1324.96}]
[null,"COMPOSICAO",5914640,"TRANSPORTE COM CAVALO MECÂNICO COM SEMIRREBOQUE COM CAPACIDADE DE 30 T - RODOVIA PAVIMENTADA","T.KM",3870,0.56999999999999995,2205.9]
[null,"COMPOSIÇÃO",88316,"SERVENTE COM ENCARGOS COMPLEMENTARES","H",32,19.760000000000002,632.32000000000005]
[null,"PRODUÇÃO DA EQUIPE",null,null,1,"CUSTO ",null,{"$f":"SUM(H6:H9)","v":6452.78}]
[null,"TOTAL",{"$nulls":5},{"$f":"H10/E10","v":6452.78},"OK"]
[null,"BDI                %",{"$nulls":5},{"$f":"1+$M$1","v":1.2467000000000001}]
[null,"TOTAL DO SERVIÇO - R$",{"$nulls":5},{"$f":"ROUND(H11*H12,2)","v":8044.68}]
[]
[{"$f":"A1+1","v":2},"CODEVASF",null,null," COMPOSIÇÃO DE PREÇO UNITÁRIO",null,null,null,{"$f":"H30","v":190217.52},{"$f":"H32","v":237144.18}]
[null,"OBRA:  ",{"$f":"$C$2","v":" PAVIMENTAÇÃO ASFÁLTICA EM CBUQ - ESTRADA PARA O POVOADO DIAMANTE - LAGOA DOURADA/MG"},null,null,null,"DATA: ",{"$f":"$H$2","v":" AGOSTO / 2023   "}]
[null,"SERVIÇO:  ",{"$f":"VLOOKUP(A15,ORÇAMENTO!$A$10:$I$32,3)","v":"ADMINISTRAÇÃO LOCAL"},null,"SINAPI",{"$f":"VLOOKUP(A15,ORÇAMENTO!$A$10:$I$32,4)","v":"CPU.2"},"UNIDADE: ",{"$f":"VLOOKUP(A15,ORÇAMENTO!$A$10:$I$32,5)","v":"GL"}]
[]
[null,"TIPO ITEM","CODIGO ITEM","DESCRIÇÃO ITEM","UNIDADE ITEM","COEFICIENTE","PRECO UNITARIO","CUSTO TOTAL"]
[null,"INSUMO",14250,"ENERGIA ELÉTRICA","kwh",80,0.95,{"$f":"ROUNDDOWN(F20*G20,2)","v":76}]
[null,"INSUMO",44480,"TARIFA \"A\" - ÁGUA/ESGOTO ","m³",6,17.97,107.82]
[null,"COTAÇÃO","MERC.","TELEFONE (PLANO CONTROLE)","UNID",3,59.9,179.7]
[null,"INSUMO","ED-50155 SEINFRA","BANHEIRO QUÍMICO 110 X 120 X 230 CM COM MANUTENÇÃO (CONSIDERANDO OBRAS SIMULTÂNEAS)","MÊS",2,515,1030]
[null,"COMPOSICAO",90777,"Engenheiro Civil Júnior com encargos complementares","H",55,114.12,6276.6]
[null,"COMPOSICAO",90776,"Encarregado Geral com encargos complementares","H",220,57.73,12700.6]
[null,"COMPOSICAO",88321,"Tecnico de Laboratório com encargos complementares","H",110,45.45,4999.5]
[null,"COMPOSICAO",100309,"Tecnico em Segurança do Trabalho com encargos complementares","H",110,45.71,{"$f":"ROUNDDOWN(F27*G27,2)","v":5028.1000000000004}]
[null,"COMPOSICAO",90772,"Auxiliar de escritório com encargos complementares","H",55,23.72,1304.5999999999999]
[null,"PRODUÇÃO DA EQUIPE",null,null,{"$f":"1/6","v":0.16666666666666666},"CUSTO ",null,{"$f":"SUM(H20:H28)","v":31702.92}]
[null,"TOTAL",{"$nulls":5},{"$f":"ROUND(H29/E29,2)","v":190217.52},"OK"]
{"$rows_left_out":512}
{"sheet":"BDI SERV","index":2,"n_rows":37,"n_cols":20,"rows_kept":37,"cut":false,"hidden":false,"merged":[[36,0,36,5],[3,1,4,1],[3,2,4,2],[0,1,2,4],[32,0,34,5],[28,0,28,5],[30,1,30,2],[31,1,31,2]]}
[null,"DETALHAMENTO DO BDI - SERVIÇOS"]
[]
[]
[null,"Item","Descrição dos Serviços","%","%"]
[null,null,null,"PV","CD"]
[]
[null,1,"ADMINISTRAÇÃO CENTRAL"," ",4.01]
[null,"1.1","ESCRITÓRIO CENTRAL"," "," "]
[null,"1.2","VIAGENS"," "," "]
[null,"1.3","OUTROS"," "," "]
[null," "," "," "," "]
[null,2,"IMPOSTOS E TAXAS",{"$f":"SUM(D13:D16)","v":8.65},{"$f":"SUM(E13:E16)","v":10.82}]
[null,"2.1","ISS (*)",5,{"$f":"ROUND(D13*1.2515,2)","v":6.26}]
[null,"2.2","PIS",0.65,0.81]
[null,"2.3","Cofins",3,3.75]
[null,"2.4","CONTRIBUIÇÃO PREVIDENCIÁRIA SOBRE A RENDA BRUTA",0,0]
[]
[null,3,"TAXA DE RISCO"," ",{"$f":"SUM(E19:E22)","v":0.96}]
[null,"3.1","SEGURO",null,0.2]
[null,"3.2","RISCO",null,0.56000000000000005]
[null,"3.3","GARANTIA",null,0.2]
[{"$nulls":19},{"$f":"1/0.82","v":1.2195121951219512}]
[null,4,"DESPESAS FINANCEIRAS"," ",1.1100000000000001]
[]
[null,5,"LUCRO",null,7.3]
[]
[null," ","BDI - CALCULADO"," ",{"$f":"ROUND((((1+(E7+E18)/100)*(1+E23/100)*(1+E25/100)/(1-D12/100)-1)*100),2)","v":24.67}]
[]
["BDI = ((1+((AC+S+R+G)/100))x(1+DF/100)x(1+L/100)/(1-I/100)-1)*100"]
[]
{"$rows_left_out":8}
{"sheet":"BDI FORN","index":3,"n_rows":37,"n_cols":5,"rows_kept":37,"cut":false,"hidden":false,"merged":[[0,1,2,4],[28,0,28,5],[30,1,30,2],[31,1,31,2],[36,0,36,5],[3,1,4,1],[3,2,4,2],[32,0,34,5]]}
[null,"DETALHAMENTO DO BDI - FORNECIMENTO \n(MATERIAL ASFÁLTICO)"]
[]
[]
[null,"Item","Descrição dos Serviços","%","%"]
[null,null,null,"PV","CD"]
[]
[null,1,"ADMINISTRAÇÃO CENTRAL"," ",3.72]
[null,"1.1","ESCRITÓRIO CENTRAL"," "," "]
[null,"1.2","VIAGENS"," "," "]
[null,"1.3","OUTROS"," "," "]
[null," "," "," "," "]
[null,2,"IMPOSTOS E TAXAS",{"$f":"SUM(D13:D16)","v":3.65},{"$f":"SUM(E13:E16)","v":4.5600000000000005}]
[null,"2.1","ISS (*)",null,{"$f":"ROUND(D13*1.2515,2)","v":0}]
[null,"2.2","PIS",0.65,0.81]
[null,"2.3","Cofins",3,3.75]
[null,"2.4","CONTRIBUIÇÃO PREVIDENCIÁRIA SOBRE A RENDA BRUTA",0,0]
[]
[null,3,"TAXA DE RISCO"," ",{"$f":"SUM(E19:E22)","v":0.82000000000000006}]
[null,"3.1","SEGURO",null,0.16]
[null,"3.2","RISCO",null,0.5]
[null,"3.3","GARANTIA",null,0.16]
[]
[null,4,"DESPESAS FINANCEIRAS"," ",0.94]
[]
[null,5,"LUCRO",null,5]
[]
[null," ","BDI - CALCULADO"," ",{"$f":"ROUND((((1+(E7+E18)/100)*(1+E23/100)*(1+E25/100)/(1-D12/100)-1)*100),2)","v":15}]
[]
["BDI = ((1+((AC+S+R+G)/100))x(1+DF/100)x(1+L/100)/(1-I/100)-1)*100"]
[]
{"$rows_left_out":8}
{"sheet":"CRONOGRAMA","index":4,"n_rows":21,"n_cols":12,"rows_kept":21,"cut":false,"hidden":false,"merged":[[0,1,0,11],[3,1,3,10],[5,0,6,0],[5,2,6,2],[1,2,2,4],[1,6,1,11],[2,6,2,11],[7,0,8,0],[9,0,10,0],[11,0,12,0],[15,0,16,0],[1,1,2,1],[5,1,6,1],[7,1,8,1],[9,1,10,1],[11,1,12,1],[15,1,16,1],[13,0,14,0],[17,1,18,2],[20,1,24,11],[7,2,8,2],[9,2,10,2],[11,2,12,2],[15,2,16,2],[13,1,14,1],[13,2,14,2]]}
[null,"CRONOGRAMA FÍSICO-FINANCEIRO"]
[null,"OBRA: ",{"$f":"ORÇAMENTO!C5","v":" PAVIMENTAÇÃO ASFÁLTICA EM CBUQ - ESTRADA PARA O POVOADO DIAMANTE - LAGOA DOURADA/MG"},null,null,"VALOR:",{"$f":"ORÇAMENTO!I50","v":3696706.93}]
[{"$nulls":5},"PRAZO: ","180 DIAS "]
[]
[null,"ITEM","ETAPAS/DESCRIÇAO","FISICO/  FINANCEIRO","TOTAL    ETAPAS","MÊS 1","MÊS 2","MÊS 3","MÊS 4","MÊS 5","MÊS 6","TOTAL"]
["A",{"$f":"VLOOKUP(A6,ORÇAMENTO!$A$9:$I$50,2)","v":1},{"$f":"VLOOKUP(A6,ORÇAMENTO!$A$9:$I$50,3)","v":"SERVIÇOS PRELIMINARES "},"FISICO ",{"$f":"ROUND(E7/$G$2,4)","v":7.6399999999999996E-2},0.25,0.15,0.15,0.15,0.15,0.15,{"$f":"SUM(F6:K6)","v":1}]
[null,null,null,"FINANCEIRO",{"$f":"ORÇAMENTO!I9","v":282536.90999999997},{"$f":"ROUND($E$7*F6,2)","v":70634.23},{"$f":"ROUND($E$7*G6,2)","v":42380.54},{"$f":"ROUND($E$7*H6,2)","v":42380.54},{"$f":"ROUND($E$7*I6,2)","v":42380.54},42380.54,42380.54,{"$f":"SUM(F7:K7)","v":282536.93}]
["B",{"$f":"VLOOKUP(A8,ORÇAMENTO!$A$9:$I$50,2)","v":2},{"$f":"VLOOKUP(A8,ORÇAMENTO!$A$9:$I$50,3)","v":"TERRAPLANAGEM E PAVIMENTAÇÃO"},"FISICO ",{"$f":"ROUND(E9/$G$2,4)","v":0.10970000000000001},0.1,0.2,0.2,0.2,0.2,0.1,{"$f":"SUM(F8:K8)","v":0.99999999999999989}]
[null,null,null,"FINANCEIRO",{"$f":"ORÇAMENTO!I15","v":405644.5},{"$f":"ROUND($E$9*F8,2)","v":40564.449999999997},{"$f":"ROUND($E$9*G8,2)","v":81128.899999999994},{"$f":"ROUND($E$9*H8,2)","v":81128.899999999994},{"$f":"ROUND($E$9*I8,2)","v":81128.899999999994},81128.899999999994,40564.449999999997,{"$f":"SUM(F9:K9)","v":405644.50000000006}]
["C",{"$f":"VLOOKUP(A10,ORÇAMENTO!$A$9:$I$50,2)","v":3},{"$f":"VLOOKUP(A10,ORÇAMENTO!$A$9:$I$50,3)","v":"TRANSPORTE DE MATERIAIS"},"FISICO ",{"$f":"ROUND(E11/$G$2,4)","v":6.0400000000000002E-2},0.1,0.2,0.2,0.2,0.2,0.1,{"$f":"SUM(F10:K10)","v":0.99999999999999989}]
[null,null,null,"FINANCEIRO",{"$f":"ORÇAMENTO!I23","v":223251},{"$f":"ROUND($E$11*F10,2)","v":22325.1},{"$f":"ROUND($E$11*G10,2)","v":44650.2},{"$f":"ROUND($E$11*H10,2)","v":44650.2},{"$f":"ROUND($E$11*I10,2)","v":44650.2},44650.2,22325.1,{"$f":"SUM(F11:K11)-0.04","v":223250.95999999996}]
["D",{"$f":"VLOOKUP(A12,ORÇAMENTO!$A$9:$I$50,2)","v":4},{"$f":"VLOOKUP(A12,ORÇAMENTO!$A$9:$I$50,3)","v":"TRANSPORTE DE MATERIAL ASFÁLTICO (BDI DIFERENCIADO)"},"FISICO ",{"$f":"ROUND(E13/$G$2,4)","v":3.73E-2},0.05,0.2,0.25,0.25,0.2,0.05,{"$f":"SUM(F12:K12)","v":1}]
[null,null,null,"FINANCEIRO",{"$f":"ORÇAMENTO!I26","v":137738},{"$f":"ROUND($E$13*F12,2)","v":6886.9},{"$f":"ROUND($E$13*G12,2)","v":27547.599999999999},{"$f":"ROUND($E$13*H12,2)","v":34434.5},{"$f":"ROUND($E$13*I12,2)","v":34434.5},27547.599999999999,6886.9,{"$f":"SUM(F13:K13)-0.02","v":137737.98000000001}]
["E",{"$f":"VLOOKUP(A14,ORÇAMENTO!$A$9:$I$50,2)","v":5},{"$f":"VLOOKUP(A14,ORÇAMENTO!$A$9:$I$50,3)","v":"DRENAGEM E OBRAS COMPLEMENTARES"},"FISICO ",{"$f":"ROUND(E15/$G$2,4)","v":0.2029},0.1,0.2,0.2,0.2,0.2,0.1,{"$f":"SUM(F14:K14)","v":0.99999999999999989}]
[null,null,null,"FINANCEIRO",{"$f":"ORÇAMENTO!I31","v":750034.4800000001},{"$f":"ROUND($E$15*F14,2)","v":75003.45},150006.9,150006.9,{"$f":"ROUND($E$15*I14,2)","v":150006.9},150006.9,75003.45,{"$f":"SUM(F15:K15)-0.02","v":750034.48}]
["F",{"$f":"VLOOKUP(A16,ORÇAMENTO!$A$9:$I$50,2)","v":6},{"$f":"VLOOKUP(A16,ORÇAMENTO!$A$9:$I$50,3)","v":"FORNECIMENTOS - MATERIAL ASFÁLTICO (BDI DIFERENCIADO)"},"FISICO ",{"$f":"ROUND(E17/$G$2,4)","v":0.51329999999999998},0.05,0.2,0.25,0.25,0.2,0.05,{"$f":"SUM(F16:K16)","v":1}]
[null,null,null,"FINANCEIRO",{"$f":"ORÇAMENTO!I46","v":1897502.04},{"$f":"ROUND($E$17*F16,2)","v":94875.1},{"$f":"ROUND($E$17*G16,2)","v":379500.41},{"$f":"ROUND($E$17*H16,2)","v":474375.51},{"$f":"ROUND($E$17*I16,2)","v":474375.51},379500.41,94875.1,{"$f":"SUM(F17:K17)-0.02","v":1897502.02}]
[null,"TOTAL",null,"FISICO ",{"$f":"SUM(F18:K18)","v":1.0000000108204412},{"$f":"F19/$E$19","v":8.3936659268794123E-2},{"$f":"G19/$E$19","v":0.19617853504010391},{"$f":"H19/$E$19","v":0.2237062784958179},0.2237062784958179,0.19617853504010391,7.6293724479803426E-2,{"$f":"SUM(F18:K18)","v":1.0000000108204412}]
[null,null,null,"FINANCEIRO",{"$f":"E11+E9+E7+E13+E17+E15","v":3696706.93},{"$f":"F11+F9+F7+F13+F17+F15","v":310289.23},{"$f":"G11+G9+G7+G13+G17+G15","v":725214.54999999993},826976.55,{"$f":"I11+I9+I7+I13+I17+I15","v":826976.55},725214.54999999993,282035.53999999998,{"$f":"SUM(F19:K19)-0.04","v":3696706.9299999997}]
[]
[null,"OBSERVAÇÕES:"]