{"text_format":"2","workbook":"xlsx","n_sheets":5,"sheets":["ORÇAMENTO","CPU","BDI SERV","BDI FORN","CRONOGRAMA"],"not_rendered":{"charts":0,"images":3,"macros":0,"external_links":0,"defined_names":5,"comments":1,"pivot_tables":0},"unopened":[],"bounds":{"document_bytes":16777216,"sheet_cells":100000,"run_cost":"one","rows_first":2000,"rows_last":500,"rows_between":2000,"halvings":0,"cell_chars":16384,"cell_head_chars":4096},"cells_cut":0,"cells_raw":0,"read":"whole","date_system":"1900"}

{"sheet":"ORÇAMENTO","index":0,"n_rows":47,"n_cols":9,"rows_kept":47,"cut":false,"hidden":false,"merged":[[46,1,46,2],[0,0,7,0],[0,2,0,8],[1,2,1,8],[2,2,2,8],[4,2,4,8],[5,6,5,7],[6,1,6,2],[6,6,6,7]]}
["<---- NUMERAR SERVIÇOS PARA CPU",null,"Ministério do Desenvolvimento Regional"]
[null,null,"Companhia de Desenvolvimento dos Vales do São Francisco e do Parnaíba"]
[null,null,"1ª Superintendência Regional"]
[]
[null,"OBRA: "," PAVIMENTAÇÃO ASFÁLTICA EM CBUQ E REDE DE ESGOTO URBANA - LOTEAMENTO NOVA CONQUISTA (MATUTINA / MG) - ITEM 1"]
[null,"DATA:"," SETEMBRO / 2023   ",null,null,null,"BDI Serviços:",null,{"$f":"'BDI SERV'!D31/100","v":0.21489999999999998}]
[null,"PRAZO DE EXECUÇÃO:     180 DIAS",{"$nulls":4},"BDI Serviços:",null,{"$f":"'BDI FORN'!D31/100","v":0.15}]
[null,"ITEM","DISCRIMINAÇÃO","REFER.","UNID.","QUANT.","P. UNITÁRIO","P.UNIT.C/ BDI","P. TOTAL"]
["A",1,"SERVIÇOS PRELIMINARES ",{"$nulls":5},{"$f":"SUM(I10:I14)","v":191531.46000000002}]
[1,"1.1","MOBILIZAÇÃO E DESMOBILIZAÇÃO","CPU.1","GL",1,{"$f":"VLOOKUP(A10,CPU!$A$1:$N$4816,9)","v":13860.2},{"$f":"VLOOKUP(A10,CPU!$A$1:$N$4816,10)","v":16838.759999999998},{"$f":"ROUND(F10*H10,2)","v":16838.759999999998}]
[2,"1.2","ADMINISTRAÇÃO LOCAL","CPU.2","GL",1,{"$f":"VLOOKUP(A11,CPU!$A$1:$N$4816,9)","v":125123.28},{"$f":"VLOOKUP(A11,CPU!$A$1:$N$4816,10)","v":152012.26999999999},{"$f":"ROUND(F11*H11,2)","v":152012.26999999999}]
[3,"1.3","CANTEIRO DE OBRAS","CPU.3","GL",1,{"$f":"VLOOKUP(A12,CPU!$A$1:$N$4816,9)","v":13531.5},{"$f":"VLOOKUP(A12,CPU!$A$1:$N$4816,10)","v":16439.419999999998},{"$f":"ROUND(F12*H12,2)","v":16439.419999999998}]
[4,"1.4","PLACA DE OBRA EM CHAPA DE AÇO GALVANIZADO",103689,"M2",3,{"$f":"VLOOKUP(A13,CPU!$A$1:$N$4816,9)","v":340.5},{"$f":"VLOOKUP(A13,CPU!$A$1:$N$4816,10)","v":413.67},{"$f":"ROUND(F13*H13,2)","v":1241.01}]
[5,"1.5","SERVIÇOS TOPOGRÁFICOS PARA PAVIMENTAÇÃO, INCLUSIVE NOTA DE SERVIÇO, ACOMPANHAMENTO E GREIDE",78472,"M2",12500,{"$f":"VLOOKUP(A14,CPU!$A$1:$N$4816,9)","v":0.32999999999999996},{"$f":"VLOOKUP(A14,CPU!$A$1:$N$4816,10)","v":0.4},{"$f":"ROUND(F14*H14,2)","v":5000}]
["B",2,"PAVIMENTAÇÃO",{"$nulls":5},{"$f":"SUM(I16:I22)","v":231125.5}]
[6,"2.1","ESCAVAÇÃO HORIZONTAL EM SOLO DE 1A CATEGORIA ",101116,"M3",4999.9999999999991,{"$f":"VLOOKUP(A16,CPU!$A$1:$N$4816,9)","v":2.2000000000000002},{"$f":"VLOOKUP(A16,CPU!$A$1:$N$4816,10)","v":2.67},{"$f":"ROUND(F16*H16,2)","v":13350}]
[7,"2.2","CARGA, MANOBRA E DESCARGA DE SOLOS E MATERIAIS GRANULARES EM CAMINHÃO BASCULANTE",100976,"M3",4999.9999999999991,{"$f":"VLOOKUP(A17,CPU!$A$1:$N$4816,9)","v":8.7100000000000009},{"$f":"VLOOKUP(A17,CPU!$A$1:$N$4816,10)","v":10.58},52900]
[8,"2.3","REGULARIZAÇÃO E COMPACTAÇÃO DO SUBLEITO ",100576,"M2",12500,{"$f":"VLOOKUP(A18,CPU!$A$1:$N$4816,9)","v":2.57},{"$f":"VLOOKUP(A18,CPU!$A$1:$N$4816,10)","v":3.12},39000]
[9,"2.4","EXECUÇÃO E COMPACTAÇÃO DE BASE E OU SUB BASE PARA PAVIMENTAÇÃO DE SOLOS DE COMPORTAMENTO LATERÍTICO (ARENOSO) - EXCLUSIVE SOLO, ESCAVAÇÃO, CARGA E TRANSPORTE",96388,"M3",2499.9999999999995,{"$f":"VLOOKUP(A19,CPU!$A$1:$N$4816,9)","v":12.469999999999999},{"$f":"VLOOKUP(A19,CPU!$A$1:$N$4816,10)","v":15.15},37875]
[10,"2.5","IMPRIMAÇÃO COM EMULSÃO ASFÁLTICA (EAI)",96401,"M2",12500,{"$f":"VLOOKUP(A20,CPU!$A$1:$N$4816,9)","v":1.23},{"$f":"VLOOKUP(A20,CPU!$A$1:$N$4816,10)","v":1.49},18625]
[11,"2.6","PINTURA DE LIGAÇÃO COM EMULSÃO ASFÁLTICA RR-1C",96402,"M2",11599.999999999998,{"$f":"VLOOKUP(A21,CPU!$A$1:$N$4816,9)","v":1.01},{"$f":"VLOOKUP(A21,CPU!$A$1:$N$4816,10)","v":1.23},14268]
[12,"2.7","EXECUÇÃO DE PAVIMENTO COM APLICAÇÃO DE CONCRETO ASFÁLTICO USINADO A QUENTE (CBUQ), CAMADA DE ROLAMENTO - EXCLUSIVE TRANSPORTE",95995,"M3",350.00000000000006,{"$f":"VLOOKUP(A22,CPU!$A$1:$N$4816,9)","v":129.6},{"$f":"VLOOKUP(A22,CPU!$A$1:$N$4816,10)","v":157.44999999999999},55107.5]
["C",3,"TRANSPORTE DE MATERIAIS",{"$nulls":5},{"$f":"SUM(I24:I25)","v":64800}]
[13,"3.1","TRANSPORTE COM CAMINHÃO BASCULANTE, EM VIA URBANA PAVIMENTADA",95427,"M3XKM",69999.996249999982,{"$f":"VLOOKUP(A24,CPU!$A$1:$N$4816,9)","v":0.73},{"$f":"VLOOKUP(A24,CPU!$A$1:$N$4816,10)","v":0.89},{"$f":"ROUND(F24*H24,2)","v":62300}]
[14,"3.2","TRANSPORTE COM CAMINHÃO CARROCERIA 9T, EM VIA URBANA PAVIMENTADA",100947,"TXKM",2000.000716,{"$f":"VLOOKUP(A25,CPU!$A$1:$N$4816,9)","v":1.03},{"$f":"VLOOKUP(A25,CPU!$A$1:$N$4816,10)","v":1.25},{"$f":"ROUND(F25*H25,2)","v":2500}]
["D",4,"TRANSPORTE DE MATERIAL ASFÁLTICO (BDI DIFERENCIADO)",{"$nulls":5},{"$f":"SUM(I27:I28)","v":87240}]
[15,"4.1","TRANSPORTE DE MASSA ASFÁLTICA COM CAMINHÃO BASCULANTE, EM VIA URBANA PAVIMENTADA (BDI DIFERENCIADO)",95430,"TXKM",162000,{"$f":"VLOOKUP(A27,CPU!$A$1:$N$4816,9)","v":0.44999999999999996},{"$f":"VLOOKUP(A27,CPU!$A$1:$N$4816,10)","v":0.52},{"$f":"ROUND(F27*H27,2)","v":84240}]
[16,"4.2","TRANSPORTE COM CAMINHÃO TANQUE DE TRANSPORTE DE MATERIAL ASFÁLTICO DE 30000 L, EM VIA URBANA PAVIMENTADA (BDI DIFERENCIADO)",102331,"TXKM",5000,{"$f":"VLOOKUP(A28,CPU!$A$1:$N$4816,9)","v":0.52},{"$f":"VLOOKUP(A28,CPU!$A$1:$N$4816,10)","v":0.6},{"$f":"ROUND(F28*H28,2)","v":3000}]
["E",5,"DRENAGEM E OBRAS COMPLEMENTARES",{"$nulls":5},{"$f":"SUM(I30:I42)","v":818703.4}]
[17,"5.1","GUIA (MEIO-FIO) E SARJETA CONJUGADOS DE CONCRETO, MOLDADA IN LOCO EM M CR 57,38 TRECHO RETO COM EXTRUSORA, 45 CM BASE (15 CM BASE DA GUIA + 30 CM BAS E DA SARJETA) X 22 CM ALTURA ",94267,"M",2900,{"$f":"VLOOKUP(A30,CPU!$A$1:$N$4816,9)","v":57.319999999999986},{"$f":"VLOOKUP(A30,CPU!$A$1:$N$4816,10)","v":69.64},{"$f":"ROUND(F30*H30,2)","v":201956}]
{"$rows_left_out":18}
{"sheet":"CPU","index":1,"n_rows":513,"n_cols":18,"rows_kept":513,"cut":false,"hidden":false,"merged":[[503,0,512,0],[503,1,503,3],[503,4,503,7],[504,2,504,5],[505,2,505,3],[506,1,506,7],[509,1,509,3],[509,5,509,6],[510,1,510,6],[511,1,511,6],[512,1,512,6],[492,0,501,0],[492,1,492,3],[492,4,492,7],[493,2,493,5],[494,2,494,3],[495,1,495,7],[498,1,498,3],[498,5,498,6],[499,1,499,6],[500,1,500,6],[501,1,501,6],[481,0,490,0],[481,1,481,3],[481,4,481,7],[482,2,482,5],[483,2,483,3],[484,1,484,7],[487,1,487,3],[487,5,487,6],[488,1,488,6],[489,1,489,6],[490,1,490,6],[463,0,479,0],[463,1,463,3],[463,4,463,7],[464,2,464,5],[465,2,465,3],[466,1,466,7],[476,1,476,3],[476,5,476,6],[477,1,477,6],[478,1,478,6],[479,1,479,6],[446,0,461,0],[446,1,446,3],[446,4,446,7],[447,2,447,5],[448,2,448,3],[449,1,449,7],[458,1,458,3],[458,5,458,6],[459,1,459,6],[460,1,460,6],[461,1,461,6],[429,0,444,0],[429,1,429,3],[429,4,429,7],[430,2,430,5],[431,2,431,3],[432,1,432,7],[441,1,441,3],[441,5,441,6],[442,1,442,6],[443,1,443,6],[444,1,444,6],[412,0,427,0],[412,1,412,3],[412,4,412,7],[413,2,413,5],[414,2,414,3],[415,1,415,7],[424,1,424,3],[424,5,424,6],[425,1,425,6],[426,1,426,6],[427,1,427,6],[397,0,410,0],[397,1,397,3],[397,4,397,7],[398,2,398,5],[399,2,399,3],[400,1,400,7],[407,1,407,3],[407,5,407,6],[408,1,408,6],[409,1,409,6],[410,1,410,6],[339,0,352,0],[339,1,339,3],[339,4,339,7],[340,2,340,5],[341,2,341,3],[342,1,342,7],[349,1,349,3],[349,5,349,6],[350,1,350,6],[351,1,351,6],[352,1,352,6],[323,0,337,0],[323,1,323,3],[323,4,323,7],[324,2,324,5],[325,2,325,3],[326,1,326,7],[334,1,334,3],[334,5,334,6],[335,1,335,6],[336,1,336,6],[337,1,337,6],[308,0,321,0],[308,1,308,3],[308,4,308,7],[309,2,309,5],[310,2,310,3],[311,1,311,7],[318,1,318,3],[318,5,318,6],[319,1,319,6],[320,1,320,6],[321,1,321,6],[294,0,306,0],[294,1,294,3],[294,4,294,7],[295,2,295,5],[296,2,296,3],[297,1,297,7],[303,1,303,3],[303,5,303,6],[304,1,304,6],[305,1,305,6],[306,1,306,6],[274,0,292,0],[274,1,274,3],[274,4,274,7],[275,2,275,5],[276,2,276,3],[277,1,277,7],[289,1,289,3],[289,5,289,6],[290,1,290,6],[291,1,291,6],[292,1,292,6],[256,0,272,0],[256,1,256,3],[256,4,256,7],[256,10,256,11],[257,2,257,5],[258,2,258,3],[259,1,259,7],[261,12,263,15],[269,1,269,3],[269,5,269,6],[270,1,270,6],[271,1,271,6],[272,1,272,6],[244,0,255,0],[244,1,244,3],[244,4,244,7],[244,10,244,11],[245,2,245,5],[246,2,246,3],[247,1,247,7],[251,1,251,3],[251,5,251,6],[252,1,252,6],[253,1,253,6],[254,1,254,6],[231,0,242,0],[231,1,231,3],[231,4,231,7],[232,2,232,5],[233,2,233,3],[234,1,234,7],[239,1,239,3],[239,5,239,6],[240,1,240,6],[241,1,241,6],[242,1,242,6],[218,0,229,0],[218,1,218,3],[218,4,218,7],[219,2,219,5],[220,2,220,3],[221,1,221,7],[226,1,226,3],[226,5,226,6],[227,1,227,6],[228,1,228,6],[229,1,229,6],[205,0,216,0],[205,1,205,3],[205,4,205,7],[205,10,205,11],[206,2,206,5],[207,2,207,3],[208,1,208,7],[213,1,213,3],[213,5,213,6],[214,1,214,6],[215,1,215,6],[216,1,216,6],[183,0,204,0],[183,1,183,3],[183,4,183,7],[183,10,183,11],[184,2,184,5],[185,2,185,3],[186,1,186,7],[188,8,188,9],[200,1,200,3],[200,5,200,6],[201,1,201,6],[202,1,202,6],[203,1,203,6],[164,0,182,0],[164,1,164,3],[164,4,164,7],[164,10,164,11],[165,2,165,5],[166,2,166,3],[167,1,167,7],[178,1,178,3],[178,5,178,6],[179,1,179,6],[180,1,180,6],[181,1,181,6],[141,1,141,6],[142,1,142,6],[143,1,143,6],[145,0,163,0],[145,1,145,3],[145,4,145,7],[145,10,145,11],[146,2,146,5],[147,2,147,3],[148,1,148,7],[159,1,159,3],[159,5,159,6],[160,1,160,6],[161,1,161,6],[162,1,162,6],[107,0,124,0],[107,1,107,3],[107,4,107,7],[107,10,107,11],[108,2,108,5],[109,2,109,3],[110,1,110,7],[120,1,120,3],[120,5,120,6],[121,1,121,6],[122,1,122,6],[123,1,123,6],[93,0,105,0],[93,1,93,3],[93,4,93,7],[94,2,94,5],[95,2,95,3],[96,1,96,7],[102,1,102,3],[102,5,102,6],[103,1,103,6],[104,1,104,6],[105,1,105,6],[80,0,92,0],[80,1,80,3],[80,4,80,7],[80,10,80,11],[81,2,81,5],[82,2,82,3],[83,1,83,7],[88,1,88,3],[88,5,88,6],[89,1,89,6],[90,1,90,6],[91,1,91,6],[64,0,79,0],[64,1,64,3],[64,4,64,7],[64,10,64,11],[65,2,65,5],[66,2,66,3],[67,1,67,7],[75,1,75,3],[75,5,75,6],[76,1,76,6],[77,1,77,6],[78,1,78,6],[46,0,63,0],[46,1,46,3],[46,4,46,7],[46,10,46,11],[47,2,47,5],[48,2,48,3],[49,1,49,7],[59,1,59,3],[59,5,59,6],[60,1,60,6],[61,1,61,6],[62,1,62,6],[32,0,45,0],[32,1,32,3],[32,4,32,7],[32,10,32,11],[33,2,33,5],[33,8,34,9],[34,2,34,3],[35,1,35,7],[41,1,41,3],[41,5,41,6],[42,1,42,6],[43,1,43,6],[44,1,44,6],[14,0,31,0],[14,1,14,3],[14,4,14,7],[14,10,14,11],[15,2,15,5],[15,8,16,9],[16,2,16,3],[17,1,17,7],[27,1,27,3],[27,5,27,6],[28,1,28,6],[29,1,29,6],[30,1,30,6],[0,0,13,0],[0,1,0,3],[0,4,0,7],[0,10,0,11],[1,2,1,5],[1,10,1,11],[2,2,2,3],[3,1,3,7],[9,1,9,3],[9,5,9,6],[10,1,10,6],[11,1,11,6],[12,1,12,6],[375,0,395,0],[375,1,375,3],[375,4,375,7],[376,2,376,5],[377,2,377,3],[378,1,378,7],[392,1,392,3],[392,5,392,6],[393,1,393,6],[394,1,394,6],[395,1,395,6],[135,8,136,8],[135,9,136,9],[135,10,136,10],[135,11,136,11],[135,12,136,12],[354,0,373,0],[354,1,354,3],[354,4,354,7],[355,2,355,5],[356,2,356,3],[357,1,357,7],[370,1,370,3],[370,5,370,6],[371,1,371,6],[372,1,372,6],[373,1,373,6],[125,0,143,0],[125,1,125,3],[125,4,125,7],[126,2,126,5],[127,2,127,3],[128,1,128,7],[140,1,140,3],[140,5,140,6]]}
[1,"CODEVASF",null,null," COMPOSIÇÃO DE PREÇO UNITÁRIO",null,null,null,{"$f":"H11","v":13860.2},{"$f":"H13","v":16838.759999999998},"BDI CALCULADO:",null,{"$f":"ORÇAMENTO!I6","v":0.21489999999999998}]
[null,"OBRA:  ",{"$f":"ORÇAMENTO!C5","v":" PAVIMENTAÇÃO ASFÁLTICA EM CBUQ E REDE DE ESGOTO URBANA - LOTEAMENTO NOVA CONQUISTA (MATUTINA / MG) - ITEM 1"},null,null,null,"DATA: ",{"$f":"ORÇAMENTO!C6","v":" SETEMBRO / 2023   "},null,null,"BDI DIFERENCIADO:",null,{"$f":"'BDI FORN'!D31/100","v":0.15}]
[null,"SERVIÇO:  ",{"$f":"VLOOKUP(A1,ORÇAMENTO!A10:I30,3)","v":"MOBILIZAÇÃO E DESMOBILIZAÇÃO"},null,"Referência:",{"$f":"VLOOKUP(A1,ORÇAMENTO!$A$10:$I$30,4)","v":"CPU.1"},"UNIDADE: ",{"$f":"VLOOKUP(A1,ORÇAMENTO!A10:I30,5)","v":"GL"}]
[]
[null,"TIPO ITEM","CODIGO ITEM","DESCRIÇÃO ITEM","UNIDADE ITEM","COEFICIENTE","PRECO UNITARIO","CUSTO TOTAL"]
[null,"COMPOSICAO",89876,"CAMINHÃO BASCULANTE 14 M3, COM CAVALO MECÂNICO DE CAPACIDADE MÁXIMA DE TRAÇÃO COMBINADO DE 36000 KG, POTÊNCIA 286 CV, INCLUSIVE SEMIREBOQUE COM CAÇAMBA METÁLICA","CHP DIURNO.",8,316.13,{"$f":"ROUNDDOWN(F6*G6,2)","v":2529.04}]
[null,"COMPOSICAO",89877,"CAMINHÃO BASCULANTE 14 M3, COM CAVALO MECÂNICO DE CAPACIDADE MÁXIMA DE TRAÇÃO COMBINADO DE 36000 KG, POTÊNCIA 286 CV, INCLUSIVE SEMIREBOQUE COM CAÇAMBA METÁLICA","CHI DIURNO.",8,89.75,{"$f":"ROUNDDOWN(F7*G7,2)","v":718}]
[null,"COMPOSICAO",5914640,"TRANSPORTE COM CAVALO MECÂNICO COM SEMIRREBOQUE COM CAPACIDADE DE 30 T - RODOVIA PAVIMENTADA","T.KM",5805,0.57999999999999996,{"$f":"ROUNDDOWN(F8*G8,2)","v":3366.9}]
[null,"COMPOSIÇÃO",88316,"SERVENTE COM ENCARGOS COMPLEMENTARES","H",16,19.760000000000002,{"$f":"ROUNDDOWN(F9*G9,2)","v":316.16000000000003}]
[null,"PRODUÇÃO DA EQUIPE",null,null,0.5,"CUSTO ",null,{"$f":"SUM(H6:H9)","v":6930.1}]
[null,"TOTAL",{"$nulls":5},{"$f":"H10/E10","v":13860.2},"OK"]
[null,"BDI                %",{"$nulls":5},{"$f":"1+$M$1","v":1.2149000000000001}]
[null,"TOTAL DO SERVIÇO - R$",{"$nulls":5},{"$f":"ROUND(H11*H12,2)","v":16838.759999999998}]
[]
[{"$f":"A1+1","v":2},"CODEVASF",null,null," COMPOSIÇÃO DE PREÇO UNITÁRIO",null,null,null,{"$f":"H29","v":125123.28},{"$f":"H31","v":152012.26999999999}]
[null,"OBRA:  ",{"$f":"$C$2","v":" PAVIMENTAÇÃO ASFÁLTICA EM CBUQ E REDE DE ESGOTO URBANA - LOTEAMENTO NOVA CONQUISTA (MATUTINA / MG) - ITEM 1"},null,null,null,"DATA: ",{"$f":"$H$2","v":" SETEMBRO / 2023   "}]
[null,"SERVIÇO:  ",{"$f":"VLOOKUP(A15,ORÇAMENTO!$A$10:$I$30,3)","v":"ADMINISTRAÇÃO LOCAL"},null,"SINAPI",{"$f":"VLOOKUP(A15,ORÇAMENTO!$A$10:$I$30,4)","v":"CPU.2"},"UNIDADE: ",{"$f":"VLOOKUP(A15,ORÇAMENTO!$A$10:$I$30,5)","v":"GL"}]
[]
[null,"TIPO ITEM","CODIGO ITEM","DESCRIÇÃO ITEM","UNIDADE ITEM","COEFICIENTE","PRECO UNITARIO","CUSTO TOTAL"]
[null,"INSUMO",14250,"ENERGIA ELÉTRICA","kwh",60,0.94,{"$f":"ROUNDDOWN(F20*G20,2)","v":56.4}]
[null,"INSUMO",44480,"TARIFA \"A\" - ÁGUA/ESGOTO ","m³",6,17.78,106.68]
[null,"COTAÇÃO","MERC.","TELEFONE (PLANO CONTROLE)","UNID",2,59.9,119.8]
[null,"INSUMO","ED-50155 SEINFRA","BANHEIRO QUÍMICO 110 X 120 X 230 CM COM MANUTENÇÃO (CONSIDERANDO OBRAS SIMULTÂNEAS)","MÊS",2,820,1640]
[null,"COMPOSICAO",90777,"Engenheiro Civil Júnior com encargos complementares","H",55,114.12,6276.6]
[null,"COMPOSICAO",90776,"Encarregado Geral com encargos complementares","H",110,57.73,6350.3]
[null,"COMPOSICAO",88321,"Tecnico de Laboratório com encargos complementares","H",110,45.45,4999.5]
[null,"COMPOSICAO",90772,"Auxiliar de escritório com encargos complementares","H",55,23.72,1304.5999999999999]
[null,"PRODUÇÃO DA EQUIPE",null,null,{"$f":"1/6","v":0.16666666666666666},"CUSTO ",null,{"$f":"SUM(H20:H27)","v":20853.879999999997}]
[null,"TOTAL",{"$nulls":5},{"$f":"ROUND(H28/E28,2)","v":125123.28},"OK"]
[null,"BDI                %",{"$nulls":5},{"$f":"1+$M$1","v":1.2149000000000001}]
{"$rows_left_out":484}
{"sheet":"BDI SERV","index":2,"n_rows":37,"n_cols":20,"rows_kept":37,"cut":false,"hidden":false,"merged":[[31,1,31,2],[32,0,34,5],[36,0,36,5],[0,1,2,4],[3,1,4,1],[3,2,4,2],[28,0,28,5],[30,1,30,2]]}
[null,"DETALHAMENTO DO BDI - SERVIÇOS"]
[]
[]
[null,"Item","Descrição dos Serviços","%","%"]
[null,null,null,"PV","CD"]
[]
[null,1,"ADMINISTRAÇÃO CENTRAL"," ",4.01]
[null,"1.1","ESCRITÓRIO CENTRAL"," "," "]
[null,"1.2","VIAGENS"," "," "]
[null,"1.3","OUTROS"," "," "]
[null," "," "," "," "]
[null,2,"IMPOSTOS E TAXAS",{"$f":"SUM(D13:D16)","v":5.65},{"$f":"SUM(E13:E16)","v":7.0600000000000005}]
[null,"2.1","ISS (*)",2,{"$f":"ROUND(D13*1.2515,2)","v":2.5}]
[null,"2.2","PIS",0.65,{"$f":"ROUND(D14*1.2515,2)","v":0.81}]
[null,"2.3","Cofins",3,{"$f":"ROUND(D15*1.2515,2)","v":3.75}]
[null,"2.4","CONTRIBUIÇÃO PREVIDENCIÁRIA SOBRE A RENDA BRUTA",0,{"$f":"ROUND(D16*1.2515,2)","v":0}]
[]
[null,3,"TAXA DE RISCO"," ",{"$f":"SUM(E19:E22)","v":0.96}]
[null,"3.1","SEGURO",null,0.2]
[null,"3.2","RISCO",null,0.56000000000000005]
[null,"3.3","GARANTIA",null,0.2]
[{"$nulls":19},{"$f":"1/0.82","v":1.2195121951219512}]
[null,4,"DESPESAS FINANCEIRAS"," ",1.1100000000000001]
[]
[null,5,"LUCRO",null,8]
[]
[null," ","BDI - CALCULADO"," ",{"$f":"ROUND((((1+(E7+E18)/100)*(1+E23/100)*(1+E25/100)/(1-D12/100)-1)*100),2)","v":21.49}]
[]
["BDI = ((1+((AC+S+R+G)/100))x(1+DF/100)x(1+L/100)/(1-I/100)-1)*100"]
[]
{"$rows_left_out":8}
{"sheet":"BDI FORN","index":3,"n_rows":37,"n_cols":5,"rows_kept":37,"cut":false,"hidden":false,"merged":[[31,1,31,2],[32,0,34,5],[36,0,36,5],[0,1,2,4],[3,1,4,1],[3,2,4,2],[28,0,28,5],[30,1,30,2]]}
[null,"DETALHAMENTO DO BDI - FORNECIMENTO \n(MATERIAL ASFÁLTICO)"]
[]
[]
[null,"Item","Descrição dos Serviços","%","%"]
[null,null,null,"PV","CD"]
[]
[null,1,"ADMINISTRAÇÃO CENTRAL"," ",3.72]
[null,"1.1","ESCRITÓRIO CENTRAL"," "," "]
[null,"1.2","VIAGENS"," "," "]
[null,"1.3","OUTROS"," "," "]
[null," "," "," "," "]
[null,2,"IMPOSTOS E TAXAS",{"$f":"SUM(D13:D16)","v":3.65},{"$f":"SUM(E13:E16)","v":4.5600000000000005}]
[null,"2.1","ISS (*)",null,{"$f":"ROUND(D13*1.2515,2)","v":0}]
[null,"2.2","PIS",0.65,{"$f":"ROUND(D14*1.2515,2)","v":0.81}]
[null,"2.3","Cofins",3,{"$f":"ROUND(D15*1.2515,2)","v":3.75}]
[null,"2.4","CONTRIBUIÇÃO PREVIDENCIÁRIA SOBRE A RENDA BRUTA",0,{"$f":"ROUND(D16*1.2515,2)","v":0}]
[]
[null,3,"TAXA DE RISCO"," ",{"$f":"SUM(E19:E22)","v":0.82000000000000006}]
[null,"3.1","SEGURO",null,0.16]
[null,"3.2","RISCO",null,0.5]
[null,"3.3","GARANTIA",null,0.16]
[]
[null,4,"DESPESAS FINANCEIRAS"," ",0.94]
[]
[null,5,"LUCRO",null,5]
[]
[null," ","BDI - CALCULADO"," ",{"$f":"ROUND((((1+(E7+E18)/100)*(1+E23/100)*(1+E25/100)/(1-D12/100)-1)*100),2)","v":15}]
[]
["BDI = ((1+((AC+S+R+G)/100))x(1+DF/100)x(1+L/100)/(1-I/100)-1)*100"]
[]
{"$rows_left_out":8}
{"sheet":"CRONOGRAMA","index":4,"n_rows":21,"n_cols":12,"rows_kept":21,"cut":false,"hidden":false,"merged":[[17,1,18,2],[20,1,24,11],[13,0,14,0],[13,1,14,1],[13,2,14,2],[15,0,16,0],[15,1,16,1],[15,2,16,2],[9,0,10,0],[9,1,10,1],[9,2,10,2],[11,0,12,0],[11,1,12,1],[11,2,12,2],[3,1,3,10],[5,0,6,0],[5,1,6,1],[5,2,6,2],[7,0,8,0],[7,1,8,1],[7,2,8,2],[0,1,0,11],[1,1,2,1],[1,2,2,4],[1,6,1,11],[2,6,2,11]]}
[null,"CRONOGRAMA FÍSICO-FINANCEIRO"]
[null,"OBRA: ",{"$f":"ORÇAMENTO!C5","v":" PAVIMENTAÇÃO ASFÁLTICA EM CBUQ E REDE DE ESGOTO URBANA - LOTEAMENTO NOVA CONQUISTA (MATUTINA / MG) - ITEM 1"},null,null,"VALOR:",{"$f":"ORÇAMENTO!I47","v":2063405.0100000002}]
[{"$nulls":5},"PRAZO: ","180 DIAS "]
[]
[null,"ITEM","ETAPAS/DESCRIÇAO","FISICO/  FINANCEIRO","TOTAL    ETAPAS","MÊS 1","MÊS 2","MÊS 3","MÊS 4","MÊS 5","MÊS 6","TOTAL"]
["A",{"$f":"VLOOKUP(A6,ORÇAMENTO!$A$9:$I$47,2)","v":1},{"$f":"VLOOKUP(A6,ORÇAMENTO!$A$9:$I$47,3)","v":"SERVIÇOS PRELIMINARES "},"FISICO ",{"$f":"ROUND(E7/$G$2,4)","v":9.2799999999999994E-2},0.1,0.2,0.2,0.2,0.2,0.1,{"$f":"SUM(F6:K6)","v":0.99999999999999989}]
[null,null,null,"FINANCEIRO",{"$f":"ORÇAMENTO!I9","v":191531.46000000002},{"$f":"ROUND($E$7*F6,2)","v":19153.150000000001},{"$f":"ROUND($E$7*G6,2)","v":38306.29},{"$f":"ROUND($E$7*H6,2)","v":38306.29},{"$f":"ROUND($E$7*I6,2)","v":38306.29},38306.29,{"$f":"ROUND($E$7*K6,2)","v":19153.150000000001},{"$f":"SUM(F7:K7)","v":191531.46000000002}]
["B",{"$f":"VLOOKUP(A8,ORÇAMENTO!$A$9:$I$47,2)","v":2},{"$f":"VLOOKUP(A8,ORÇAMENTO!$A$9:$I$47,3)","v":"PAVIMENTAÇÃO"},"FISICO ",{"$f":"ROUND(E9/$G$2,4)","v":0.112},0,0,0.25,0.25,0.25,0.25,{"$f":"SUM(F8:K8)","v":1}]
[null,null,null,"FINANCEIRO",{"$f":"ORÇAMENTO!I15","v":231125.5},{"$f":"ROUND($E$9*F8,2)","v":0},{"$f":"ROUND($E$9*G8,2)","v":0},{"$f":"ROUND($E$9*H8,2)","v":57781.38},57781.38,57781.38,57781.38,{"$f":"SUM(F9:K9)","v":231125.52}]
["C",{"$f":"VLOOKUP(A10,ORÇAMENTO!$A$9:$I$47,2)","v":3},{"$f":"VLOOKUP(A10,ORÇAMENTO!$A$9:$I$47,3)","v":"TRANSPORTE DE MATERIAIS"},"FISICO ",{"$f":"ROUND(E11/$G$2,4)","v":3.1399999999999997E-2},0.1,0.2,0.2,0.2,0.2,0.1,{"$f":"SUM(F10:K10)","v":0.99999999999999989}]
[null,null,null,"FINANCEIRO",{"$f":"ORÇAMENTO!I23","v":64800},{"$f":"ROUND($E$11*F10,2)","v":6480},{"$f":"ROUND($E$11*G10,2)","v":12960},{"$f":"ROUND($E$11*H10,2)","v":12960},{"$f":"ROUND($E$11*I10,2)","v":12960},12960,{"$f":"ROUND($E$11*K10,2)","v":6480},{"$f":"SUM(F11:K11)-0.04","v":64799.96}]
["D",{"$f":"VLOOKUP(A12,ORÇAMENTO!$A$9:$I$47,2)","v":4},{"$f":"VLOOKUP(A12,ORÇAMENTO!$A$9:$I$47,3)","v":"TRANSPORTE DE MATERIAL ASFÁLTICO (BDI DIFERENCIADO)"},"FISICO ",{"$f":"ROUND(E13/$G$2,4)","v":4.2299999999999997E-2},0,0,0.25,0.25,0.25,0.25,{"$f":"SUM(F12:K12)","v":1}]
[null,null,null,"FINANCEIRO",{"$f":"ORÇAMENTO!I26","v":87240},{"$f":"ROUND($E$13*F12,2)","v":0},{"$f":"ROUND($E$13*G12,2)","v":0},{"$f":"ROUND($E$13*H12,2)","v":21810},{"$f":"ROUND($E$13*I12,2)","v":21810},21810,{"$f":"ROUND($E$13*K12,2)","v":21810},{"$f":"SUM(F13:K13)-0.02","v":87239.98}]
["E",{"$f":"VLOOKUP(A14,ORÇAMENTO!$A$9:$I$47,2)","v":5},{"$f":"VLOOKUP(A14,ORÇAMENTO!$A$9:$I$47,3)","v":"DRENAGEM E OBRAS COMPLEMENTARES"},"FISICO ",{"$f":"ROUND(E15/$G$2,4)","v":0.39679999999999999},0.3,0.3,0.1,0.1,0.1,0.1,{"$f":"SUM(F14:K14)","v":0.99999999999999989}]
[null,null,null,"FINANCEIRO",{"$f":"ORÇAMENTO!I29","v":818703.4},{"$f":"ROUND($E$15*F14,2)","v":245611.02},{"$f":"ROUND($E$15*G14,2)","v":245611.02},{"$f":"ROUND($E$15*H14,2)","v":81870.34},{"$f":"ROUND($E$15*I14,2)","v":81870.34},81870.34,{"$f":"ROUND($E$15*K14,2)","v":81870.34},{"$f":"SUM(F15:K15)-0.02","v":818703.37999999989}]
["F",{"$f":"VLOOKUP(A16,ORÇAMENTO!$A$9:$I$47,2)","v":6},{"$f":"VLOOKUP(A16,ORÇAMENTO!$A$9:$I$47,3)","v":"FORNECIMENTOS - MATERIAL ASFÁLTICO (BDI DIFERENCIADO)"},"FISICO ",{"$f":"ROUND(E17/$G$2,4)","v":0.32469999999999999},0,0,0.25,0.25,0.25,0.25,{"$f":"SUM(F16:K16)","v":1}]
[null,null,null,"FINANCEIRO",{"$f":"ORÇAMENTO!I43","v":670004.65},{"$f":"ROUND($E$17*F16,2)","v":0},{"$f":"ROUND($E$17*G16,2)","v":0},{"$f":"ROUND($E$17*H16,2)","v":167501.16},{"$f":"ROUND($E$17*I16,2)","v":167501.16},167501.16,{"$f":"ROUND($E$17*K16,2)","v":167501.16},{"$f":"SUM(F17:K17)-0.02","v":670004.62}]
[null,"TOTAL",null,"FISICO ",{"$f":"SUM(F18:K18)","v":1.0000000048463584},{"$f":"F19/$E$19","v":0.13145464350694777},{"$f":"G19/$E$19","v":0.14387738159073291},{"$f":"H19/$E$19","v":0.18427267945811573},{"$f":"I19/$E$19","v":0.18427267945811573},0.18427267945811573,{"$f":"K19/$E$19","v":0.1718499413743306},{"$f":"SUM(F18:K18)","v":1.0000000048463584}]
[null,null,null,"FINANCEIRO",{"$f":"E11+E9+E7+E13+E17+E15","v":2063405.0099999998},{"$f":"F11+F9+F7+F13+F17+F15","v":271244.17},{"$f":"G11+G9+G7+G13+G17+G15","v":296877.31},{"$f":"H11+H9+H7+H13+H17+H15","v":380229.17000000004},{"$f":"I11+I9+I7+I13+I17+I15","v":380229.17000000004},380229.17000000004,{"$f":"K11+K9+K7+K13+K17+K15","v":354596.03},{"$f":"SUM(F19:K19)-0.01","v":2063405.0100000002}]
[]
[null,"OBSERVAÇÕES:"]