{"text_format":"2","workbook":"xlsx","n_sheets":6,"sheets":["ORÇAMENTO","CPU","BDI SERV","BDI FORN","CRONOGRAMA","CALC.MAT"],"not_rendered":{"charts":0,"images":5,"macros":0,"external_links":0,"defined_names":6,"comments":1,"pivot_tables":0},"unopened":[],"bounds":{"document_bytes":16777216,"sheet_cells":100000,"run_cost":"one","rows_first":2000,"rows_last":500,"rows_between":2000,"halvings":0,"cell_chars":16384,"cell_head_chars":4096},"cells_cut":0,"cells_raw":0,"read":"whole","date_system":"1900"}

{"sheet":"ORÇAMENTO","index":0,"n_rows":41,"n_cols":9,"rows_kept":41,"cut":false,"hidden":false,"merged":[[40,1,40,2],[0,0,7,0],[0,2,0,8],[1,2,1,8],[2,2,2,8],[4,2,4,8],[5,6,5,7],[6,1,6,2],[6,6,6,7]]}
["<---- NUMERAR SERVIÇOS PARA CPU",null,"Ministério do Desenvolvimento Regional"]
[null,null,"Companhia de Desenvolvimento dos Vales do São Francisco e do Parnaíba"]
[null,null,"1ª Superintendência Regional"]
[]
[null,"OBRA: "," RECAPEAMENTO E PAVIMENTAÇÃO ASFÁLTICA EM CBUQ - VIAS URBANAS DIVERSAS (SERRA DA SAUDADE / MG) - ITEM 2"]
[null,"DATA:"," SETEMBRO / 2023   ",null,null,null,"BDI Serviços:",null,{"$f":"'BDI SERV'!D31/100","v":0.21489999999999998}]
[null,"PRAZO DE EXECUÇÃO:     180 DIAS",{"$nulls":4},"BDI Serviços:",null,{"$f":"'BDI FORN'!D31/100","v":0.15}]
[null,"ITEM","DISCRIMINAÇÃO","REFER.","UNID.","QUANT.","P. UNITÁRIO","P.UNIT.C/ BDI","P. TOTAL"]
["A",1,"SERVIÇOS PRELIMINARES ",{"$nulls":5},{"$f":"SUM(I10:I14)","v":221440.67}]
[1,"1.1","MOBILIZAÇÃO E DESMOBILIZAÇÃO","CPU.1","GL",1,{"$f":"VLOOKUP(A10,CPU!$A$1:$N$4709,9)","v":13860.2},{"$f":"VLOOKUP(A10,CPU!$A$1:$N$4709,10)","v":16838.759999999998},{"$f":"ROUND(F10*H10,2)","v":16838.759999999998}]
[2,"1.2","ADMINISTRAÇÃO LOCAL","CPU.2","GL",1,{"$f":"VLOOKUP(A11,CPU!$A$1:$N$4709,9)","v":148226.57999999999},{"$f":"VLOOKUP(A11,CPU!$A$1:$N$4709,10)","v":180080.47},{"$f":"ROUND(F11*H11,2)","v":180080.47}]
[3,"1.3","CANTEIRO DE OBRAS","CPU.3","GL",1,{"$f":"VLOOKUP(A12,CPU!$A$1:$N$4709,9)","v":13531.5},{"$f":"VLOOKUP(A12,CPU!$A$1:$N$4709,10)","v":16439.419999999998},{"$f":"ROUND(F12*H12,2)","v":16439.419999999998}]
[4,"1.4","PLACA DE OBRA EM CHAPA DE AÇO GALVANIZADO",103689,"M2",6,{"$f":"VLOOKUP(A13,CPU!$A$1:$N$4709,9)","v":340.5},{"$f":"VLOOKUP(A13,CPU!$A$1:$N$4709,10)","v":413.67},{"$f":"ROUND(F13*H13,2)","v":2482.02}]
[5,"1.5","SERVIÇOS TOPOGRÁFICOS PARA PAVIMENTAÇÃO, INCLUSIVE NOTA DE SERVIÇO, ACOMPANHAMENTO E GREIDE",78472,"M2",13999.998,{"$f":"VLOOKUP(A14,CPU!$A$1:$N$4709,9)","v":0.32999999999999996},{"$f":"VLOOKUP(A14,CPU!$A$1:$N$4709,10)","v":0.4},{"$f":"ROUND(F14*H14,2)","v":5600}]
["B",2,"PAVIMENTAÇÃO",{"$nulls":5},{"$f":"SUM(I16:I22)","v":458046.5}]
[6,"2.1","ESCAVAÇÃO HORIZONTAL EM SOLO DE 1A CATEGORIA ",101116,"M3",2800,{"$f":"VLOOKUP(A16,CPU!$A$1:$N$4709,9)","v":2.2000000000000002},{"$f":"VLOOKUP(A16,CPU!$A$1:$N$4709,10)","v":2.67},{"$f":"ROUND(F16*H16,2)","v":7476}]
[7,"2.2","CARGA, MANOBRA E DESCARGA DE SOLOS E MATERIAIS GRANULARES EM CAMINHÃO BASCULANTE",100976,"M3",2800,{"$f":"VLOOKUP(A17,CPU!$A$1:$N$4709,9)","v":8.7100000000000009},{"$f":"VLOOKUP(A17,CPU!$A$1:$N$4709,10)","v":10.58},29624]
[8,"2.3","REGULARIZAÇÃO E COMPACTAÇÃO DO SUBLEITO ",100576,"M2",14000.000000000002,{"$f":"VLOOKUP(A18,CPU!$A$1:$N$4709,9)","v":2.57},{"$f":"VLOOKUP(A18,CPU!$A$1:$N$4709,10)","v":3.12},43680]
[9,"2.4","EXECUÇÃO E COMPACTAÇÃO DE BASE E OU SUB BASE PARA PAVIMENTAÇÃO DE BICA CORRIDA - EXCLUSIVE CARGA E TRANSPORTE",96396,"M3",2000.0000000000002,{"$f":"VLOOKUP(A19,CPU!$A$1:$N$4709,9)","v":104.95},{"$f":"VLOOKUP(A19,CPU!$A$1:$N$4709,10)","v":127.5},255000]
[10,"2.5","IMPRIMAÇÃO COM EMULSÃO ASFÁLTICA (EAI)",96401,"M2",14000.000000000002,{"$f":"VLOOKUP(A20,CPU!$A$1:$N$4709,9)","v":1.23},{"$f":"VLOOKUP(A20,CPU!$A$1:$N$4709,10)","v":1.49},20860]
{"$rows_left_out":22}
{"sheet":"CPU","index":1,"n_rows":406,"n_cols":18,"rows_kept":406,"cut":false,"hidden":false,"merged":[[291,0,303,0],[291,1,291,3],[291,4,291,7],[292,2,292,5],[293,2,293,3],[294,1,294,7],[300,1,300,3],[300,5,300,6],[301,1,301,6],[302,1,302,6],[303,1,303,6],[275,0,289,0],[275,1,275,3],[275,4,275,7],[276,2,276,5],[277,2,277,3],[278,1,278,7],[286,1,286,3],[286,5,286,6],[287,1,287,6],[288,1,288,6],[289,1,289,6],[0,0,13,0],[0,1,0,3],[0,4,0,7],[0,10,0,11],[1,2,1,5],[1,10,1,11],[2,2,2,3],[3,1,3,7],[9,1,9,3],[9,5,9,6],[10,1,10,6],[11,1,11,6],[12,1,12,6],[14,0,31,0],[14,1,14,3],[14,4,14,7],[14,10,14,11],[15,2,15,5],[15,8,16,9],[16,2,16,3],[17,1,17,7],[27,1,27,3],[27,5,27,6],[28,1,28,6],[29,1,29,6],[30,1,30,6],[32,0,45,0],[32,1,32,3],[32,4,32,7],[32,10,32,11],[33,2,33,5],[33,8,34,9],[34,2,34,3],[35,1,35,7],[41,1,41,3],[41,5,41,6],[42,1,42,6],[43,1,43,6],[44,1,44,6],[46,0,63,0],[46,1,46,3],[46,4,46,7],[46,10,46,11],[47,2,47,5],[48,2,48,3],[49,1,49,7],[59,1,59,3],[59,5,59,6],[60,1,60,6],[61,1,61,6],[62,1,62,6],[64,0,79,0],[64,1,64,3],[64,4,64,7],[64,10,64,11],[65,2,65,5],[66,2,66,3],[67,1,67,7],[75,1,75,3],[75,5,75,6],[76,1,76,6],[77,1,77,6],[78,1,78,6],[80,0,92,0],[80,1,80,3],[80,4,80,7],[80,10,80,11],[81,2,81,5],[82,2,82,3],[83,1,83,7],[88,1,88,3],[88,5,88,6],[89,1,89,6],[90,1,90,6],[91,1,91,6],[93,0,105,0],[93,1,93,3],[93,4,93,7],[94,2,94,5],[95,2,95,3],[96,1,96,7],[102,1,102,3],[102,5,102,6],[103,1,103,6],[104,1,104,6],[105,1,105,6],[107,0,124,0],[107,1,107,3],[107,4,107,7],[107,10,107,11],[108,2,108,5],[109,2,109,3],[110,1,110,7],[120,1,120,3],[120,5,120,6],[121,1,121,6],[122,1,122,6],[123,1,123,6],[142,1,142,6],[143,1,143,6],[144,1,144,6],[146,0,164,0],[146,1,146,3],[146,4,146,7],[146,10,146,11],[147,2,147,5],[148,2,148,3],[149,1,149,7],[160,1,160,3],[160,5,160,6],[161,1,161,6],[162,1,162,6],[163,1,163,6],[125,0,144,0],[125,1,125,3],[125,4,125,7],[126,2,126,5],[127,2,127,3],[128,1,128,7],[141,1,141,3],[141,5,141,6],[165,0,183,0],[165,1,165,3],[165,4,165,7],[165,10,165,11],[166,2,166,5],[167,2,167,3],[168,1,168,7],[179,1,179,3],[179,5,179,6],[180,1,180,6],[181,1,181,6],[182,1,182,6],[184,0,205,0],[184,1,184,3],[184,4,184,7],[184,10,184,11],[185,2,185,5],[186,2,186,3],[187,1,187,7],[189,8,189,9],[201,1,201,3],[201,5,201,6],[202,1,202,6],[203,1,203,6],[204,1,204,6],[206,0,217,0],[206,1,206,3],[206,4,206,7],[206,10,206,11],[207,2,207,5],[208,2,208,3],[209,1,209,7],[214,1,214,3],[214,5,214,6],[215,1,215,6],[216,1,216,6],[217,1,217,6],[219,0,230,0],[219,1,219,3],[219,4,219,7],[220,2,220,5],[221,2,221,3],[222,1,222,7],[227,1,227,3],[227,5,227,6],[228,1,228,6],[229,1,229,6],[230,1,230,6],[232,0,243,0],[232,1,232,3],[232,4,232,7],[233,2,233,5],[234,2,234,3],[235,1,235,7],[240,1,240,3],[240,5,240,6],[241,1,241,6],[242,1,242,6],[243,1,243,6],[245,0,256,0],[245,1,245,3],[245,4,245,7],[245,10,245,11],[246,2,246,5],[247,2,247,3],[248,1,248,7],[252,1,252,3],[252,5,252,6],[253,1,253,6],[254,1,254,6],[255,1,255,6],[257,0,273,0],[257,1,257,3],[257,4,257,7],[257,10,257,11],[258,2,258,5],[259,2,259,3],[260,1,260,7],[262,12,264,15],[270,1,270,3],[270,5,270,6],[271,1,271,6],[272,1,272,6],[273,1,273,6],[305,0,320,0],[305,1,305,3],[305,4,305,7],[306,2,306,5],[307,2,307,3],[308,1,308,7],[317,1,317,3],[317,5,317,6],[318,1,318,6],[319,1,319,6],[320,1,320,6],[322,0,337,0],[322,1,322,3],[322,4,322,7],[323,2,323,5],[324,2,324,3],[325,1,325,7],[334,1,334,3],[334,5,334,6],[335,1,335,6],[336,1,336,6],[337,1,337,6],[339,0,354,0],[339,1,339,3],[339,4,339,7],[340,2,340,5],[341,2,341,3],[342,1,342,7],[351,1,351,3],[351,5,351,6],[352,1,352,6],[353,1,353,6],[354,1,354,6],[356,0,372,0],[356,1,356,3],[356,4,356,7],[357,2,357,5],[358,2,358,3],[359,1,359,7],[369,1,369,3],[369,5,369,6],[370,1,370,6],[371,1,371,6],[372,1,372,6],[374,0,383,0],[374,1,374,3],[374,4,374,7],[375,2,375,5],[376,2,376,3],[377,1,377,7],[380,1,380,3],[380,5,380,6],[381,1,381,6],[382,1,382,6],[383,1,383,6],[385,0,394,0],[385,1,385,3],[385,4,385,7],[386,2,386,5],[387,2,387,3],[388,1,388,7],[391,1,391,3],[391,5,391,6],[392,1,392,6],[393,1,393,6],[394,1,394,6],[396,0,405,0],[396,1,396,3],[396,4,396,7],[397,2,397,5],[398,2,398,3],[399,1,399,7],[402,1,402,3],[402,5,402,6],[403,1,403,6],[404,1,404,6],[405,1,405,6]]}
[1,"CODEVASF",null,null," COMPOSIÇÃO DE PREÇO UNITÁRIO",null,null,null,{"$f":"H11","v":13860.2},{"$f":"H13","v":16838.759999999998},"BDI CALCULADO:",null,{"$f":"ORÇAMENTO!I6","v":0.21489999999999998}]
[null,"OBRA:  ",{"$f":"ORÇAMENTO!C5","v":" RECAPEAMENTO E PAVIMENTAÇÃO ASFÁLTICA EM CBUQ - VIAS URBANAS DIVERSAS (SERRA DA SAUDADE / MG) - ITEM 2"},null,null,null,"DATA: ",{"$f":"ORÇAMENTO!C6","v":" SETEMBRO / 2023   "},null,null,"BDI DIFERENCIADO:",null,{"$f":"'BDI FORN'!D31/100","v":0.15}]
[null,"SERVIÇO:  ",{"$f":"VLOOKUP(A1,ORÇAMENTO!A10:I30,3)","v":"MOBILIZAÇÃO E DESMOBILIZAÇÃO"},null,"Referência:",{"$f":"VLOOKUP(A1,ORÇAMENTO!$A$10:$I$30,4)","v":"CPU.1"},"UNIDADE: ",{"$f":"VLOOKUP(A1,ORÇAMENTO!A10:I30,5)","v":"GL"}]
[]
[null,"TIPO ITEM","CODIGO ITEM","DESCRIÇÃO ITEM","UNIDADE ITEM","COEFICIENTE","PRECO UNITARIO","CUSTO TOTAL"]
[null,"COMPOSICAO",89876,"CAMINHÃO BASCULANTE 14 M3, COM CAVALO MECÂNICO DE CAPACIDADE MÁXIMA DE TRAÇÃO COMBINADO DE 36000 KG, POTÊNCIA 286 CV, INCLUSIVE SEMIREBOQUE COM CAÇAMBA METÁLICA","CHP DIURNO.",8,316.13,{"$f":"ROUNDDOWN(F6*G6,2)","v":2529.04}]
[null,"COMPOSICAO",89877,"CAMINHÃO BASCULANTE 14 M3, COM CAVALO MECÂNICO DE CAPACIDADE MÁXIMA DE TRAÇÃO COMBINADO DE 36000 KG, POTÊNCIA 286 CV, INCLUSIVE SEMIREBOQUE COM CAÇAMBA METÁLICA","CHI DIURNO.",8,89.75,{"$f":"ROUNDDOWN(F7*G7,2)","v":718}]
[null,"COMPOSICAO",5914640,"TRANSPORTE COM CAVALO MECÂNICO COM SEMIRREBOQUE COM CAPACIDADE DE 30 T - RODOVIA PAVIMENTADA","T.KM",5805,0.57999999999999996,{"$f":"ROUNDDOWN(F8*G8,2)","v":3366.9}]
[null,"COMPOSIÇÃO",88316,"SERVENTE COM ENCARGOS COMPLEMENTARES","H",16,19.760000000000002,{"$f":"ROUNDDOWN(F9*G9,2)","v":316.16000000000003}]
[null,"PRODUÇÃO DA EQUIPE",null,null,0.5,"CUSTO ",null,{"$f":"SUM(H6:H9)","v":6930.1}]
[null,"TOTAL",{"$nulls":5},{"$f":"H10/E10","v":13860.2},"OK"]
[null,"BDI                %",{"$nulls":5},{"$f":"1+$M$1","v":1.2149000000000001}]
[null,"TOTAL DO SERVIÇO - R$",{"$nulls":5},{"$f":"ROUND(H11*H12,2)","v":16838.759999999998}]
[]
[{"$f":"A1+1","v":2},"CODEVASF",null,null," COMPOSIÇÃO DE PREÇO UNITÁRIO",null,null,null,{"$f":"H29","v":148226.57999999999},{"$f":"H31","v":180080.47}]
[null,"OBRA:  ",{"$f":"$C$2","v":" RECAPEAMENTO E PAVIMENTAÇÃO ASFÁLTICA EM CBUQ - VIAS URBANAS DIVERSAS (SERRA DA SAUDADE / MG) - ITEM 2"},null,null,null,"DATA: ",{"$f":"$H$2","v":" SETEMBRO / 2023   "}]
[null,"SERVIÇO:  ",{"$f":"VLOOKUP(A15,ORÇAMENTO!$A$10:$I$30,3)","v":"ADMINISTRAÇÃO LOCAL"},null,"SINAPI",{"$f":"VLOOKUP(A15,ORÇAMENTO!$A$10:$I$30,4)","v":"CPU.2"},"UNIDADE: ",{"$f":"VLOOKUP(A15,ORÇAMENTO!$A$10:$I$30,5)","v":"GL"}]
[]
[null,"TIPO ITEM","CODIGO ITEM","DESCRIÇÃO ITEM","UNIDADE ITEM","COEFICIENTE","PRECO UNITARIO","CUSTO TOTAL"]
[null,"INSUMO",14250,"ENERGIA ELÉTRICA","kwh",60,0.94,{"$f":"ROUNDDOWN(F20*G20,2)","v":56.4}]
{"$rows_left_out":387}
{"sheet":"BDI SERV","index":2,"n_rows":37,"n_cols":20,"rows_kept":37,"cut":false,"hidden":false,"merged":[[31,1,31,2],[32,0,34,5],[36,0,36,5],[0,1,2,4],[3,1,4,1],[3,2,4,2],[28,0,28,5],[30,1,30,2]]}
[null,"DETALHAMENTO DO BDI - SERVIÇOS"]
[]
[]
[null,"Item","Descrição dos Serviços","%","%"]
[null,null,null,"PV","CD"]
[]
[null,1,"ADMINISTRAÇÃO CENTRAL"," ",4.01]
[null,"1.1","ESCRITÓRIO CENTRAL"," "," "]
[null,"1.2","VIAGENS"," "," "]
[null,"1.3","OUTROS"," "," "]
[null," "," "," "," "]
[null,2,"IMPOSTOS E TAXAS",{"$f":"SUM(D13:D16)","v":5.65},{"$f":"SUM(E13:E16)","v":7.0600000000000005}]
[null,"2.1","ISS (*)",2,{"$f":"ROUND(D13*1.2515,2)","v":2.5}]
[null,"2.2","PIS",0.65,{"$f":"ROUND(D14*1.2515,2)","v":0.81}]
[null,"2.3","Cofins",3,{"$f":"ROUND(D15*1.2515,2)","v":3.75}]
[null,"2.4","CONTRIBUIÇÃO PREVIDENCIÁRIA SOBRE A RENDA BRUTA",0,{"$f":"ROUND(D16*1.2515,2)","v":0}]
[]
[null,3,"TAXA DE RISCO"," ",{"$f":"SUM(E19:E22)","v":0.96}]
[null,"3.1","SEGURO",null,0.2]
[null,"3.2","RISCO",null,0.56000000000000005]
{"$rows_left_out":18}
{"sheet":"BDI FORN","index":3,"n_rows":37,"n_cols":5,"rows_kept":37,"cut":false,"hidden":false,"merged":[[31,1,31,2],[32,0,34,5],[36,0,36,5],[0,1,2,4],[3,1,4,1],[3,2,4,2],[28,0,28,5],[30,1,30,2]]}
[null,"DETALHAMENTO DO BDI - FORNECIMENTO \n(MATERIAL ASFÁLTICO)"]
[]
[]
[null,"Item","Descrição dos Serviços","%","%"]
[null,null,null,"PV","CD"]
[]
[null,1,"ADMINISTRAÇÃO CENTRAL"," ",3.72]
[null,"1.1","ESCRITÓRIO CENTRAL"," "," "]
[null,"1.2","VIAGENS"," "," "]
[null,"1.3","OUTROS"," "," "]
[null," "," "," "," "]
[null,2,"IMPOSTOS E TAXAS",{"$f":"SUM(D13:D16)","v":3.65},{"$f":"SUM(E13:E16)","v":4.5600000000000005}]
[null,"2.1","ISS (*)",null,{"$f":"ROUND(D13*1.2515,2)","v":0}]
[null,"2.2","PIS",0.65,{"$f":"ROUND(D14*1.2515,2)","v":0.81}]
[null,"2.3","Cofins",3,{"$f":"ROUND(D15*1.2515,2)","v":3.75}]
[null,"2.4","CONTRIBUIÇÃO PREVIDENCIÁRIA SOBRE A RENDA BRUTA",0,{"$f":"ROUND(D16*1.2515,2)","v":0}]
[]
[null,3,"TAXA DE RISCO"," ",{"$f":"SUM(E19:E22)","v":0.82000000000000006}]
[null,"3.1","SEGURO",null,0.16]
[null,"3.2","RISCO",null,0.5]
{"$rows_left_out":18}
{"sheet":"CRONOGRAMA","index":4,"n_rows":21,"n_cols":12,"rows_kept":21,"cut":false,"hidden":false,"merged":[[0,1,0,11],[1,1,2,1],[1,2,2,4],[1,6,1,11],[2,6,2,11],[3,1,3,10],[5,0,6,0],[5,1,6,1],[5,2,6,2],[7,0,8,0],[7,1,8,1],[7,2,8,2],[9,0,10,0],[9,1,10,1],[9,2,10,2],[11,0,12,0],[11,1,12,1],[11,2,12,2],[17,1,18,2],[20,1,24,11],[13,0,14,0],[13,1,14,1],[13,2,14,2],[15,0,16,0],[15,1,16,1],[15,2,16,2]]}
[null,"CRONOGRAMA FÍSICO-FINANCEIRO"]
[null,"OBRA: ",{"$f":"ORÇAMENTO!C5","v":" RECAPEAMENTO E PAVIMENTAÇÃO ASFÁLTICA EM CBUQ - VIAS URBANAS DIVERSAS (SERRA DA SAUDADE / MG) - ITEM 2"},null,null,"VALOR:",{"$f":"ORÇAMENTO!I41","v":2438342.8199999998}]
[{"$nulls":5},"PRAZO: ","180 DIAS "]
[]
[null,"ITEM","ETAPAS/DESCRIÇAO","FISICO/  FINANCEIRO","TOTAL    ETAPAS","MÊS 1","MÊS 2","MÊS 3","MÊS 4","MÊS 5","MÊS 6","TOTAL"]
["A",{"$f":"VLOOKUP(A6,ORÇAMENTO!$A$9:$I$41,2)","v":1},{"$f":"VLOOKUP(A6,ORÇAMENTO!$A$9:$I$41,3)","v":"SERVIÇOS PRELIMINARES "},"FISICO ",{"$f":"ROUND(E7/$G$2,4)","v":9.0800000000000006E-2},0.1,0.2,0.2,0.2,0.2,0.1,{"$f":"SUM(F6:K6)","v":0.99999999999999989}]
[null,null,null,"FINANCEIRO",{"$f":"ORÇAMENTO!I9","v":221440.67},{"$f":"ROUND($E$7*F6,2)","v":22144.07},{"$f":"ROUND($E$7*G6,2)","v":44288.13},{"$f":"ROUND($E$7*H6,2)","v":44288.13},{"$f":"ROUND($E$7*I6,2)","v":44288.13},44288.13,22144.07,{"$f":"SUM(F7:K7)","v":221440.66}]
["B",{"$f":"VLOOKUP(A8,ORÇAMENTO!$A$9:$I$41,2)","v":2},{"$f":"VLOOKUP(A8,ORÇAMENTO!$A$9:$I$41,3)","v":"PAVIMENTAÇÃO"},"FISICO ",{"$f":"ROUND(E9/$G$2,4)","v":0.18790000000000001},0.1,0.2,0.2,0.2,0.2,0.1,{"$f":"SUM(F8:K8)","v":0.99999999999999989}]
[null,null,null,"FINANCEIRO",{"$f":"ORÇAMENTO!I15","v":458046.5},{"$f":"ROUND($E$9*F8,2)","v":45804.65},{"$f":"ROUND($E$9*G8,2)","v":91609.3},{"$f":"ROUND($E$9*H8,2)","v":91609.3},{"$f":"ROUND($E$9*I8,2)","v":91609.3},91609.3,45804.65,{"$f":"SUM(F9:K9)","v":458046.5}]
["C",{"$f":"VLOOKUP(A10,ORÇAMENTO!$A$9:$I$41,2)","v":3},{"$f":"VLOOKUP(A10,ORÇAMENTO!$A$9:$I$41,3)","v":"TRANSPORTE DE MATERIAIS"},"FISICO ",{"$f":"ROUND(E11/$G$2,4)","v":9.8500000000000004E-2},0.25,0.25,0.25,0.25,0,0,{"$f":"SUM(F10:K10)","v":1}]
[null,null,null,"FINANCEIRO",{"$f":"ORÇAMENTO!I23","v":240150},{"$f":"ROUND($E$11*F10,2)","v":60037.5},{"$f":"ROUND($E$11*G10,2)","v":60037.5},{"$f":"ROUND($E$11*H10,2)","v":60037.5},{"$f":"ROUND($E$11*I10,2)","v":60037.5},0,0,{"$f":"SUM(F11:K11)-0.04","v":240149.96}]
["D",{"$f":"VLOOKUP(A12,ORÇAMENTO!$A$9:$I$41,2)","v":4},{"$f":"VLOOKUP(A12,ORÇAMENTO!$A$9:$I$41,3)","v":"TRANSPORTE DE MATERIAL ASFÁLTICO (BDI DIFERENCIADO)"},"FISICO ",{"$f":"ROUND(E13/$G$2,4)","v":3.3599999999999998E-2},0,0.2,0.2,0.2,0.2,0.2,{"$f":"SUM(F12:K12)","v":1}]
[null,null,null,"FINANCEIRO",{"$f":"ORÇAMENTO!I26","v":82048.069999999992},{"$f":"ROUND($E$13*F12,2)","v":0},{"$f":"ROUND($E$13*G12,2)","v":16409.61},{"$f":"ROUND($E$13*H12,2)","v":16409.61},{"$f":"ROUND($E$13*I12,2)","v":16409.61},16409.61,16409.61,{"$f":"SUM(F13:K13)-0.02","v":82048.03}]
["E",{"$f":"VLOOKUP(A14,ORÇAMENTO!$A$9:$I$41,2)","v":5},{"$f":"VLOOKUP(A14,ORÇAMENTO!$A$9:$I$41,3)","v":"DRENAGEM E OBRAS COMPLEMENTARES"},"FISICO ",{"$f":"ROUND(E15/$G$2,4)","v":0.18690000000000001},0,0,0.25,0.25,0.25,0.25,{"$f":"SUM(F14:K14)","v":1}]
[null,null,null,"FINANCEIRO",{"$f":"ORÇAMENTO!I29","v":455644.76},{"$f":"ROUND($E$15*F14,2)","v":0},{"$f":"ROUND($E$15*G14,2)","v":0},{"$f":"ROUND($E$15*H14,2)","v":113911.19},{"$f":"ROUND($E$15*I14,2)","v":113911.19},113911.19,113911.19,{"$f":"SUM(F15:K15)-0.02","v":455644.74}]
["F",{"$f":"VLOOKUP(A16,ORÇAMENTO!$A$9:$I$41,2)","v":6},{"$f":"VLOOKUP(A16,ORÇAMENTO!$A$9:$I$41,3)","v":"FORNECIMENTOS - MATERIAL ASFÁLTICO (BDI DIFERENCIADO)"},"FISICO ",{"$f":"ROUND(E17/$G$2,4)","v":0.40229999999999999},0,0.2,0.2,0.2,0.2,0.2,{"$f":"SUM(F16:K16)","v":1}]
[null,null,null,"FINANCEIRO",{"$f":"ORÇAMENTO!I37","v":981012.82000000007},{"$f":"ROUND($E$17*F16,2)","v":0},{"$f":"ROUND($E$17*G16,2)","v":196202.56},{"$f":"ROUND($E$17*H16,2)","v":196202.56},{"$f":"ROUND($E$17*I16,2)","v":196202.56},196202.56,196202.56,{"$f":"SUM(F17:K17)-0.02","v":981012.78}]
[null,"TOTAL",null,"FISICO ",{"$f":"SUM(F18:K18)","v":0.99999997949426966},{"$f":"F19/$E$19","v":5.2489017930628795E-2},{"$f":"G19/$E$19","v":0.16755113212505529},{"$f":"H19/$E$19","v":0.21426777470118},{"$f":"I19/$E$19","v":0.21426777470118},0.18964551916452826,0.16177876087169726,{"$f":"SUM(F18:K18)","v":0.99999997949426966}]
[null,null,null,"FINANCEIRO",{"$f":"E11+E9+E7+E13+E17+E15","v":2438342.8200000003},{"$f":"F11+F9+F7+F13+F17+F15","v":127986.22},{"$f":"G11+G9+G7+G13+G17+G15","v":408547.1},{"$f":"H11+H9+H7+H13+H17+H15","v":522458.29},{"$f":"I11+I9+I7+I13+I17+I15","v":522458.29},462420.79,394472.08,{"$f":"SUM(F19:K19)+0.05","v":2438342.8199999998}]
[]
{"$rows_left_out":2}
{"sheet":"CALC.MAT","index":5,"n_rows":376,"n_cols":20,"rows_kept":376,"cut":false,"hidden":false,"merged":[[28,1,28,6],[29,1,29,6],[30,1,30,6],[0,1,0,3],[0,4,0,7],[0,12,0,13],[1,2,1,5],[1,12,1,13],[2,2,2,3],[3,1,3,7],[9,1,9,3],[9,5,9,6],[14,12,14,13],[15,2,15,5],[16,2,16,3],[17,1,17,7],[27,1,27,3],[27,5,27,6],[10,1,10,6],[11,1,11,6],[12,1,12,6],[14,1,14,3],[14,4,14,7],[60,1,60,6],[61,1,61,6],[62,1,62,6],[32,1,32,3],[32,4,32,7],[32,12,32,13],[33,2,33,5],[34,2,34,3],[35,1,35,7],[41,1,41,3],[41,5,41,6],[46,12,46,13],[47,2,47,5],[48,2,48,3],[49,1,49,7],[59,1,59,3],[59,5,59,6],[42,1,42,6],[43,1,43,6],[44,1,44,6],[46,1,46,3],[46,4,46,7],[64,1,64,3],[64,4,64,7],[64,12,64,13],[65,2,65,5],[66,2,66,3],[67,1,67,7],[75,1,75,3],[75,5,75,6],[76,1,76,6],[77,1,77,6],[78,1,78,6],[80,1,80,3],[80,4,80,7],[80,12,80,13],[81,2,81,5],[82,2,82,3],[83,1,83,7],[88,1,88,3],[88,5,88,6],[89,1,89,6],[90,1,90,6],[91,1,91,6],[93,1,93,3],[93,4,93,7],[94,2,94,5],[95,2,95,3],[96,1,96,7],[102,1,102,3],[102,5,102,6],[103,1,103,6],[104,1,104,6],[105,1,105,6],[107,1,107,3],[107,4,107,7],[121,1,121,6],[122,1,122,6],[142,1,142,6],[143,1,143,6],[144,1,144,6],[107,12,107,13],[108,2,108,5],[109,2,109,3],[110,1,110,7],[120,1,120,3],[120,5,120,6],[135,12,136,12],[135,13,136,13],[135,14,136,14],[141,1,141,3],[141,5,141,6],[123,1,123,6],[125,1,125,3],[125,4,125,7],[126,2,126,5],[127,2,127,3],[128,1,128,7],[146,1,146,3],[146,4,146,7],[146,12,146,13],[147,2,147,5],[148,2,148,3],[149,1,149,7],[160,1,160,3],[160,5,160,6],[161,1,161,6],[202,1,202,6],[203,1,203,6],[204,1,204,6],[162,1,162,6],[163,1,163,6],[165,1,165,3],[165,4,165,7],[165,12,165,13],[166,2,166,5],[167,2,167,3],[168,1,168,7],[179,1,179,3],[184,12,184,13],[185,2,185,5],[186,2,186,3],[187,1,187,7],[201,1,201,3],[201,5,201,6],[179,5,179,6],[180,1,180,6],[181,1,181,6],[182,1,182,6],[184,1,184,3],[184,4,184,7],[206,1,206,3],[206,4,206,7],[206,12,206,13],[207,2,207,5],[208,2,208,3],[209,1,209,7],[214,1,214,3],[214,5,214,6],[215,1,215,6],[216,1,216,6],[217,1,217,6],[219,1,219,3],[219,4,219,7],[220,2,220,5],[221,2,221,3],[222,1,222,7],[227,1,227,3],[227,5,227,6],[253,1,253,6],[254,1,254,6],[255,1,255,6],[228,1,228,6],[229,1,229,6],[230,1,230,6],[232,1,232,3],[232,4,232,7],[233,2,233,5],[234,2,234,3],[235,1,235,7],[240,1,240,3],[245,12,245,13],[246,2,246,5],[247,2,247,3],[248,1,248,7],[252,1,252,3],[252,5,252,6],[240,5,240,6],[241,1,241,6],[242,1,242,6],[243,1,243,6],[245,1,245,3],[245,4,245,7],[262,14,264,17],[270,1,270,3],[270,5,270,6],[271,1,271,6],[272,1,272,6],[273,1,273,6],[257,1,257,3],[257,4,257,7],[257,12,257,13],[258,2,258,5],[259,2,259,3],[260,1,260,7],[275,1,275,3],[275,4,275,7],[276,2,276,5],[277,2,277,3],[278,1,278,7],[287,1,287,3],[287,5,287,6],[288,1,288,6],[289,1,289,6],[290,1,290,6],[292,1,292,3],[292,4,292,7],[293,2,293,5],[294,2,294,3],[295,1,295,7],[304,1,304,3],[304,5,304,6],[305,1,305,6],[306,1,306,6],[307,1,307,6],[309,1,309,3],[309,4,309,7],[310,2,310,5],[311,2,311,3],[312,1,312,7],[321,1,321,3],[321,5,321,6],[322,1,322,6],[323,1,323,6],[324,1,324,6],[326,1,326,3],[326,4,326,7],[327,2,327,5],[328,2,328,3],[329,1,329,7],[339,1,339,3],[339,5,339,6],[340,1,340,6],[341,1,341,6],[342,1,342,6],[344,1,344,3],[344,4,344,7],[345,2,345,5],[346,2,346,3],[347,1,347,7],[358,1,358,7],[361,1,361,3],[361,5,361,6],[362,1,362,6],[363,1,363,6],[364,1,364,6],[350,1,350,3],[350,5,350,6],[351,1,351,6],[352,1,352,6],[353,1,353,6],[355,1,355,3],[355,4,355,7],[356,2,356,5],[357,2,357,3],[375,1,375,6],[366,1,366,3],[366,4,366,7],[367,2,367,5],[368,2,368,3],[369,1,369,7],[372,1,372,3],[372,5,372,6],[373,1,373,6],[374,1,374,6]]}
[1,"CODEVASF",null,null," COMPOSIÇÃO DE PREÇO UNITÁRIO",null,null,null,"MATERIAIS",{"$f":"SUMIF(K$6:K$344,\"M\",J$6:J$344)","v":202532.12000000002},{"$f":"J1*(1+O$1)","v":246056.27258800005},{"$f":"K1/K$5","v":0.2458797396788743},"BDI CALCULADO:",null,{"$f":"ORÇAMENTO!I6","v":0.21489999999999998}]
[{"$f":"A1","v":1},"OBRA:  "," PAVIMENTAÇÃO ASFÁLTICA EM CBUQ - ESTRADA DE ACESSO AOS TÚNIES (SERRA DA SAUDADE / MG) - ITEM 2",null,null,null,"DATA: "," SETEMBRO / 2023   ","MAO DE OBRA",{"$f":"SUMIF(K$6:K$344,\"P\",J$6:J$344)","v":175738.97869379929},{"$f":"J2*(1+O$1)","v":213505.28521509678},{"$f":"K2/K$5","v":0.21335210599021331},"BDI DIFERENCIADO:",null,{"$f":"'BDI FORN'!D31/100","v":0.15}]
[{"$f":"A2","v":1},"SERVIÇO:  ","MOBILIZAÇÃO E DESMOBILIZAÇÃO",null,"Referência:","CPU.1","UNIDADE: ","GL","EQUIPAMENTOS",{"$f":"SUMIF(K$6:K$344,\"E\",J$6:J$344)","v":445432.88059506984},{"$f":"J3*(1+O$1)","v":541156.40663495043},0.54076815433091241]
[1]
[1,"TIPO ITEM","CODIGO ITEM","DESCRIÇÃO ITEM","UNIDADE ITEM","COEFICIENTE","PRECO UNITARIO","CUSTO TOTAL","VALOR SERVIÇO:",{"$f":"ORÇAMENTO!I9+ORÇAMENTO!I15+ORÇAMENTO!I23+ORÇAMENTO!I29","v":1375281.9300000002},{"$f":"SUM(K1:K3)","v":1000717.9644380473}]
[1,"COMPOSICAO",89876,"CAMINHÃO BASCULANTE 14 M3, COM CAVALO MECÂNICO DE CAPACIDADE MÁXIMA DE TRAÇÃO COMBINADO DE 36000 KG, POTÊNCIA 286 CV, INCLUSIVE SEMIREBOQUE COM CAÇAMBA METÁLICA","CHP DIURNO.",8,316.13,2529.04,{"$f":"VLOOKUP(A6,ORÇAMENTO!A$10:F$40,6)/E$10","v":2},{"$f":"H6*I6","v":5058.08},"E"]
[1,"COMPOSICAO",89877,"CAMINHÃO BASCULANTE 14 M3, COM CAVALO MECÂNICO DE CAPACIDADE MÁXIMA DE TRAÇÃO COMBINADO DE 36000 KG, POTÊNCIA 286 CV, INCLUSIVE SEMIREBOQUE COM CAÇAMBA METÁLICA","CHI DIURNO.",8,89.75,718,{"$f":"VLOOKUP(A7,ORÇAMENTO!A$10:F$40,6)/E$10","v":2},{"$f":"H7*I7","v":1436},"E"]
[1,"COMPOSICAO",5914640,"TRANSPORTE COM CAVALO MECÂNICO COM SEMIRREBOQUE COM CAPACIDADE DE 30 T - RODOVIA PAVIMENTADA","T.KM",5805,0.57999999999999996,3366.9,{"$f":"VLOOKUP(A8,ORÇAMENTO!A$10:F$40,6)/E$10","v":2},6733.8,"E"]
[1,"COMPOSIÇÃO",88316,"SERVENTE COM ENCARGOS COMPLEMENTARES","H",16,19.760000000000002,316.16000000000003,{"$f":"VLOOKUP(A9,ORÇAMENTO!A$10:F$40,6)/E$10","v":2},{"$f":"H9*I9","v":632.32000000000005},"P"]
[1,"PRODUÇÃO DA EQUIPE",null,null,0.5,"CUSTO ",null,6930.1]
[1,"TOTAL",{"$nulls":5},13860.2]
[1,"BDI                %",{"$nulls":5},1.2149000000000001]
[1,"TOTAL DO SERVIÇO - R$",{"$nulls":5},16838.759999999998]
[1]
[{"$f":"A1+1","v":2},"CODEVASF",null,null," COMPOSIÇÃO DE PREÇO UNITÁRIO"]
[{"$f":"A15","v":2},"OBRA:  "," PAVIMENTAÇÃO ASFÁLTICA EM CBUQ - ESTRADA DE ACESSO AOS TÚNIES (SERRA DA SAUDADE / MG) - ITEM 2",null,null,null,"DATA: "," SETEMBRO / 2023   "]
[2,"SERVIÇO:  ","ADMINISTRAÇÃO LOCAL",null,"SINAPI","CPU.2","UNIDADE: ","GL"]
[2]
[2,"TIPO ITEM","CODIGO ITEM","DESCRIÇÃO ITEM","UNIDADE ITEM","COEFICIENTE","PRECO UNITARIO","CUSTO TOTAL"]
[2,"INSUMO",14250,"ENERGIA ELÉTRICA","kwh",60,0.94,56.4,{"$f":"VLOOKUP(A20,ORÇAMENTO!A$10:F$40,6)/E$28","v":3.0000030000030002},169.2001692001692,"E"]
{"$rows_left_out":356}