{"text_format":"2","workbook":"xlsx","n_sheets":6,"sheets":["ORÇAMENTO","CPU","BDI SERV","BDI FORN","CRONOGRAMA","CALC.MAT"],"not_rendered":{"charts":0,"images":5,"macros":0,"external_links":0,"defined_names":6,"comments":1,"pivot_tables":0},"unopened":[],"bounds":{"document_bytes":16777216,"sheet_cells":100000,"run_cost":"one","rows_first":2000,"rows_last":500,"rows_between":2000,"halvings":0,"cell_chars":16384,"cell_head_chars":4096},"cells_cut":0,"cells_raw":0,"read":"whole","date_system":"1900"}

{"sheet":"ORÇAMENTO","index":0,"n_rows":41,"n_cols":9,"rows_kept":41,"cut":false,"hidden":false,"merged":[[40,1,40,2],[0,0,7,0],[0,2,0,8],[1,2,1,8],[2,2,2,8],[4,2,4,8],[5,6,5,7],[6,1,6,2],[6,6,6,7]]}
["<---- NUMERAR SERVIÇOS PARA CPU",null,"Ministério do Desenvolvimento Regional"]
[null,null,"Companhia de Desenvolvimento dos Vales do São Francisco e do Parnaíba"]
[null,null,"1ª Superintendência Regional"]
[]
[null,"OBRA: "," RECAPEAMENTO E PAVIMENTAÇÃO ASFÁLTICA EM CBUQ - VIAS URBANAS DIVERSAS (SERRA DA SAUDADE / MG) - ITEM 2"]
[null,"DATA:"," SETEMBRO / 2023   ",null,null,null,"BDI Serviços:",null,{"$f":"'BDI SERV'!D31/100","v":0.21489999999999998}]
[null,"PRAZO DE EXECUÇÃO:     180 DIAS",{"$nulls":4},"BDI Serviços:",null,{"$f":"'BDI FORN'!D31/100","v":0.15}]
[null,"ITEM","DISCRIMINAÇÃO","REFER.","UNID.","QUANT.","P. UNITÁRIO","P.UNIT.C/ BDI","P. TOTAL"]
["A",1,"SERVIÇOS PRELIMINARES ",{"$nulls":5},{"$f":"SUM(I10:I14)","v":221440.67}]
[1,"1.1","MOBILIZAÇÃO E DESMOBILIZAÇÃO","CPU.1","GL",1,{"$f":"VLOOKUP(A10,CPU!$A$1:$N$4709,9)","v":13860.2},{"$f":"VLOOKUP(A10,CPU!$A$1:$N$4709,10)","v":16838.759999999998},{"$f":"ROUND(F10*H10,2)","v":16838.759999999998}]
[2,"1.2","ADMINISTRAÇÃO LOCAL","CPU.2","GL",1,{"$f":"VLOOKUP(A11,CPU!$A$1:$N$4709,9)","v":148226.57999999999},{"$f":"VLOOKUP(A11,CPU!$A$1:$N$4709,10)","v":180080.47},{"$f":"ROUND(F11*H11,2)","v":180080.47}]
[3,"1.3","CANTEIRO DE OBRAS","CPU.3","GL",1,{"$f":"VLOOKUP(A12,CPU!$A$1:$N$4709,9)","v":13531.5},{"$f":"VLOOKUP(A12,CPU!$A$1:$N$4709,10)","v":16439.419999999998},{"$f":"ROUND(F12*H12,2)","v":16439.419999999998}]
[4,"1.4","PLACA DE OBRA EM CHAPA DE AÇO GALVANIZADO",103689,"M2",6,{"$f":"VLOOKUP(A13,CPU!$A$1:$N$4709,9)","v":340.5},{"$f":"VLOOKUP(A13,CPU!$A$1:$N$4709,10)","v":413.67},{"$f":"ROUND(F13*H13,2)","v":2482.02}]
[5,"1.5","SERVIÇOS TOPOGRÁFICOS PARA PAVIMENTAÇÃO, INCLUSIVE NOTA DE SERVIÇO, ACOMPANHAMENTO E GREIDE",78472,"M2",13999.998,{"$f":"VLOOKUP(A14,CPU!$A$1:$N$4709,9)","v":0.32999999999999996},{"$f":"VLOOKUP(A14,CPU!$A$1:$N$4709,10)","v":0.4},{"$f":"ROUND(F14*H14,2)","v":5600}]
["B",2,"PAVIMENTAÇÃO",{"$nulls":5},{"$f":"SUM(I16:I22)","v":458046.5}]
[6,"2.1","ESCAVAÇÃO HORIZONTAL EM SOLO DE 1A CATEGORIA ",101116,"M3",2800,{"$f":"VLOOKUP(A16,CPU!$A$1:$N$4709,9)","v":2.2000000000000002},{"$f":"VLOOKUP(A16,CPU!$A$1:$N$4709,10)","v":2.67},{"$f":"ROUND(F16*H16,2)","v":7476}]
[7,"2.2","CARGA, MANOBRA E DESCARGA DE SOLOS E MATERIAIS GRANULARES EM CAMINHÃO BASCULANTE",100976,"M3",2800,{"$f":"VLOOKUP(A17,CPU!$A$1:$N$4709,9)","v":8.7100000000000009},{"$f":"VLOOKUP(A17,CPU!$A$1:$N$4709,10)","v":10.58},29624]
[8,"2.3","REGULARIZAÇÃO E COMPACTAÇÃO DO SUBLEITO ",100576,"M2",14000.000000000002,{"$f":"VLOOKUP(A18,CPU!$A$1:$N$4709,9)","v":2.57},{"$f":"VLOOKUP(A18,CPU!$A$1:$N$4709,10)","v":3.12},43680]
[9,"2.4","EXECUÇÃO E COMPACTAÇÃO DE BASE E OU SUB BASE PARA PAVIMENTAÇÃO DE BICA CORRIDA - EXCLUSIVE CARGA E TRANSPORTE",96396,"M3",2000.0000000000002,{"$f":"VLOOKUP(A19,CPU!$A$1:$N$4709,9)","v":104.95},{"$f":"VLOOKUP(A19,CPU!$A$1:$N$4709,10)","v":127.5},255000]
[10,"2.5","IMPRIMAÇÃO COM EMULSÃO ASFÁLTICA (EAI)",96401,"M2",14000.000000000002,{"$f":"VLOOKUP(A20,CPU!$A$1:$N$4709,9)","v":1.23},{"$f":"VLOOKUP(A20,CPU!$A$1:$N$4709,10)","v":1.49},20860]
[11,"2.6","PINTURA DE LIGAÇÃO COM EMULSÃO ASFÁLTICA RR-1C",96402,"M2",14599.999999999998,{"$f":"VLOOKUP(A21,CPU!$A$1:$N$4709,9)","v":1.01},{"$f":"VLOOKUP(A21,CPU!$A$1:$N$4709,10)","v":1.23},17958]
[12,"2.7","EXECUÇÃO DE PAVIMENTO COM APLICAÇÃO DE CONCRETO ASFÁLTICO USINADO A QUENTE (CBUQ), CAMADA DE ROLAMENTO - EXCLUSIVE TRANSPORTE",95995,"M3",530,{"$f":"VLOOKUP(A22,CPU!$A$1:$N$4709,9)","v":129.6},{"$f":"VLOOKUP(A22,CPU!$A$1:$N$4709,10)","v":157.44999999999999},83448.5]
["C",3,"TRANSPORTE DE MATERIAIS",{"$nulls":5},{"$f":"SUM(I24:I25)","v":240150}]
[13,"3.1","TRANSPORTE COM CAMINHÃO BASCULANTE, EM VIA URBANA PAVIMENTADA",95427,"M3XKM",260000.00157056004,{"$f":"VLOOKUP(A24,CPU!$A$1:$N$4709,9)","v":0.73},{"$f":"VLOOKUP(A24,CPU!$A$1:$N$4709,10)","v":0.89},{"$f":"ROUND(F24*H24,2)","v":231400}]
[14,"3.2","TRANSPORTE COM CAMINHÃO CARROCERIA 9T, EM VIA URBANA PAVIMENTADA",100947,"TXKM",7000.0036309856005,{"$f":"VLOOKUP(A25,CPU!$A$1:$N$4709,9)","v":1.03},{"$f":"VLOOKUP(A25,CPU!$A$1:$N$4709,10)","v":1.25},{"$f":"ROUND(F25*H25,2)","v":8750}]
["D",4,"TRANSPORTE DE MATERIAL ASFÁLTICO (BDI DIFERENCIADO)",{"$nulls":5},{"$f":"SUM(I27:I28)","v":82048.069999999992}]
[15,"4.1","TRANSPORTE DE MASSA ASFÁLTICA COM CAMINHÃO BASCULANTE, EM VIA URBANA PAVIMENTADA (BDI DIFERENCIADO)",95430,"TXKM",150636.44,{"$f":"VLOOKUP(A27,CPU!$A$1:$N$4709,9)","v":0.44999999999999996},{"$f":"VLOOKUP(A27,CPU!$A$1:$N$4709,10)","v":0.52},{"$f":"ROUND(F27*H27,2)","v":78330.95}]
[16,"4.2","TRANSPORTE COM CAMINHÃO TANQUE DE TRANSPORTE DE MATERIAL ASFÁLTICO DE 30000 L, EM VIA URBANA PAVIMENTADA (BDI DIFERENCIADO)",102331,"TXKM",6195.2,{"$f":"VLOOKUP(A28,CPU!$A$1:$N$4709,9)","v":0.52},{"$f":"VLOOKUP(A28,CPU!$A$1:$N$4709,10)","v":0.6},{"$f":"ROUND(F28*H28,2)","v":3717.12}]
["E",5,"DRENAGEM E OBRAS COMPLEMENTARES",{"$nulls":5},{"$f":"SUM(I30:I36)","v":455644.76}]
[17,"5.1","GUIA (MEIO-FIO) E SARJETA CONJUGADOS DE CONCRETO, MOLDADA IN LOCO EM M CR 57,38 TRECHO RETO COM EXTRUSORA, 45 CM BASE (15 CM BASE DA GUIA + 30 CM BAS E DA SARJETA) X 22 CM ALTURA ",94267,"M",4600,{"$f":"VLOOKUP(A30,CPU!$A$1:$N$4709,9)","v":57.319999999999986},{"$f":"VLOOKUP(A30,CPU!$A$1:$N$4709,10)","v":69.64},{"$f":"ROUND(F30*H30,2)","v":320344}]
[17.100000000000001,"5.2","DESCIDA D’ÁGUA DE ATERROS EM DEGRAUS - DAD 04 - AREIA E BRITA COMERCIAIS",2003411,"M",30,{"$f":"VLOOKUP(A31,CPU!$A$1:$N$4709,9)","v":603.86},{"$f":"VLOOKUP(A31,CPU!$A$1:$N$4709,10)","v":733.63},{"$f":"ROUND(F31*H31,2)","v":22008.9}]
[17.2,"5.3","BACIA DE DISSIPAÇÃO, TIPO BACIA EM PEDRA DE MÃO FIXADA COM CONCRETO (DEB 01, 02), COM PREPARO MANUAL, FCK = 20 MPA, LANÇADO MANUALMENTE, INCLUINDO MATERIAIS E FÔRMAS",103930,"M",10,{"$f":"VLOOKUP(A32,CPU!$A$1:$N$4709,9)","v":781.01},{"$f":"VLOOKUP(A32,CPU!$A$1:$N$4709,10)","v":948.85},9488.5]
[18,"5.4","FORNECIMENTO E INSTALAÇÃO DE PLACA DE SINALIZAÇÃO VIÁRIA - REGULAMENTAÇÃO CIRCULAR ","CPU.4","UN.",12,{"$f":"VLOOKUP(A33,CPU!$A$1:$N$4709,9)","v":422.8},{"$f":"VLOOKUP(A33,CPU!$A$1:$N$4709,10)","v":513.66},6163.92]
[19,"5.5","FORNECIMENTO E INSTALAÇÃO DE PLACA DE SINALIZAÇÃO VIÁRIA - REGULAMENTAÇÃO (PARE)","CPU.5","UN.",24,{"$f":"VLOOKUP(A34,CPU!$A$1:$N$4709,9)","v":482.72},{"$f":"VLOOKUP(A34,CPU!$A$1:$N$4709,10)","v":586.46},14075.04]
[20,"5.6","FORNECIMENTO E INSTALAÇÃO DE PLACA DE AÇO PARA IDENTIFICACAO DE RUA, *45 CM X 20* CM, INCLUSIVE SUPORTE EM TUBO DE AÇO GALVANIZADO (02 PLACAS POR SUPORTE)                                  ","CPU.6","UN.",40,{"$f":"VLOOKUP(A35,CPU!$A$1:$N$4709,9)","v":375.43},{"$f":"VLOOKUP(A35,CPU!$A$1:$N$4709,10)","v":456.11},18244.400000000001]
[21,"5.13","PINTURA DE EIXO VIÁRIO SOBRE ASFALTO COM TINTA RETRORREFLETIVA A BASE DE RESINA ACRÍLICA COM MICROESFERAS DE VIDRO, APLICAÇÃO MECÂNICA COM DEMARCADORA AUTOPROPELIDA",102512,"M2",9200,{"$f":"VLOOKUP(A36,CPU!$A$1:$N$4709,9)","v":5.84},{"$f":"VLOOKUP(A36,CPU!$A$1:$N$4709,10)","v":7.1},65320]
["F",6,"FORNECIMENTOS - MATERIAL ASFÁLTICO (BDI DIFERENCIADO)",{"$nulls":5},{"$f":"SUM(I38:I40)","v":981012.82000000007}]
[25,"6.1","AQUISIÇÃO DE EMULSÃO ASFÁLTICA PARA IMPRIMAÇÃO (EAI) - EXCLUSIVE TRANSPORTE","CPU.7","T",19.000000000000004,{"$f":"VLOOKUP(A38,CPU!$A$1:$N$4709,9)","v":2689.76},{"$f":"VLOOKUP(A38,CPU!$A$1:$N$4709,10)","v":3093.22},{"$f":"ROUND(F38*H38,2)","v":58771.18}]
[26,"6.2","AQUISIÇÃO DE EMULSAO ASFALTICA CATIONICA RR-1C - EXCLUSIVE TRANSPORTE","CPU.8","T",6.9999999999999991,{"$f":"VLOOKUP(A39,CPU!$A$1:$N$4709,9)","v":2706.7},{"$f":"VLOOKUP(A39,CPU!$A$1:$N$4709,10)","v":3112.71},{"$f":"ROUND(F39*H39,2)","v":21788.97}]
[27,"6.3","AQUISIÇÃO DE CONCRETO BETUMINOSO USINADO A QUENTE (CBUQ) PARA PAVIMENTACAO ASFALTICA, PADRAO DNIT, FAIXA C, COM CAP 50/70 - EXCLUSIVE TRANSPORTE","CPU.9","T",1350.0040000000001,{"$f":"VLOOKUP(A40,CPU!$A$1:$N$4709,9)","v":580},{"$f":"VLOOKUP(A40,CPU!$A$1:$N$4709,10)","v":667},{"$f":"ROUND(F40*H40,2)","v":900452.67}]
[null,"TOTAL GERAL DA OBRA COM BDI ",{"$nulls":6},{"$f":"SUM(I9,I15,I23,I29,I37,I26)","v":2438342.8199999998}]

{"sheet":"CPU","index":1,"n_rows":406,"n_cols":18,"rows_kept":406,"cut":false,"hidden":false,"merged":[[291,0,303,0],[291,1,291,3],[291,4,291,7],[292,2,292,5],[293,2,293,3],[294,1,294,7],[300,1,300,3],[300,5,300,6],[301,1,301,6],[302,1,302,6],[303,1,303,6],[275,0,289,0],[275,1,275,3],[275,4,275,7],[276,2,276,5],[277,2,277,3],[278,1,278,7],[286,1,286,3],[286,5,286,6],[287,1,287,6],[288,1,288,6],[289,1,289,6],[0,0,13,0],[0,1,0,3],[0,4,0,7],[0,10,0,11],[1,2,1,5],[1,10,1,11],[2,2,2,3],[3,1,3,7],[9,1,9,3],[9,5,9,6],[10,1,10,6],[11,1,11,6],[12,1,12,6],[14,0,31,0],[14,1,14,3],[14,4,14,7],[14,10,14,11],[15,2,15,5],[15,8,16,9],[16,2,16,3],[17,1,17,7],[27,1,27,3],[27,5,27,6],[28,1,28,6],[29,1,29,6],[30,1,30,6],[32,0,45,0],[32,1,32,3],[32,4,32,7],[32,10,32,11],[33,2,33,5],[33,8,34,9],[34,2,34,3],[35,1,35,7],[41,1,41,3],[41,5,41,6],[42,1,42,6],[43,1,43,6],[44,1,44,6],[46,0,63,0],[46,1,46,3],[46,4,46,7],[46,10,46,11],[47,2,47,5],[48,2,48,3],[49,1,49,7],[59,1,59,3],[59,5,59,6],[60,1,60,6],[61,1,61,6],[62,1,62,6],[64,0,79,0],[64,1,64,3],[64,4,64,7],[64,10,64,11],[65,2,65,5],[66,2,66,3],[67,1,67,7],[75,1,75,3],[75,5,75,6],[76,1,76,6],[77,1,77,6],[78,1,78,6],[80,0,92,0],[80,1,80,3],[80,4,80,7],[80,10,80,11],[81,2,81,5],[82,2,82,3],[83,1,83,7],[88,1,88,3],[88,5,88,6],[89,1,89,6],[90,1,90,6],[91,1,91,6],[93,0,105,0],[93,1,93,3],[93,4,93,7],[94,2,94,5],[95,2,95,3],[96,1,96,7],[102,1,102,3],[102,5,102,6],[103,1,103,6],[104,1,104,6],[105,1,105,6],[107,0,124,0],[107,1,107,3],[107,4,107,7],[107,10,107,11],[108,2,108,5],[109,2,109,3],[110,1,110,7],[120,1,120,3],[120,5,120,6],[121,1,121,6],[122,1,122,6],[123,1,123,6],[142,1,142,6],[143,1,143,6],[144,1,144,6],[146,0,164,0],[146,1,146,3],[146,4,146,7],[146,10,146,11],[147,2,147,5],[148,2,148,3],[149,1,149,7],[160,1,160,3],[160,5,160,6],[161,1,161,6],[162,1,162,6],[163,1,163,6],[125,0,144,0],[125,1,125,3],[125,4,125,7],[126,2,126,5],[127,2,127,3],[128,1,128,7],[141,1,141,3],[141,5,141,6],[165,0,183,0],[165,1,165,3],[165,4,165,7],[165,10,165,11],[166,2,166,5],[167,2,167,3],[168,1,168,7],[179,1,179,3],[179,5,179,6],[180,1,180,6],[181,1,181,6],[182,1,182,6],[184,0,205,0],[184,1,184,3],[184,4,184,7],[184,10,184,11],[185,2,185,5],[186,2,186,3],[187,1,187,7],[189,8,189,9],[201,1,201,3],[201,5,201,6],[202,1,202,6],[203,1,203,6],[204,1,204,6],[206,0,217,0],[206,1,206,3],[206,4,206,7],[206,10,206,11],[207,2,207,5],[208,2,208,3],[209,1,209,7],[214,1,214,3],[214,5,214,6],[215,1,215,6],[216,1,216,6],[217,1,217,6],[219,0,230,0],[219,1,219,3],[219,4,219,7],[220,2,220,5],[221,2,221,3],[222,1,222,7],[227,1,227,3],[227,5,227,6],[228,1,228,6],[229,1,229,6],[230,1,230,6],[232,0,243,0],[232,1,232,3],[232,4,232,7],[233,2,233,5],[234,2,234,3],[235,1,235,7],[240,1,240,3],[240,5,240,6],[241,1,241,6],[242,1,242,6],[243,1,243,6],[245,0,256,0],[245,1,245,3],[245,4,245,7],[245,10,245,11],[246,2,246,5],[247,2,247,3],[248,1,248,7],[252,1,252,3],[252,5,252,6],[253,1,253,6],[254,1,254,6],[255,1,255,6],[257,0,273,0],[257,1,257,3],[257,4,257,7],[257,10,257,11],[258,2,258,5],[259,2,259,3],[260,1,260,7],[262,12,264,15],[270,1,270,3],[270,5,270,6],[271,1,271,6],[272,1,272,6],[273,1,273,6],[305,0,320,0],[305,1,305,3],[305,4,305,7],[306,2,306,5],[307,2,307,3],[308,1,308,7],[317,1,317,3],[317,5,317,6],[318,1,318,6],[319,1,319,6],[320,1,320,6],[322,0,337,0],[322,1,322,3],[322,4,322,7],[323,2,323,5],[324,2,324,3],[325,1,325,7],[334,1,334,3],[334,5,334,6],[335,1,335,6],[336,1,336,6],[337,1,337,6],[339,0,354,0],[339,1,339,3],[339,4,339,7],[340,2,340,5],[341,2,341,3],[342,1,342,7],[351,1,351,3],[351,5,351,6],[352,1,352,6],[353,1,353,6],[354,1,354,6],[356,0,372,0],[356,1,356,3],[356,4,356,7],[357,2,357,5],[358,2,358,3],[359,1,359,7],[369,1,369,3],[369,5,369,6],[370,1,370,6],[371,1,371,6],[372,1,372,6],[374,0,383,0],[374,1,374,3],[374,4,374,7],[375,2,375,5],[376,2,376,3],[377,1,377,7],[380,1,380,3],[380,5,380,6],[381,1,381,6],[382,1,382,6],[383,1,383,6],[385,0,394,0],[385,1,385,3],[385,4,385,7],[386,2,386,5],[387,2,387,3],[388,1,388,7],[391,1,391,3],[391,5,391,6],[392,1,392,6],[393,1,393,6],[394,1,394,6],[396,0,405,0],[396,1,396,3],[396,4,396,7],[397,2,397,5],[398,2,398,3],[399,1,399,7],[402,1,402,3],[402,5,402,6],[403,1,403,6],[404,1,404,6],[405,1,405,6]]}
[1,"CODEVASF",null,null," COMPOSIÇÃO DE PREÇO UNITÁRIO",null,null,null,{"$f":"H11","v":13860.2},{"$f":"H13","v":16838.759999999998},"BDI CALCULADO:",null,{"$f":"ORÇAMENTO!I6","v":0.21489999999999998}]
[null,"OBRA:  ",{"$f":"ORÇAMENTO!C5","v":" RECAPEAMENTO E PAVIMENTAÇÃO ASFÁLTICA EM CBUQ - VIAS URBANAS DIVERSAS (SERRA DA SAUDADE / MG) - ITEM 2"},null,null,null,"DATA: ",{"$f":"ORÇAMENTO!C6","v":" SETEMBRO / 2023   "},null,null,"BDI DIFERENCIADO:",null,{"$f":"'BDI FORN'!D31/100","v":0.15}]
[null,"SERVIÇO:  ",{"$f":"VLOOKUP(A1,ORÇAMENTO!A10:I30,3)","v":"MOBILIZAÇÃO E DESMOBILIZAÇÃO"},null,"Referência:",{"$f":"VLOOKUP(A1,ORÇAMENTO!$A$10:$I$30,4)","v":"CPU.1"},"UNIDADE: ",{"$f":"VLOOKUP(A1,ORÇAMENTO!A10:I30,5)","v":"GL"}]
[]
[null,"TIPO ITEM","CODIGO ITEM","DESCRIÇÃO ITEM","UNIDADE ITEM","COEFICIENTE","PRECO UNITARIO","CUSTO TOTAL"]
[null,"COMPOSICAO",89876,"CAMINHÃO BASCULANTE 14 M3, COM CAVALO MECÂNICO DE CAPACIDADE MÁXIMA DE TRAÇÃO COMBINADO DE 36000 KG, POTÊNCIA 286 CV, INCLUSIVE SEMIREBOQUE COM CAÇAMBA METÁLICA","CHP DIURNO.",8,316.13,{"$f":"ROUNDDOWN(F6*G6,2)","v":2529.04}]
[null,"COMPOSICAO",89877,"CAMINHÃO BASCULANTE 14 M3, COM CAVALO MECÂNICO DE CAPACIDADE MÁXIMA DE TRAÇÃO COMBINADO DE 36000 KG, POTÊNCIA 286 CV, INCLUSIVE SEMIREBOQUE COM CAÇAMBA METÁLICA","CHI DIURNO.",8,89.75,{"$f":"ROUNDDOWN(F7*G7,2)","v":718}]
[null,"COMPOSICAO",5914640,"TRANSPORTE COM CAVALO MECÂNICO COM SEMIRREBOQUE COM CAPACIDADE DE 30 T - RODOVIA PAVIMENTADA","T.KM",5805,0.57999999999999996,{"$f":"ROUNDDOWN(F8*G8,2)","v":3366.9}]
[null,"COMPOSIÇÃO",88316,"SERVENTE COM ENCARGOS COMPLEMENTARES","H",16,19.760000000000002,{"$f":"ROUNDDOWN(F9*G9,2)","v":316.16000000000003}]
[null,"PRODUÇÃO DA EQUIPE",null,null,0.5,"CUSTO ",null,{"$f":"SUM(H6:H9)","v":6930.1}]
[null,"TOTAL",{"$nulls":5},{"$f":"H10/E10","v":13860.2},"OK"]
[null,"BDI                %",{"$nulls":5},{"$f":"1+$M$1","v":1.2149000000000001}]
[null,"TOTAL DO SERVIÇO - R$",{"$nulls":5},{"$f":"ROUND(H11*H12,2)","v":16838.759999999998}]
[]
[{"$f":"A1+1","v":2},"CODEVASF",null,null," COMPOSIÇÃO DE PREÇO UNITÁRIO",null,null,null,{"$f":"H29","v":148226.57999999999},{"$f":"H31","v":180080.47}]
[null,"OBRA:  ",{"$f":"$C$2","v":" RECAPEAMENTO E PAVIMENTAÇÃO ASFÁLTICA EM CBUQ - VIAS URBANAS DIVERSAS (SERRA DA SAUDADE / MG) - ITEM 2"},null,null,null,"DATA: ",{"$f":"$H$2","v":" SETEMBRO / 2023   "}]
[null,"SERVIÇO:  ",{"$f":"VLOOKUP(A15,ORÇAMENTO!$A$10:$I$30,3)","v":"ADMINISTRAÇÃO LOCAL"},null,"SINAPI",{"$f":"VLOOKUP(A15,ORÇAMENTO!$A$10:$I$30,4)","v":"CPU.2"},"UNIDADE: ",{"$f":"VLOOKUP(A15,ORÇAMENTO!$A$10:$I$30,5)","v":"GL"}]
[]
[null,"TIPO ITEM","CODIGO ITEM","DESCRIÇÃO ITEM","UNIDADE ITEM","COEFICIENTE","PRECO UNITARIO","CUSTO TOTAL"]
[null,"INSUMO",14250,"ENERGIA ELÉTRICA","kwh",60,0.94,{"$f":"ROUNDDOWN(F20*G20,2)","v":56.4}]
[null,"INSUMO",44480,"TARIFA \"A\" - ÁGUA/ESGOTO ","m³",6,17.78,106.68]
[null,"COTAÇÃO","MERC.","TELEFONE (PLANO CONTROLE)","UNID",2,59.9,119.8]
[null,"INSUMO","ED-50155 SEINFRA","BANHEIRO QUÍMICO 110 X 120 X 230 CM COM MANUTENÇÃO (CONSIDERANDO OBRAS SIMULTÂNEAS)","MÊS",2,820,1640]
[null,"COMPOSICAO",90777,"Engenheiro Civil Júnior com encargos complementares","H",55,114.12,6276.6]
[null,"COMPOSICAO",90776,"Encarregado Geral com encargos complementares","H",220,57.73,12700.6]
[null,"COMPOSICAO",88321,"Tecnico de Laboratório com encargos complementares","H",55,45.45,2499.75]
[null,"COMPOSICAO",90772,"Auxiliar de escritório com encargos complementares","H",55,23.72,1304.5999999999999]
[null,"PRODUÇÃO DA EQUIPE",null,null,{"$f":"1/6","v":0.16666666666666666},"CUSTO ",null,{"$f":"SUM(H20:H27)","v":24704.43}]
[null,"TOTAL",{"$nulls":5},{"$f":"ROUND(H28/E28,2)","v":148226.57999999999},"OK"]
[null,"BDI                %",{"$nulls":5},{"$f":"1+$M$1","v":1.2149000000000001}]
[null,"TOTAL DO SERVIÇO - R$",{"$nulls":5},{"$f":"ROUND(H29*H30,2)","v":180080.47}]
[]
[{"$f":"A15+1","v":3},"CODEVASF",null,null," COMPOSIÇÃO DE PREÇO UNITÁRIO",null,null,null,{"$f":"H43","v":13531.5},{"$f":"H45","v":16439.419999999998}]
[null,"OBRA:  ",{"$f":"$C$2","v":" RECAPEAMENTO E PAVIMENTAÇÃO ASFÁLTICA EM CBUQ - VIAS URBANAS DIVERSAS (SERRA DA SAUDADE / MG) - ITEM 2"},null,null,null,"DATA: ",{"$f":"$H$2","v":" SETEMBRO / 2023   "}]
[null,"SERVIÇO:  ",{"$f":"VLOOKUP(A33,ORÇAMENTO!$A$10:$I$30,3)","v":"CANTEIRO DE OBRAS"},null,"SINAPI",{"$f":"VLOOKUP(A33,ORÇAMENTO!$A$10:$I$30,4)","v":"CPU.3"},"UNIDADE: ",{"$f":"VLOOKUP(A33,ORÇAMENTO!$A$10:$I$30,5)","v":"GL"}]
[]
[null,"TIPO ITEM","CODIGO ITEM","DESCRIÇÃO ITEM","UNIDADE ITEM","COEFICIENTE","PRECO UNITARIO","CUSTO TOTAL"]
[null,"INSUMO",10775,"LOCACAO DE CONTAINER 2,30 X 6,00 M, ALT. 2,50 M, COM 1 SANITARIO, PARA ESCRITORIO, COMPLETO, SEM DIVISORIAS INTERNAS","MÊS",6,975,{"$f":"ROUNDDOWN(F38*G38,2)","v":5850}]
[null,"INSUMO",10779,"LOCACAO DE CONTAINER 2,30 X 4,30 M, ALT. 2,50 M, P/ SANITARIO, C/ 5 BACIAS, 1 LAVATORIO E 4 MICTORIOS","MÊS",6,1218.75,{"$f":"ROUNDDOWN(F39*G39,2)","v":7312.5}]
[null,"INSUMO","37525","TELA PLASTICA TECIDA LISTRADA BRANCA E LARANJA, TIPO GUARDA CORPO, EM POLIETILENO MONOFILADO, ROLO 1,20 X 50 M (L X C)","M",100,3.69,{"$f":"ROUNDDOWN(F40*G40,2)","v":369}]
[{"$nulls":7},{"$f":"ROUNDDOWN(F41*G41,2)","v":0}]
[null,"PRODUÇÃO DA EQUIPE",null,null,1,"CUSTO ",null,{"$f":"SUM(H38:H41)","v":13531.5}]
[null,"TOTAL",{"$nulls":5},{"$f":"H42/E42","v":13531.5},"OK"]
[null,"BDI                %",{"$nulls":5},{"$f":"1+$M$1","v":1.2149000000000001}]
[null,"TOTAL DO SERVIÇO - R$",{"$nulls":5},{"$f":"ROUND(H43*H44,2)","v":16439.419999999998}]
[]
[{"$f":"A33+1","v":4},"CODEVASF",null,null," COMPOSIÇÃO DE PREÇO UNITÁRIO",null,null,null,{"$f":"H61","v":340.5},{"$f":"H63","v":413.67}]
[null,"OBRA:  ",{"$f":"$C$2","v":" RECAPEAMENTO E PAVIMENTAÇÃO ASFÁLTICA EM CBUQ - VIAS URBANAS DIVERSAS (SERRA DA SAUDADE / MG) - ITEM 2"},null,null,null,"DATA: ",{"$f":"$H$2","v":" SETEMBRO / 2023   "}]
[null,"SERVIÇO:  ",{"$f":"VLOOKUP(A47,ORÇAMENTO!$A$10:$I$30,3)","v":"PLACA DE OBRA EM CHAPA DE AÇO GALVANIZADO"},null,"SINAPI",{"$f":"VLOOKUP(A47,ORÇAMENTO!$A$10:$I$30,4)","v":103689},"UNIDADE: ",{"$f":"VLOOKUP(A47,ORÇAMENTO!$A$10:$I$30,5)","v":"M2"}]
[]
[null,"TIPO ITEM","CODIGO ITEM","DESCRIÇÃO ITEM","UNIDADE ITEM","COEFICIENTE","PRECO UNITARIO","CUSTO TOTAL"]
[null,"INSUMO","4509","SARRAFO *2,5 X 10* CM EM PINUS, MISTA OU EQUIVALENTE DA REGIAO - BRUTA","M","3,2083000","4,41",{"$f":"ROUNDDOWN(F52*G52,2)","v":14.14}]
[null,"INSUMO","4813","PLACA DE OBRA (PARA CONSTRUCAO CIVIL) EM CHAPA GALVANIZADA *N. 22*, ADESIVADA, DE *2,4 X 1,2* M (SEM POSTES PARA FIXACAO)","M2","1,0000000","250,00",250]
[null,"INSUMO","5065","PREGO DE ACO POLIDO COM CABECA 10 X 10 (7/8 X 17)","KG","0,0113000","36,57",0.41]
[null,"INSUMO","5069","PREGO DE ACO POLIDO COM CABECA 17 X 27 (2 1/2 X 11)","KG","0,0132000","19,59",0.25]
[null,"COMPOSICAO","88262","CARPINTEIRO DE FORMAS COM ENCARGOS COMPLEMENTARES","H","0,3729000","27,05",10.08]
[null,"COMPOSICAO","88316","SERVENTE COM ENCARGOS COMPLEMENTARES","H","1,1186000","19,76",22.1]
[null,"INSUMO",4115,"MADEIRA ROLICA TRATADA, D = 12 A 15 CM, H = 3,00 M, EM EUCALIPTO OU EQUIVALENTE","M",2,21.76,43.52]
[{"$nulls":7},0]
[null,"PRODUÇÃO DA EQUIPE",null,null,1,"CUSTO ",null,{"$f":"SUM(H52:H59)","v":340.5}]
[null,"TOTAL",{"$nulls":5},{"$f":"H60/E60","v":340.5},"OK"]
[null,"BDI                %",{"$nulls":5},{"$f":"1+$M$1","v":1.2149000000000001}]
[null,"TOTAL DO SERVIÇO - R$",{"$nulls":5},{"$f":"ROUND(H61*H62,2)","v":413.67}]
[]
[{"$f":"A47+1","v":5},"CODEVASF",null,null," COMPOSIÇÃO DE PREÇO UNITÁRIO",null,null,null,{"$f":"H77","v":0.32999999999999996},{"$f":"H79","v":0.4}]
[null,"OBRA:  ",{"$f":"$C$2","v":" RECAPEAMENTO E PAVIMENTAÇÃO ASFÁLTICA EM CBUQ - VIAS URBANAS DIVERSAS (SERRA DA SAUDADE / MG) - ITEM 2"},null,null,null,"DATA: ",{"$f":"$H$2","v":" SETEMBRO / 2023   "}]
[null,"SERVIÇO:  ",{"$f":"VLOOKUP(A65,ORÇAMENTO!$A$10:$I$30,3)","v":"SERVIÇOS TOPOGRÁFICOS PARA PAVIMENTAÇÃO, INCLUSIVE NOTA DE SERVIÇO, ACOMPANHAMENTO E GREIDE"},null,"SINAPI",{"$f":"VLOOKUP(A65,ORÇAMENTO!$A$10:$I$30,4)","v":78472},"UNIDADE: ",{"$f":"VLOOKUP(A65,ORÇAMENTO!$A$10:$I$30,5)","v":"M2"}]
[]
[null,"TIPO ITEM","CODIGO ITEM","DESCRIÇÃO ITEM","UNIDADE ITEM","COEFICIENTE","PRECO UNITARIO","CUSTO TOTAL"]
[null,"COMPOSICAO",88253,"AUXILIAR DE TOPÓGRAFO COM ENCARGOS COMPLEMENTARES","H",2.5000000000000001E-3,21.57,{"$f":"ROUNDDOWN(F70*G70,2)","v":0.05}]
[null,"COMPOSICAO",88288,"NIVELADOR COM ENCARGOS COMPLEMENTARES","H",2.5000000000000001E-3,26.99,0.06]
[null,"COMPOSICAO",88316,"SERVENTE COM ENCARGOS COMPLEMENTARES","H",7.4999999999999997E-3,19.760000000000002,0.14000000000000001]
[null,"COMPOSICAO",88597,"DESENHISTA DETALHISTA COM ENCARGOS COMPLEMENTARES ","H",2E-3,29.72,0.05]
[null,"COMPOSICAO",92145,"CAMINHONETE CABINE SIMPLES COM MOTOR 1.6 FLEX, CÂMBIO MANUAL, POTÊNCIA 101/104 CV, 2 PORTAS","CHP",5.0000000000000001E-4,74.75,0.03]
[{"$nulls":7},0]
[null,"PRODUÇÃO DA EQUIPE",null,null,1,"CUSTO ",null,{"$f":"SUM(H70:H75)","v":0.32999999999999996}]
[null,"TOTAL",{"$nulls":5},{"$f":"H76/E76","v":0.32999999999999996},"OK"]
[null,"BDI                %",{"$nulls":5},{"$f":"1+$M$1","v":1.2149000000000001}]
[null,"TOTAL DO SERVIÇO - R$",{"$nulls":5},{"$f":"ROUND(H77*H78,2)","v":0.4}]
[]
[{"$f":"A65+1","v":6},"CODEVASF",null,null," COMPOSIÇÃO DE PREÇO UNITÁRIO",null,null,null,{"$f":"H90","v":2.2000000000000002},{"$f":"H92","v":2.67}]
[null,"OBRA:  ",{"$f":"$C$2","v":" RECAPEAMENTO E PAVIMENTAÇÃO ASFÁLTICA EM CBUQ - VIAS URBANAS DIVERSAS (SERRA DA SAUDADE / MG) - ITEM 2"},null,null,null,"DATA: ",{"$f":"$H$2","v":" SETEMBRO / 2023   "}]
[null,"SERVIÇO:  ",{"$f":"VLOOKUP(A81,ORÇAMENTO!$A$10:$I$30,3)","v":"ESCAVAÇÃO HORIZONTAL EM SOLO DE 1A CATEGORIA "},null,"SINAPI",{"$f":"VLOOKUP(A81,ORÇAMENTO!$A$10:$I$30,4)","v":101116},"UNIDADE: ",{"$f":"VLOOKUP(A81,ORÇAMENTO!$A$10:$I$30,5)","v":"M3"}]
[]
[null,"TIPO ITEM","CODIGO ITEM","DESCRIÇÃO ITEM","UNIDADE ITEM","COEFICIENTE","PRECO UNITARIO","CUSTO TOTAL"]
[null,"COMPOSICAO","5847","TRATOR DE ESTEIRAS, POTÊNCIA 170 HP, PESO OPERACIONAL 19 T, CAÇAMBA 5,2 M3","CHP","0,0048000","253,93",{"$f":"ROUNDDOWN(F86*G86,2)","v":1.21}]
[null,"COMPOSICAO","5849","TRATOR DE ESTEIRAS, POTÊNCIA 170 HP, PESO OPERACIONAL 19 T, CAÇAMBA 5,2 M3","CHI","0,0082000","90,40",{"$f":"ROUNDDOWN(F87*G87,2)","v":0.74}]
[null,"COMPOSICAO","88316","SERVENTE COM ENCARGOS COMPLEMENTARES","H","0,0131000","19,76",{"$f":"ROUNDDOWN(F88*G88,2)","v":0.25}]
[null,"PRODUÇÃO DA EQUIPE",null,null,1,"CUSTO ",null,{"$f":"SUM(H86:H88)","v":2.2000000000000002}]
[null,"TOTAL",{"$nulls":5},{"$f":"H89/E89","v":2.2000000000000002},"OK"]
[null,"BDI                %",{"$nulls":5},{"$f":"1+$M$1","v":1.2149000000000001}]
[null,"TOTAL DO SERVIÇO - R$",{"$nulls":5},{"$f":"ROUND(H90*H91,2)","v":2.67}]
[]
[7,"CODEVASF",null,null," COMPOSIÇÃO DE PREÇO UNITÁRIO",null,null,null,{"$f":"H104","v":8.7100000000000009},{"$f":"H106","v":10.58}]
[null,"OBRA:  ",{"$f":"$C$2","v":" RECAPEAMENTO E PAVIMENTAÇÃO ASFÁLTICA EM CBUQ - VIAS URBANAS DIVERSAS (SERRA DA SAUDADE / MG) - ITEM 2"},null,null,null,"DATA: ",{"$f":"$H$2","v":" SETEMBRO / 2023   "}]
[null,"SERVIÇO:  ",{"$f":"VLOOKUP(A94,ORÇAMENTO!$A$10:$I$30,3)","v":"CARGA, MANOBRA E DESCARGA DE SOLOS E MATERIAIS GRANULARES EM CAMINHÃO BASCULANTE"},null,"SINAPI",{"$f":"VLOOKUP(A94,ORÇAMENTO!$A$10:$I$30,4)","v":100976},"UNIDADE: ",{"$f":"VLOOKUP(A94,ORÇAMENTO!$A$10:$I$30,5)","v":"M3"}]
[]
[null,"TIPO ITEM","CODIGO ITEM","DESCRIÇÃO ITEM","UNIDADE ITEM","COEFICIENTE","PRECO UNITARIO","CUSTO TOTAL"]
[null,"COMPOSICAO","5940","PÁ CARREGADEIRA SOBRE RODAS, POTÊNCIA LÍQUIDA 128 HP, CAPACIDADE DA CAÇAMBA 1,7 A 2,8 M3, PESO OPERACIONAL 11632 KG","CHP","0,0083000","217,72",{"$f":"ROUNDDOWN(F99*G99,2)","v":1.8}]
[null,"COMPOSICAO","5942","PÁ CARREGADEIRA SOBRE RODAS, POTÊNCIA LÍQUIDA 128 HP, CAPACIDADE DA CAÇAMBA 1,7 A 2,8 M3, PESO OPERACIONAL 11632 KG","CHI","0,0074000","95,85",{"$f":"ROUNDDOWN(F100*G100,2)","v":0.7}]
[null,"COMPOSICAO","89883","CAMINHÃO BASCULANTE 18 M3, COM CAVALO MECÂNICO DE CAPACIDADE MÁXIMA DE TRAÇÃO COMBINADO DE 45000 KG, POTÊNCIA 330 CV, INCLUSIVE SEMIREBOQUE COM CAÇAMBA METÁLICA","CHP","0,0153000","348,45",{"$f":"ROUNDDOWN(F101*G101,2)","v":5.33}]
[null,"COMPOSICAO","89884","CAMINHÃO BASCULANTE 18 M3, COM CAVALO MECÂNICO DE CAPACIDADE MÁXIMA DE TRAÇÃO COMBINADO DE 45000 KG, POTÊNCIA 330 CV, INCLUSIVE SEMIREBOQUE COM CAÇAMBA METÁLICA","CHI","0,0095000","93,65",{"$f":"ROUNDDOWN(F102*G102,2)","v":0.88}]
[null,"PRODUÇÃO DA EQUIPE",null,null,1,"CUSTO ",null,{"$f":"SUM(H99:H102)","v":8.7100000000000009}]
[null,"TOTAL",{"$nulls":5},{"$f":"H103/E103","v":8.7100000000000009},"OK"]
[null,"BDI                %",{"$nulls":5},{"$f":"1+$M$1","v":1.2149000000000001}]
[null,"TOTAL DO SERVIÇO - R$",{"$nulls":5},{"$f":"ROUND(H104*H105,2)","v":10.58}]
[]
[8,"CODEVASF",null,null," COMPOSIÇÃO DE PREÇO UNITÁRIO",null,null,null,{"$f":"H122","v":2.57},{"$f":"H124","v":3.12}]
[null,"OBRA:  ",{"$f":"$C$2","v":" RECAPEAMENTO E PAVIMENTAÇÃO ASFÁLTICA EM CBUQ - VIAS URBANAS DIVERSAS (SERRA DA SAUDADE / MG) - ITEM 2"},null,null,null,"DATA: ",{"$f":"$H$2","v":" SETEMBRO / 2023   "}]
[null,"SERVIÇO:  ",{"$f":"VLOOKUP(A108,ORÇAMENTO!$A$10:$I$30,3)","v":"REGULARIZAÇÃO E COMPACTAÇÃO DO SUBLEITO "},null,"SICRO",{"$f":"VLOOKUP(A108,ORÇAMENTO!$A$10:$I$30,4)","v":100576},"UNIDADE: ","M2"]
[]
[null,"TIPO ITEM","CODIGO ITEM","DESCRIÇÃO ITEM","UNIDADE ITEM","COEFICIENTE","PRECO UNITARIO","CUSTO TOTAL"]
[null,"COMPOSICAO","5901","CAMINHÃO PIPA 10.000 L TRUCADO, PESO BRUTO TOTAL 23.000 KG, CARGA ÚTIL MÁXIMA 15.935 KG, DISTÂNCIA ENTRE EIXOS 4,8 M, POTÊNCIA 230 CV, INCLUSIVE TANQUE DE AÇO PARA TRANSPORTE DE ÁGUA","CHP","0,0010000","294,94",{"$f":"ROUNDDOWN(F113*G113,2)","v":0.28999999999999998}]
[null,"COMPOSICAO","5903","CAMINHÃO PIPA 10.000 L TRUCADO, PESO BRUTO TOTAL 23.000 KG, CARGA ÚTIL MÁXIMA 15.935 KG, DISTÂNCIA ENTRE EIXOS 4,8 M, POTÊNCIA 230 CV, INCLUSIVE TANQUE DE AÇO PARA TRANSPORTE DE ÁGUA","CHI","0,0070000","72,55",0.5]
[null,"COMPOSICAO","5932","MOTONIVELADORA POTÊNCIA BÁSICA LÍQUIDA (PRIMEIRA MARCHA) 125 HP, PESO BRUTO 13032 KG, LARGURA DA LÂMINA DE 3,7 M","CHP","0,0001000","262,71",0.02]
[null,"COMPOSICAO","5934","MOTONIVELADORA POTÊNCIA BÁSICA LÍQUIDA (PRIMEIRA MARCHA) 125 HP, PESO BRUTO 13032 KG, LARGURA DA LÂMINA DE 3,7 M","CHI","0,0080000","109,40",0.87]
[null,"COMPOSICAO","73436","ROLO COMPACTADOR VIBRATÓRIO PÉ DE CARNEIRO PARA SOLOS, POTÊNCIA 80 HP, PESO OPERACIONAL SEM/COM LASTRO 7,4 / 8,8 T, LARGURA DE TRABALHO 1,68 M","CHP","0,0020000","163,19",0.32]
[null,"COMPOSICAO","88316","SERVENTE COM ENCARGOS COMPLEMENTARES","H","0,0080000","19,76",0.15]
[null,"COMPOSICAO","93244","ROLO COMPACTADOR VIBRATÓRIO PÉ DE CARNEIRO PARA SOLOS, POTÊNCIA 80 HP, PESO OPERACIONAL SEM/COM LASTRO 7,4 / 8,8 T, LARGURA DE TRABALHO 1,68 M","CHI","0,0060000","71,18",0.42]
[]
[null,"PRODUÇÃO DA EQUIPE",null,null,1,"CUSTO ",null,{"$f":"SUM(H113:H120)","v":2.57}]
[null,"TOTAL",{"$nulls":5},{"$f":"H121/E121","v":2.57},"OK"]
[null,"BDI                %",{"$nulls":5},{"$f":"1+$M$1","v":1.2149000000000001}]
[null,"TOTAL DO SERVIÇO - R$",{"$nulls":5},{"$f":"ROUND(H122*H123,2)","v":3.12}]
[]
[9,"CODEVASF",null,null," COMPOSIÇÃO DE PREÇO UNITÁRIO",null,null,null,{"$f":"H143","v":104.95},{"$f":"H145","v":127.5}]
[null,"OBRA:  ",{"$f":"$C$2","v":" RECAPEAMENTO E PAVIMENTAÇÃO ASFÁLTICA EM CBUQ - VIAS URBANAS DIVERSAS (SERRA DA SAUDADE / MG) - ITEM 2"},null,null,null,"DATA: ",{"$f":"$H$2","v":" SETEMBRO / 2023   "}]
[null,"SERVIÇO:  ",{"$f":"VLOOKUP(A126,ORÇAMENTO!$A$10:$I$30,3)","v":"EXECUÇÃO E COMPACTAÇÃO DE BASE E OU SUB BASE PARA PAVIMENTAÇÃO DE BICA CORRIDA - EXCLUSIVE CARGA E TRANSPORTE"},null,"SINAPI",{"$f":"VLOOKUP(A126,ORÇAMENTO!$A$10:$I$30,4)","v":96396},"UNIDADE: ",{"$f":"VLOOKUP(A126,ORÇAMENTO!$A$10:$I$30,5)","v":"M3"}]
[]
[null,"TIPO ITEM","CODIGO ITEM","DESCRIÇÃO ITEM","UNIDADE ITEM","COEFICIENTE","PRECO UNITARIO","CUSTO TOTAL"]
[null,"COMPOSICAO","5684","ROLO COMPACTADOR VIBRATÓRIO DE UM CILINDRO AÇO LISO, POTÊNCIA 80 HP, PESO OPERACIONAL MÁXIMO 8,1 T, IMPACTO DINÂMICO 16,15 / 9,5 T, LARGURA DE TRABALHO 1,68 M","CHP","0,0090000","159,98",{"$f":"ROUNDDOWN(F131*G131,2)","v":1.43}]
[null,"COMPOSICAO","5685","ROLO COMPACTADOR VIBRATÓRIO DE UM CILINDRO AÇO LISO, POTÊNCIA 80 HP, PESO OPERACIONAL MÁXIMO 8,1 T, IMPACTO DINÂMICO 16,15 / 9,5 T, LARGURA DE TRABALHO 1,68 M","CHI","0,0210000","69,53",1.46]
[null,"COMPOSICAO","5901","CAMINHÃO PIPA 10.000 L TRUCADO, PESO BRUTO TOTAL 23.000 KG, CARGA ÚTIL MÁXIMA 15.935 KG, DISTÂNCIA ENTRE EIXOS 4,8 M, POTÊNCIA 230 CV, INCLUSIVE TANQUE DE AÇO PARA TRANSPORTE DE ÁGUA","CHP","0,0020000","294,94",0.57999999999999996]
[null,"COMPOSICAO","5903","CAMINHÃO PIPA 10.000 L TRUCADO, PESO BRUTO TOTAL 23.000 KG, CARGA ÚTIL MÁXIMA 15.935 KG, DISTÂNCIA ENTRE EIXOS 4,8 M, POTÊNCIA 230 CV, INCLUSIVE TANQUE DE AÇO PARA TRANSPORTE DE ÁGUA","CHI","0,0280000","72,55",2.0299999999999998]
[null,"COMPOSICAO","5932","MOTONIVELADORA POTÊNCIA BÁSICA LÍQUIDA (PRIMEIRA MARCHA) 125 HP, PESO BRUTO 13032 KG, LARGURA DA LÂMINA DE 3,7 M","CHP","0,0080000","262,71",2.1]
[null,"COMPOSICAO","5934","MOTONIVELADORA POTÊNCIA BÁSICA LÍQUIDA (PRIMEIRA MARCHA) 125 HP, PESO BRUTO 13032 KG, LARGURA DA LÂMINA DE 3,7 M","CHI","0,0220000","109,40",2.4]
[null,"COMPOSICAO","88316","SERVENTE COM ENCARGOS COMPLEMENTARES","H","0,0300000","19,76",0.59]
[null,"COMPOSICAO",4748,"PEDRA BRITADA OU BICA CORRIDA, NÃO CLASSIFICADA (POSTO PEDREIRA/FORNECEDOR, SEM FRETE)","M3","1,0000000",{"$f":"65*1.4","v":91},91]
[null,"COMPOSICAO","96463","ROLO COMPACTADOR DE PNEUS, ESTATICO, PRESSAO VARIAVEL, POTENCIA 110 HP, PESO SEM/COM LASTRO 10,8/27 T, LARGURA DE ROLAGEM 2,30 M","CHP","0,0040000","218,21",0.87]
[null,"COMPOSICAO","96464","ROLO COMPACTADOR DE PNEUS, ESTATICO, PRESSAO VARIAVEL, POTENCIA 110 HP, PESO SEM/COM LASTRO 10,8/27 T, LARGURA DE ROLAGEM 2,30 M","CHI","0,0260000","95,83",2.4900000000000002]
[{"$nulls":7},0]
[null,"PRODUÇÃO DA EQUIPE",null,null,1,"CUSTO ",null,{"$f":"SUM(H131:H141)","v":104.95}]
[null,"TOTAL",{"$nulls":5},{"$f":"H142/E142","v":104.95},"OK"]
[null,"BDI                %",{"$nulls":5},{"$f":"1+$M$1","v":1.2149000000000001}]
[null,"TOTAL DO SERVIÇO - R$",{"$nulls":5},{"$f":"ROUND(H143*H144,2)","v":127.5}]
[]
[10,"CODEVASF",null,null," COMPOSIÇÃO DE PREÇO UNITÁRIO",null,null,null,{"$f":"H162","v":1.23},{"$f":"H164","v":1.49}]
[null,"OBRA:  ",{"$f":"$C$2","v":" RECAPEAMENTO E PAVIMENTAÇÃO ASFÁLTICA EM CBUQ - VIAS URBANAS DIVERSAS (SERRA DA SAUDADE / MG) - ITEM 2"},null,null,null,"DATA: ",{"$f":"$H$2","v":" SETEMBRO / 2023   "}]
[null,"SERVIÇO:  ",{"$f":"VLOOKUP(A147,ORÇAMENTO!$A$10:$I$30,3)","v":"IMPRIMAÇÃO COM EMULSÃO ASFÁLTICA (EAI)"},null,"SINAPI",{"$f":"VLOOKUP(A147,ORÇAMENTO!$A$10:$I$30,4)","v":96401},"UNIDADE: ",{"$f":"VLOOKUP(A147,ORÇAMENTO!$A$10:$I$30,5)","v":"M2"}]
[]
[null,"TIPO ITEM","CODIGO ITEM","DESCRIÇÃO ITEM","UNIDADE ITEM","COEFICIENTE","PRECO UNITARIO","CUSTO TOTAL"]
[null,"COMPOSICAO",5839,"VASSOURA MECÂNICA REBOCÁVEL COM ESCOVA CILÍNDRICA, LARGURA ÚTIL DE VARRIMENTO DE 2,44 M ","CHP","0,0020000",10.3,{"$f":"ROUNDDOWN(F152*G152,2)","v":0.02}]
[null,"COMPOSICAO",5841,"VASSOURA MECÂNICA REBOCÁVEL COM ESCOVA CILÍNDRICA, LARGURA ÚTIL DE VARRIMENTO DE 2,44 M ","CHI","0,0040000",5.18,0.02]
[null,"INSUMO","ANP","EMULSÃO ASFÁLTICA PARA IMPRIMAÇÃO - EAI (FORNECIMENTO COM BDI DIFERENCIADO)","T",{"$f":"1.3/1000","v":1.2999999999999999E-3},null,0]
[null,"COMPOSICAO",83362,"ESPARGIDOR DE ASFALTO PRESSURIZADO, TANQUE 6 M3 COM ISOLAÇÃO TÉRMICA, AQUECIDO COM 2 MAÇARICOS, COM BARRA ESPARGIDORA 3,60 M, MONTADO SOBRE CAMINHÃO  TOCO, PBT 14.300 KG, POTÊNCIA 185 CV","CHP","0,0010000",256.33999999999997,0.25]
[null,"COMPOSICAO",88316,"SERVENTE COM ENCARGOS COMPLEMENTARES","H","0,0060000",19.760000000000002,0.11]
[null,"COMPOSICAO",89035,"TRATOR DE PNEUS, POTÊNCIA 85 CV, TRAÇÃO 4X4, PESO COM LASTRO DE 4.675 KG ","CHP","0,0020000",135.08000000000001,0.27]
[null,"COMPOSICAO",89036,"TRATOR DE PNEUS, POTÊNCIA 85 CV, TRAÇÃO 4X4, PESO COM LASTRO DE 4.675 KG ","CHI","0,0040000",56.48,0.22]
[null,"COMPOSICAO",91486,"ESPARGIDOR DE ASFALTO PRESSURIZADO, TANQUE 6 M3 COM ISOLAÇÃO TÉRMICA, AQUECIDO COM 2 MAÇARICOS, COM BARRA ESPARGIDORA 3,60 M, MONTADO SOBRE CAMINHÃO  TOCO, PBT 14.300 KG, POTÊNCIA 185 CV","CHI","0,0050000",68.430000000000007,0.34]
[{"$nulls":7},0]
[null,"PRODUÇÃO DA EQUIPE",null,null,1,"CUSTO ",null,{"$f":"SUM(H152:H160)","v":1.23}]
[null,"TOTAL",{"$nulls":5},{"$f":"H161/E161","v":1.23},"OK"]
[null,"BDI                %",{"$nulls":5},{"$f":"1+$M$1","v":1.2149000000000001}]
[null,"TOTAL DO SERVIÇO - R$",{"$nulls":5},{"$f":"ROUND(H162*H163,2)","v":1.49}]
[]
[11,"CODEVASF",null,null," COMPOSIÇÃO DE PREÇO UNITÁRIO",null,null,null,{"$f":"H181","v":1.01},{"$f":"H183","v":1.23}]
[null,"OBRA:  ",{"$f":"$C$2","v":" RECAPEAMENTO E PAVIMENTAÇÃO ASFÁLTICA EM CBUQ - VIAS URBANAS DIVERSAS (SERRA DA SAUDADE / MG) - ITEM 2"},null,null,null,"DATA: ",{"$f":"$H$2","v":" SETEMBRO / 2023   "}]
[null,"SERVIÇO:  ",{"$f":"VLOOKUP(A166,ORÇAMENTO!$A$10:$I$30,3)","v":"PINTURA DE LIGAÇÃO COM EMULSÃO ASFÁLTICA RR-1C"},null,"SINAPI",{"$f":"VLOOKUP(A166,ORÇAMENTO!$A$10:$I$30,4)","v":96402},"UNIDADE: ","M2"]
[]
[null,"TIPO ITEM","CODIGO ITEM","DESCRIÇÃO ITEM","UNIDADE ITEM","COEFICIENTE","PRECO UNITARIO","CUSTO TOTAL"]
[null,"COMPOSICAO",5839,"VASSOURA MECÂNICA REBOCÁVEL COM ESCOVA CILÍNDRICA, LARGURA ÚTIL DE VARRIMENTO DE 2,44 M","CHP","0,0020000",10.3,{"$f":"ROUNDDOWN(F171*G171,2)","v":0.02}]
[null,"COMPOSICAO",5841,"VASSOURA MECÂNICA REBOCÁVEL COM ESCOVA CILÍNDRICA, LARGURA ÚTIL DE VARRIMENTO DE 2,44 M","CHI","0,0040000",5.18,0.02]
[null,"INSUMO",41903,"EMULSAO ASFALTICA CATIONICA RR-1C PARA USO EM PAVIMENTACAO ASFALTICA (FORNECIMENTO COM BDI DIFERENCIADO)","KG","0,4500000",null,0]
[null,"COMPOSICAO",83362,"ESPARGIDOR DE ASFALTO PRESSURIZADO, TANQUE 6 M3 COM ISOLAÇÃO TÉRMICA, AQUECIDO COM 2 MAÇARICOS, COM BARRA ESPARGIDORA 3,60 M, MONTADO SOBRE CAMINHÃO  TOCO, PBT 14.300 KG, POTÊNCIA 185 CV","CHP","0,0004000",256.33999999999997,0.1]
[null,"COMPOSICAO",88316,"SERVENTE COM ENCARGOS COMPLEMENTARES","H","0,0055000",19.760000000000002,0.1]
[null,"COMPOSICAO",89035,"TRATOR DE PNEUS, POTÊNCIA 85 CV, TRAÇÃO 4X4, PESO COM LASTRO DE 4.675 KG","CHP","0,0017000",135.08000000000001,0.22]
[null,"COMPOSICAO",89036,"TRATOR DE PNEUS, POTÊNCIA 85 CV, TRAÇÃO 4X4, PESO COM LASTRO DE 4.675 KG","CHI","0,0038000",56.48,0.21]
[null,"COMPOSICAO",91486,"ESPARGIDOR DE ASFALTO PRESSURIZADO, TANQUE 6 M3 COM ISOLAÇÃO TÉRMICA, AQUECIDO COM 2 MAÇARICOS, COM BARRA ESPARGIDORA 3,60 M, MONTADO SOBRE CAMINHÃO  TOCO, PBT 14.300 KG, POTÊNCIA 185 CV","CHI","0,0051000",68.430000000000007,0.34]
[{"$nulls":7},0]
[null,"PRODUÇÃO DA EQUIPE",null,null,1,"CUSTO ",null,{"$f":"SUM(H171:H179)","v":1.01}]
[null,"TOTAL",{"$nulls":5},{"$f":"H180/E180","v":1.01},"OK"]
[null,"BDI                %",{"$nulls":5},{"$f":"1+$M$1","v":1.2149000000000001}]
[null,"TOTAL DO SERVIÇO - R$",{"$nulls":5},{"$f":"ROUND(H181*H182,2)","v":1.23}]
[]
[12,"CODEVASF",null,null," COMPOSIÇÃO DE PREÇO UNITÁRIO",null,null,null,{"$f":"H203","v":129.6},{"$f":"H205","v":157.44999999999999}]
[null,"OBRA:  ",{"$f":"$C$2","v":" RECAPEAMENTO E PAVIMENTAÇÃO ASFÁLTICA EM CBUQ - VIAS URBANAS DIVERSAS (SERRA DA SAUDADE / MG) - ITEM 2"},null,null,null,"DATA: ",{"$f":"$H$2","v":" SETEMBRO / 2023   "}]
[null,"SERVIÇO:  ",{"$f":"VLOOKUP(A185,ORÇAMENTO!$A$10:$I$30,3)","v":"EXECUÇÃO DE PAVIMENTO COM APLICAÇÃO DE CONCRETO ASFÁLTICO USINADO A QUENTE (CBUQ), CAMADA DE ROLAMENTO - EXCLUSIVE TRANSPORTE"},null,"SINAPI",{"$f":"VLOOKUP(A185,ORÇAMENTO!$A$10:$I$30,4)","v":95995},"UNIDADE: ",{"$f":"VLOOKUP(A185,ORÇAMENTO!$A$10:$I$30,5)","v":"M3"}]
[]
[null,"TIPO ITEM","CODIGO ITEM","DESCRIÇÃO ITEM","UNIDADE ITEM","COEFICIENTE","PRECO UNITARIO","CUSTO TOTAL"]
[null,"INSUMO",1518,"CONCRETO BETUMINOSO USINADO A QUENTE (CBUQ) PARA PAVIMENTACAO ASFALTICA, PADRAO DNIT, FAIXA C, COM CAP 50/70 - AQUISICAO POSTO USINA (FORNECIMENTO COM BDI DIFERENCIADO)","T","2,5548000",null,{"$f":"ROUNDDOWN(F190*G190,2)","v":0}]
[null,"COMPOSICAO","5835","VIBROACABADORA DE ASFALTO SOBRE ESTEIRAS, LARGURA DE PAVIMENTAÇÃO 1,90 M A 5,30 M, POTÊNCIA 105 HP CAPACIDADE 450 T/H","CHP","0,0464000","396,75",18.399999999999999]
[null,"COMPOSICAO","5837","VIBROACABADORA DE ASFALTO SOBRE ESTEIRAS, LARGURA DE PAVIMENTAÇÃO 1,90 M A 5,30 M, POTÊNCIA 105 HP CAPACIDADE 450 T/H ","CHI","0,0949000","165,12",15.66]
[null,"COMPOSICAO",88314,"RASTELEIRO COM ENCARGOS COMPLEMENTARES","H","1,1301000","26,52",29.97]
[null,"COMPOSICAO",91386,"CAMINHÃO BASCULANTE 10 M3, TRUCADO CABINE SIMPLES, PESO BRUTO TOTAL 23.000 KG, CARGA ÚTIL MÁXIMA 15.935 KG, DISTÂNCIA ENTRE EIXOS 4,80 M, POTÊNCIA 230 CV INCLUSIVE CAÇAMBA METÁLICA ","CHP","0,0464000","252,13",11.69]
[null,"COMPOSICAO",95631,"ROLO COMPACTADOR VIBRATORIO TANDEM, ACO LISO, POTENCIA 125 HP, PESO SEM/COM LASTRO 10,20/11,65 T, LARGURA DE TRABALHO 1,73 M ","CHP","0,0805000","228,02",18.350000000000001]
[null,"COMPOSICAO",95632,"ROLO COMPACTADOR VIBRATORIO TANDEM, ACO LISO, POTENCIA 125 HP, PESO SEM/COM LASTRO 10,20/11,65 T, LARGURA DE TRABALHO 1,73 M ","CHI","0,0607000","89,32",5.42]
[null,"COMPOSICAO",96155,"TRATOR DE PNEUS COM POTÊNCIA DE 85 CV, TRAÇÃO 4X4, COM VASSOURA MECÂNICA ACOPLADA ","CHI","0,1071000","61,42",6.57]
[null,"COMPOSICAO",96157,"TRATOR DE PNEUS COM POTÊNCIA DE 85 CV, TRAÇÃO 4X4, COM VASSOURA MECÂNICA ACOPLADA","CHP","0,0341000","144,29",4.92]
[null,"COMPOSICAO",96463,"ROLO COMPACTADOR DE PNEUS, ESTATICO, PRESSAO VARIAVEL, POTENCIA 110 HP, PESO SEM/COM LASTRO 10,8/27 T, LARGURA DE ROLAGEM 2,30 M ","CHP","0,0419000","218,21",9.14]
[null,"COMPOSICAO",96464,"ROLO COMPACTADOR DE PNEUS, ESTATICO, PRESSAO VARIAVEL, POTENCIA 110 HP, PESO SEM/COM LASTRO 10,8/27 T, LARGURA DE ROLAGEM 2,30 M ","CHI","0,0990000","95,83",9.48]
[{"$nulls":7},0]
[null,"PRODUÇÃO DA EQUIPE",null,null,1,"CUSTO ",null,{"$f":"SUM(H190:H201)","v":129.6}]
[null,"TOTAL",{"$nulls":5},{"$f":"H202/E202","v":129.6},"OK"]
[null,"BDI                %",{"$nulls":5},{"$f":"1+$M$1","v":1.2149000000000001}]
[null,"TOTAL DO SERVIÇO - R$",{"$nulls":5},{"$f":"ROUND(H203*H204,2)","v":157.44999999999999}]
[]
[13,"CODEVASF",null,null," COMPOSIÇÃO DE PREÇO UNITÁRIO",null,null,null,{"$f":"H216","v":0.73},{"$f":"H218","v":0.89}]
[null,"OBRA:  ",{"$f":"$C$2","v":" RECAPEAMENTO E PAVIMENTAÇÃO ASFÁLTICA EM CBUQ - VIAS URBANAS DIVERSAS (SERRA DA SAUDADE / MG) - ITEM 2"},null,null,null,"DATA: ",{"$f":"$H$2","v":" SETEMBRO / 2023   "}]
[null,"SERVIÇO:  ",{"$f":"VLOOKUP(A207,ORÇAMENTO!$A$10:$I$30,3)","v":"TRANSPORTE COM CAMINHÃO BASCULANTE, EM VIA URBANA PAVIMENTADA"},null,"SINAPI",{"$f":"VLOOKUP(A207,ORÇAMENTO!$A$10:$I$30,4)","v":95427},"UNIDADE: ",{"$f":"VLOOKUP(A207,ORÇAMENTO!$A$10:$I$30,5)","v":"M3XKM"}]
[]
[null,"TIPO ITEM","CODIGO ITEM","DESCRIÇÃO ITEM","UNIDADE ITEM","COEFICIENTE","PRECO UNITARIO","CUSTO TOTAL"]
[null,"COMPOSICAO","89883","CAMINHÃO BASCULANTE 18 M3, COM CAVALO MECÂNICO DE CAPACIDADE MÁXIMA DE TRAÇÃO COMBINADO DE 45000 KG, POTÊNCIA 330 CV, INCLUSIVE SEMIREBOQUE COM CAÇAMBA METÁLICA","CHP","0,0019000",348.45,{"$f":"ROUNDDOWN(F212*G212,2)","v":0.66}]
[null,"COMPOSICAO","89884","CAMINHÃO BASCULANTE 18 M3, COM CAVALO MECÂNICO DE CAPACIDADE MÁXIMA DE TRAÇÃO COMBINADO DE 45000 KG, POTÊNCIA 330 CV, INCLUSIVE SEMIREBOQUE COM CAÇAMBA METÁLICA","CHI","0,0008000",93.65,{"$f":"ROUNDDOWN(F213*G213,2)","v":7.0000000000000007E-2}]
[{"$nulls":7},{"$f":"ROUNDDOWN(F214*G214,2)","v":0}]
[null,"PRODUÇÃO DA EQUIPE",null,null,1,"CUSTO ",null,{"$f":"SUM(H212:H214)","v":0.73}]
[null,"TOTAL",{"$nulls":5},{"$f":"H215/E215","v":0.73},"OK"]
[null,"BDI                %",{"$nulls":5},{"$f":"1+$M$1","v":1.2149000000000001}]
[null,"TOTAL DO SERVIÇO - R$",{"$nulls":5},{"$f":"ROUND(H216*H217,2)","v":0.89}]
[]
[14,"CODEVASF",null,null," COMPOSIÇÃO DE PREÇO UNITÁRIO",null,null,null,{"$f":"H229","v":1.03},{"$f":"H231","v":1.25}]
[null,"OBRA:  ",{"$f":"$C$2","v":" RECAPEAMENTO E PAVIMENTAÇÃO ASFÁLTICA EM CBUQ - VIAS URBANAS DIVERSAS (SERRA DA SAUDADE / MG) - ITEM 2"},null,null,null,"DATA: ",{"$f":"$H$2","v":" SETEMBRO / 2023   "}]
[null,"SERVIÇO:  ",{"$f":"VLOOKUP(A220,ORÇAMENTO!$A$10:$I$30,3)","v":"TRANSPORTE COM CAMINHÃO CARROCERIA 9T, EM VIA URBANA PAVIMENTADA"},null,"SINAPI",{"$f":"VLOOKUP(A220,ORÇAMENTO!$A$10:$I$30,4)","v":100947},"UNIDADE: ",{"$f":"VLOOKUP(A220,ORÇAMENTO!$A$10:$I$30,5)","v":"TXKM"}]
[]
[null,"TIPO ITEM","CODIGO ITEM","DESCRIÇÃO ITEM","UNIDADE ITEM","COEFICIENTE","PRECO UNITARIO","CUSTO TOTAL"]
[null,"COMPOSICAO","5824","CAMINHÃO TOCO, PBT 16.000 KG, CARGA ÚTIL MÁX. 10.685 KG, DIST. ENTRE EIXOS 4,8 M, POTÊNCIA 189 CV, INCLUSIVE CARROCERIA FIXA ABERTA DE MADEIRA P/ TRANSPORTE GERAL DE CARGA SECA, DIMEN. APROX. 2,5 X 7,00 X 0,50 M ","CHP",3.8999999999999998E-3,202.74,{"$f":"ROUNDDOWN(F225*G225,2)","v":0.79}]
[null,"COMPOSICAO","5826","CAMINHÃO TOCO, PBT 16.000 KG, CARGA ÚTIL MÁX. 10.685 KG, DIST. ENTRE EIXOS 4,8 M, POTÊNCIA 189 CV, INCLUSIVE CARROCERIA FIXA ABERTA DE MADEIRA P/ TRANSPORTE GERAL DE CARGA SECA, DIMEN. APROX. 2,5 X 7,00 X 0,50 M ","CHI","0,0040000",60.95,{"$f":"ROUNDDOWN(F226*G226,2)","v":0.24}]
[{"$nulls":7},{"$f":"ROUNDDOWN(F227*G227,2)","v":0}]
[null,"PRODUÇÃO DA EQUIPE",null,null,1,"CUSTO ",null,{"$f":"SUM(H225:H227)","v":1.03}]
[null,"TOTAL",{"$nulls":5},{"$f":"H228/E228","v":1.03},"OK"]
[null,"BDI                %",{"$nulls":5},{"$f":"1+$M$1","v":1.2149000000000001}]
[null,"TOTAL DO SERVIÇO - R$",{"$nulls":5},{"$f":"ROUND(H229*H230,2)","v":1.25}]
[]
[15,"CODEVASF",null,null," COMPOSIÇÃO DE PREÇO UNITÁRIO",null,null,null,{"$f":"H242","v":0.44999999999999996},{"$f":"H244","v":0.52}]
[null,"OBRA:  ",{"$f":"$C$2","v":" RECAPEAMENTO E PAVIMENTAÇÃO ASFÁLTICA EM CBUQ - VIAS URBANAS DIVERSAS (SERRA DA SAUDADE / MG) - ITEM 2"},null,null,null,"DATA: ",{"$f":"$H$2","v":" SETEMBRO / 2023   "}]
[null,"SERVIÇO:  ",{"$f":"VLOOKUP(A233,ORÇAMENTO!$A$10:$I$30,3)","v":"TRANSPORTE DE MASSA ASFÁLTICA COM CAMINHÃO BASCULANTE, EM VIA URBANA PAVIMENTADA (BDI DIFERENCIADO)"},null,"SINAPI",{"$f":"VLOOKUP(A233,ORÇAMENTO!$A$10:$I$30,4)","v":95430},"UNIDADE: ",{"$f":"VLOOKUP(A233,ORÇAMENTO!$A$10:$I$30,5)","v":"TXKM"}]
[]
[null,"TIPO ITEM","CODIGO ITEM","DESCRIÇÃO ITEM","UNIDADE ITEM","COEFICIENTE","PRECO UNITARIO","CUSTO TOTAL"]
[null,"COMPOSICAO","89883","CAMINHÃO BASCULANTE 18 M3, COM CAVALO MECÂNICO DE CAPACIDADE MÁXIMA DE TRAÇÃO COMBINADO DE 45000 KG, POTÊNCIA 330 CV, INCLUSIVE SEMIREBOQUE COM CAÇAMBA METÁLICA","CHP","0,0012000",348.45,{"$f":"ROUNDDOWN(F238*G238,2)","v":0.41}]
[null,"COMPOSICAO","89884","CAMINHÃO BASCULANTE 18 M3, COM CAVALO MECÂNICO DE CAPACIDADE MÁXIMA DE TRAÇÃO COMBINADO DE 45000 KG, POTÊNCIA 330 CV, INCLUSIVE SEMIREBOQUE COM CAÇAMBA METÁLICA","CHI","0,0005000",93.65,{"$f":"ROUNDDOWN(F239*G239,2)","v":0.04}]
[{"$nulls":7},{"$f":"ROUNDDOWN(F240*G240,2)","v":0}]
[null,"PRODUÇÃO DA EQUIPE",null,null,1,"CUSTO ",null,{"$f":"SUM(H238:H240)","v":0.44999999999999996}]
[null,"TOTAL",{"$nulls":5},{"$f":"H241/E241","v":0.44999999999999996},"OK"]
[null,"BDI                %",{"$nulls":5},{"$f":"1+$M$2","v":1.1499999999999999}]
[null,"TOTAL DO SERVIÇO - R$",{"$nulls":5},{"$f":"ROUND(H242*H243,2)","v":0.52}]
[]
[16,"CODEVASF",null,null," COMPOSIÇÃO DE PREÇO UNITÁRIO",null,null,null,{"$f":"H254","v":0.52},{"$f":"H256","v":0.6}]
[null,"OBRA:  ",{"$f":"$C$2","v":" RECAPEAMENTO E PAVIMENTAÇÃO ASFÁLTICA EM CBUQ - VIAS URBANAS DIVERSAS (SERRA DA SAUDADE / MG) - ITEM 2"},null,null,null,"DATA: ",{"$f":"$H$2","v":" SETEMBRO / 2023   "}]
[null,"SERVIÇO:  ",{"$f":"VLOOKUP(A246,ORÇAMENTO!$A$10:$I$30,3)","v":"TRANSPORTE COM CAMINHÃO TANQUE DE TRANSPORTE DE MATERIAL ASFÁLTICO DE 30000 L, EM VIA URBANA PAVIMENTADA (BDI DIFERENCIADO)"},null,"SINAPI",{"$f":"VLOOKUP(A246,ORÇAMENTO!$A$10:$I$30,4)","v":102331},"UNIDADE: ",{"$f":"VLOOKUP(A246,ORÇAMENTO!$A$10:$I$30,5)","v":"TXKM"}]
[]
[null,"TIPO ITEM","CODIGO ITEM","DESCRIÇÃO ITEM","UNIDADE ITEM","COEFICIENTE","PRECO UNITARIO","CUSTO TOTAL"]
[null,"COMPOSICAO","91645","CAMINHÃO DE TRANSPORTE DE MATERIAL ASFÁLTICO 30.000 L, COM CAVALO MECÂNICO DE CAPACIDADE MÁXIMA DE TRAÇÃO COMBINADO DE 66.000 KG, POTÊNCIA 360 CV, INCLUSIVE TANQUE DE ASFALTO COM SERPENTINA ","CHP","0,0011000","442,21",{"$f":"ROUNDDOWN(F251*G251,2)","v":0.48}]
[null,"COMPOSICAO","91646","CAMINHÃO DE TRANSPORTE DE MATERIAL ASFÁLTICO 30.000 L, COM CAVALO MECÂNICO DE CAPACIDADE MÁXIMA DE TRAÇÃO COMBINADO DE 66.000 KG, POTÊNCIA 360 CV, INCLUSIVE TANQUE DE ASFALTO COM SERPENTINA","CHI","0,0005000","98,91",{"$f":"ROUNDDOWN(F252*G252,2)","v":0.04}]
[null,"PRODUÇÃO DA EQUIPE",null,null,1,"CUSTO ",null,{"$f":"SUM(H251:H252)","v":0.52}]
[null,"TOTAL",{"$nulls":5},{"$f":"H253/E253","v":0.52},"OK"]
[null,"BDI                %",{"$nulls":5},{"$f":"1+$M$2","v":1.1499999999999999}]
[null,"TOTAL DO SERVIÇO - R$",{"$nulls":5},{"$f":"ROUND(H254*H255,2)","v":0.6}]
[]
[17,"CODEVASF",null,null," COMPOSIÇÃO DE PREÇO UNITÁRIO",null,null,null,{"$f":"H272","v":57.319999999999986},{"$f":"H274","v":69.64}]
[null,"OBRA:  ",{"$f":"$C$2","v":" RECAPEAMENTO E PAVIMENTAÇÃO ASFÁLTICA EM CBUQ - VIAS URBANAS DIVERSAS (SERRA DA SAUDADE / MG) - ITEM 2"},null,null,null,"DATA: ",{"$f":"$H$2","v":" SETEMBRO / 2023   "}]
[null,"SERVIÇO:  ",{"$f":"VLOOKUP(A258,ORÇAMENTO!$A$10:$I$30,3)","v":"GUIA (MEIO-FIO) E SARJETA CONJUGADOS DE CONCRETO, MOLDADA IN LOCO EM M CR 57,38 TRECHO RETO COM EXTRUSORA, 45 CM BASE (15 CM BASE DA GUIA + 30 CM BAS E DA SARJETA) X 22 CM ALTURA "},null,"SINAPI",{"$f":"VLOOKUP(A258,ORÇAMENTO!$A$10:$I$30,4)","v":94267},"UNIDADE: ",{"$f":"VLOOKUP(A258,ORÇAMENTO!$A$10:$I$30,5)","v":"M"}]
[]
[null,"TIPO ITEM","CODIGO ITEM","DESCRIÇÃO ITEM","UNIDADE ITEM","COEFICIENTE","PRECO UNITARIO","CUSTO TOTAL"]
[null,"INSUMO","370","AREIA MEDIA - POSTO JAZIDA/FORNECEDOR (RETIRADO NA JAZIDA, SEM TRANSPORTE)","M3","0,0150000","97,50",{"$f":"ROUNDDOWN(F263*G263,2)","v":1.46}]
[null,"INSUMO","34492","CONCRETO USINADO BOMBEAVEL, CLASSE DE RESISTENCIA C20, COM BRITA 0 E 1, SLUMP = 100 +/- 20 MM, EXCLUI SERVICO DE BOMBEAMENTO (NBR 8953)","M3","0,0630000","550,00",34.65,{"$nulls":8},{"$f":"AVERAGE(I264:L264)","v":{"$error":"#DIV/0!"}},"(MÉDIA)"]
[null,"COMPOSICAO","88243","AJUDANTE ESPECIALIZADO COM ENCARGOS COMPLEMENTARES","H","0,1090000","21,76",2.37]
[null,"COMPOSICAO","88309","PEDREIRO COM ENCARGOS COMPLEMENTARES","H","0,2440000","27,45",6.69]
[null,"COMPOSICAO","88316","SERVENTE COM ENCARGOS COMPLEMENTARES","H","0,4870000","19,76",9.6199999999999992]
[null,"COMPOSICAO","88631","ARGAMASSA TRAÇO 1:4 (EM VOLUME DE CIMENTO E AREIA MÉDIA ÚMIDA), PREPARO MANUAL. AF_08/2019","M3","0,0030000","575,87",1.72]
[null,"COMPOSICAO","92960","MÁQUINA EXTRUSORA DE CONCRETO PARA GUIAS E SARJETAS, MOTOR A DIESEL, POTÊNCIA 14 CV - CHP DIURNO. AF_12/2015","CHP","0,0180000","18,46",0.33]
[null,"COMPOSICAO","92961","MÁQUINA EXTRUSORA DE CONCRETO PARA GUIAS E SARJETAS, MOTOR A DIESEL, POTÊNCIA 14 CV - CHI DIURNO. AF_12/2015","CHI","0,0910000","5,38",0.48]
[null,"PRODUÇÃO DA EQUIPE",null,null,1,"CUSTO ",null,{"$f":"SUM(H263:H270)","v":57.319999999999986}]
[null,"TOTAL",{"$nulls":5},{"$f":"H271/E271","v":57.319999999999986},"OK"]
[null,"BDI                %",{"$nulls":5},{"$f":"1+$M$1","v":1.2149000000000001}]
[null,"TOTAL DO SERVIÇO - R$",{"$nulls":5},{"$f":"ROUND(H272*H273,2)","v":69.64}]
[]
[17.100000000000001,"CODEVASF",null,null," COMPOSIÇÃO DE PREÇO UNITÁRIO",null,null,null,{"$f":"H288","v":603.86},{"$f":"H290","v":733.63}]
[null,"OBRA:  ",{"$f":"$C$2","v":" RECAPEAMENTO E PAVIMENTAÇÃO ASFÁLTICA EM CBUQ - VIAS URBANAS DIVERSAS (SERRA DA SAUDADE / MG) - ITEM 2"},null,null,null,"DATA: ",{"$f":"$H$2","v":" SETEMBRO / 2023   "}]
[null,"SERVIÇO:  ",{"$f":"VLOOKUP(A276,ORÇAMENTO!$A$10:$I$39,3)","v":"DESCIDA D’ÁGUA DE ATERROS EM DEGRAUS - DAD 04 - AREIA E BRITA COMERCIAIS"},null,"SINAPI",{"$f":"VLOOKUP(A276,ORÇAMENTO!$A$10:$I$43,4)","v":2003411},"UNIDADE: ",{"$f":"VLOOKUP(A276,ORÇAMENTO!$A$10:$I$43,5)","v":"M"}]
[]
[null,"TIPO ITEM","CODIGO ITEM","DESCRIÇÃO ITEM","UNIDADE ITEM","COEFICIENTE","PRECO UNITARIO","CUSTO TOTAL"]
[null,"COMPOSIÇÃO",101616,"PREPARO DE FUNDO DE VALA COM LARGURA MENOR QUE 1,5 M (ACERTO DO SOLO NATURAL)","M2",0.9,6.07,{"$f":"ROUNDDOWN(F281*G281,2)","v":5.46}]
[null,"COMPOSIÇÃO",103797,"ARMAÇÃO DE DESCIDA DÁGUA UTILIZANDO AÇO CA-60 DE 5 MM","KG",11.96,15.53,185.73]
[null,"INSUMO","34492","CONCRETO USINADO BOMBEAVEL, CLASSE DE RESISTENCIA C20, COM BRITA 0 E 1, SLUMP = 100 +/- 20 MM","M3",0.59,550,324.5]
[null,"COMPOSIÇÃO",96527,"ESCAVAÇÃO MANUAL DE VALA ","M3",0.37,121.8,45.06]
[null,"COMPOSIÇÃO",103795,"FABRICAÇÃO, MONTAGEM E DESMONTAGEM DE FÔRMA PARA DRENAGEM EM CHAPA DE MADEIRA COMPENSADA RESINADA, E = 17 MM","M2",0.53,81.34,43.11]
[{"$nulls":7},0]
[null,"PRODUÇÃO DA EQUIPE",null,null,1,"CUSTO ",null,{"$f":"SUM(H281:H286)","v":603.86}]
[null,"TOTAL",{"$nulls":5},{"$f":"H287/E287","v":603.86},"OK"]
[null,"BDI                %",{"$nulls":5},{"$f":"1+$M$1","v":1.2149000000000001}]
[null,"TOTAL DO SERVIÇO - R$",{"$nulls":5},{"$f":"ROUND(H288*H289,2)","v":733.63}]
[]
[17.2,"CODEVASF",null,null," COMPOSIÇÃO DE PREÇO UNITÁRIO",null,null,null,{"$f":"H302","v":781.01},{"$f":"H304","v":948.85}]
[null,"OBRA:  ",{"$f":"$C$2","v":" RECAPEAMENTO E PAVIMENTAÇÃO ASFÁLTICA EM CBUQ - VIAS URBANAS DIVERSAS (SERRA DA SAUDADE / MG) - ITEM 2"},null,null,null,"DATA: ",{"$f":"$H$2","v":" SETEMBRO / 2023   "}]
[null,"SERVIÇO:  ",{"$f":"VLOOKUP(A292,ORÇAMENTO!$A$10:$I$39,3)","v":"BACIA DE DISSIPAÇÃO, TIPO BACIA EM PEDRA DE MÃO FIXADA COM CONCRETO (DEB 01, 02), COM PREPARO MANUAL, FCK = 20 MPA, LANÇADO MANUALMENTE, INCLUINDO MATERIAIS E FÔRMAS"},null,"SINAPI",{"$f":"VLOOKUP(A292,ORÇAMENTO!$A$10:$I$43,4)","v":103930},"UNIDADE: ",{"$f":"VLOOKUP(A292,ORÇAMENTO!$A$10:$I$43,5)","v":"M"}]
[]
[null,"TIPO ITEM","CODIGO ITEM","DESCRIÇÃO ITEM","UNIDADE ITEM","COEFICIENTE","PRECO UNITARIO","CUSTO TOTAL"]
[null,"COMPOSICAO","103796","FABRICAÇÃO, MONTAGEM E DESMONTAGEM DE FÔRMA PARA BACIA DE DISSIPAÇÃO, EM MADEIRA SERRADA, E = 25 MM","M2","4,1235000","60,26",{"$f":"ROUNDDOWN(F297*G297,2)","v":248.48}]
[null,"COMPOSICAO","103799","PEDRA DE MÃO FIXADA COM CONCRETO PARA BACIA DE DISSIPAÇÃO, 40% DE CONCRETO EM VOLUME, FCK = 20 MPA, COM USO DE JERICA E PREPARO EM BETONEIRA DE 600 L - AREIA, BRITA E PEDRA DE MÃO COMERCIAIS - LANÇAMENTO, ADENSAMENTO E ACABAMENTO","M3","0,5387000","432,56",233.02]
[null,"COMPOSICAO","103801","CONCRETAGEM DE DISSIPADOR DE ENERGIA, FCK = 20 MPA, COM USO DE JERICAS E PREPARO EM BETONEIRA DE 600 L - AREIA E BRITA COMERCIAIS - LANÇAMENTO, ADENSAMENTO E ACABAMENTO","M3","0,4613000","649,28",299.51]
[{"$nulls":7},0]
[null,"PRODUÇÃO DA EQUIPE",null,null,1,"CUSTO ",null,{"$f":"SUM(H297:H300)","v":781.01}]
[null,"TOTAL",{"$nulls":5},{"$f":"H301/E301","v":781.01},"OK"]
[null,"BDI                %",{"$nulls":5},{"$f":"1+$M$1","v":1.2149000000000001}]
[null,"TOTAL DO SERVIÇO - R$",{"$nulls":5},{"$f":"ROUND(H302*H303,2)","v":948.85}]
[]
[18,"CODEVASF",null,null," COMPOSIÇÃO DE PREÇO UNITÁRIO",null,null,null,{"$f":"H319","v":422.8},{"$f":"H321","v":513.66}]
[null,"OBRA:  ",{"$f":"$C$2","v":" RECAPEAMENTO E PAVIMENTAÇÃO ASFÁLTICA EM CBUQ - VIAS URBANAS DIVERSAS (SERRA DA SAUDADE / MG) - ITEM 2"},null,null,null,"DATA: ",{"$f":"$H$2","v":" SETEMBRO / 2023   "}]
[null,"SERVIÇO:  ",{"$f":"VLOOKUP(A306,ORÇAMENTO!$A$10:$I$39,3)","v":"FORNECIMENTO E INSTALAÇÃO DE PLACA DE SINALIZAÇÃO VIÁRIA - REGULAMENTAÇÃO CIRCULAR "},null,"SINAPI",{"$f":"VLOOKUP(A306,ORÇAMENTO!$A$10:$I$43,4)","v":"CPU.4"},"UNIDADE: ",{"$f":"VLOOKUP(A306,ORÇAMENTO!$A$10:$I$43,5)","v":"UN."}]
[]
[null,"TIPO ITEM","CODIGO ITEM","DESCRIÇÃO ITEM","UNIDADE ITEM","COEFICIENTE","PRECO UNITARIO","CUSTO TOTAL"]
[null,"COMPOSICAO",94962,"CONCRETO MAGRO PARA LASTRO, TRAÇO 1:4,5:4,5 (EM MASSA SECA DE CIMENTO/ AREIA / BRITA 1)","M3",2.4E-2,402.82,{"$f":"ROUNDDOWN(F311*G311,2)","v":9.66}]
[null,"COMPOSICAO",93358,"ESCAVAÇÃO MANUAL DE VALA COM PROFUNDIDADE MENOR OU IGUAL A 1,30 M","M3",2.4E-2,78.17,1.87]
[null,"COMPOSICAO",88309,"PEDREIRO COM ENCARGOS COMPLEMENTARES","H",0.2,27.45,5.49]
[null,"COMPOSICAO",88316,"SERVENTE COM ENCARGOS COMPLEMENTARES","H",1,19.760000000000002,19.760000000000002]
[null,"COMPOSICAO",103670,"LANÇAMENTO COM USO DE BALDES, ADENSAMENTO E ACABAMENTO DE CONCRETO EM ESTRUTURAS","M3",2.4E-2,281.77999999999997,6.76]
[null,"INSUMO",34723,"PLACA DE SINALIZACAO EM CHAPA DE ACO NUM 16 COM PINTURA REFLETIVA (CIRCULAR - D=50CM) ","M2",{"$f":"3.14*0.5*0.5/4","v":0.19625000000000001},577.5,113.33]
[null,"INSUMO",21013,"TUBO AÇO GALVANIZADO COM COSTURA, CLASSE LEVE, DN 50 MM ( 2\")E = 3,00 MM, *4,40* KG/M ","M",3.5,75.98,265.93]
[null,"PRODUÇÃO DA EQUIPE",null,null,1,"CUSTO ",null,{"$f":"SUM(H311:H317)","v":422.8}]
[null,"TOTAL",{"$nulls":5},{"$f":"H318/E318","v":422.8},"OK"]
[null,"BDI                %",{"$nulls":5},{"$f":"1+$M$1","v":1.2149000000000001}]
[null,"TOTAL DO SERVIÇO - R$",{"$nulls":5},{"$f":"ROUND(H319*H320,2)","v":513.66}]
[]
[19,"CODEVASF",null,null," COMPOSIÇÃO DE PREÇO UNITÁRIO",null,null,null,{"$f":"H336","v":482.72},{"$f":"H338","v":586.46}]
[null,"OBRA:  ",{"$f":"$C$2","v":" RECAPEAMENTO E PAVIMENTAÇÃO ASFÁLTICA EM CBUQ - VIAS URBANAS DIVERSAS (SERRA DA SAUDADE / MG) - ITEM 2"},null,null,null,"DATA: ",{"$f":"$H$2","v":" SETEMBRO / 2023   "}]
[null,"SERVIÇO:  ",{"$f":"VLOOKUP(A323,ORÇAMENTO!$A$10:$I$39,3)","v":"FORNECIMENTO E INSTALAÇÃO DE PLACA DE SINALIZAÇÃO VIÁRIA - REGULAMENTAÇÃO (PARE)"},null,"SINAPI",{"$f":"VLOOKUP(A323,ORÇAMENTO!$A$10:$I$43,4)","v":"CPU.5"},"UNIDADE: ","UN."]
[]
[null,"TIPO ITEM","CODIGO ITEM","DESCRIÇÃO ITEM","UNIDADE ITEM","COEFICIENTE","PRECO UNITARIO","CUSTO TOTAL"]
[null,"COMPOSICAO",94962,"CONCRETO MAGRO PARA LASTRO, TRAÇO 1:4,5:4,5 (EM MASSA SECA DE CIMENTO/ AREIA/ BRITA 1)","M3",2.4E-2,402.82,{"$f":"ROUNDDOWN(F328*G328,2)","v":9.66}]
[null,"COMPOSICAO",93358,"ESCAVAÇÃO MANUAL DE VALA COM PROFUNDIDADE MENOR OU IGUAL A 1,30 M","M3",2.4E-2,78.17,1.87]
[null,"COMPOSICAO",88309,"PEDREIRO COM ENCARGOS COMPLEMENTARES","H",0.2,27.45,5.49]
[null,"COMPOSICAO",88316,"SERVENTE COM ENCARGOS COMPLEMENTARES","H",1,19.760000000000002,19.760000000000002]
[null,"COMPOSICAO",103670,"LANÇAMENTO COM USO DE BALDES, ADENSAMENTO E ACABAMENTO DE CONCRETO EM ESTRUTURAS","M3",2.4E-2,281.77999999999997,6.76]
[null,"INSUMO",34723,"PLACA DE SINALIZACAO EM CHAPA DE ACO NUM 16 COM PINTURA REFLETIVA ","M2",{"$f":"4*0.3*0.25","v":0.3},577.5,173.25]
[null,"INSUMO",21013,"TUBO AÇO GALVANIZADO COM COSTURA, CLASSE LEVE, DN 50 MM ( 2\")E = 3,00 MM, *4,40* KG/M","M",3.5,75.98,265.93]
[null,"PRODUÇÃO DA EQUIPE",null,null,1,"CUSTO ",null,{"$f":"SUM(H328:H334)","v":482.72}]
[null,"TOTAL",{"$nulls":5},{"$f":"H335/E335","v":482.72},"OK"]
[null,"BDI                %",{"$nulls":5},{"$f":"1+$M$1","v":1.2149000000000001}]
[null,"TOTAL DO SERVIÇO - R$",{"$nulls":5},{"$f":"ROUND(H336*H337,2)","v":586.46}]
[]
[20,"CODEVASF",null,null," COMPOSIÇÃO DE PREÇO UNITÁRIO",null,null,null,{"$f":"H353","v":375.43},{"$f":"H355","v":456.11}]
[null,"OBRA:  ",{"$f":"$C$2","v":" RECAPEAMENTO E PAVIMENTAÇÃO ASFÁLTICA EM CBUQ - VIAS URBANAS DIVERSAS (SERRA DA SAUDADE / MG) - ITEM 2"},null,null,null,"DATA: ",{"$f":"$H$2","v":" SETEMBRO / 2023   "}]
[null,"SERVIÇO:  ",{"$f":"VLOOKUP(A340,ORÇAMENTO!$A$10:$I$39,3)","v":"FORNECIMENTO E INSTALAÇÃO DE PLACA DE AÇO PARA IDENTIFICACAO DE RUA, *45 CM X 20* CM, INCLUSIVE SUPORTE EM TUBO DE AÇO GALVANIZADO (02 PLACAS POR SUPORTE)                                  "},null,"SINAPI",{"$f":"VLOOKUP(A340,ORÇAMENTO!$A$10:$I$43,4)","v":"CPU.6"},"UNIDADE: ","UN."]
[]
[null,"TIPO ITEM","CODIGO ITEM","DESCRIÇÃO ITEM","UNIDADE ITEM","COEFICIENTE","PRECO UNITARIO","CUSTO TOTAL"]
[null,"COMPOSICAO",94962,"CONCRETO MAGRO PARA LASTRO, TRAÇO 1:4,5:4,5 (EM MASSA SECA DE CIMENTO/ AREIA/ BRITA 1)","M3",2.4E-2,402.82,{"$f":"ROUNDDOWN(F345*G345,2)","v":9.66}]
[null,"COMPOSICAO",93358,"ESCAVAÇÃO MANUAL DE VALA COM PROFUNDIDADE MENOR OU IGUAL A 1,30 M","M3",2.4E-2,78.17,1.87]
[null,"COMPOSICAO",88309,"PEDREIRO COM ENCARGOS COMPLEMENTARES","H",0.2,27.45,5.49]
[null,"COMPOSICAO",88316,"SERVENTE COM ENCARGOS COMPLEMENTARES","H",1,19.760000000000002,19.760000000000002]
[null,"COMPOSICAO",103670,"LANÇAMENTO COM USO DE BALDES, ADENSAMENTO E ACABAMENTO DE CONCRETO EM ESTRUTURAS","M3",2.4E-2,281.77999999999997,6.76]
[null,"INSUMO",34723,"PLACA DE SINALIZACAO EM CHAPA DE ACO NUM 16 COM PINTURA REFLETIVA (CIRCULAR - D=50CM) ","M2",{"$f":"0.45*0.2*2","v":0.18000000000000002},577.5,103.95]
[null,"INSUMO",21012,"TUBO AÇO GALVANIZADO COM COSTURA, CLASSE LEVE, DN 40 MM (1.1/2\")E = 3,00 MM, *3,48* KG/M","M",3,75.98,227.94]
[null,"PRODUÇÃO DA EQUIPE",null,null,1,"CUSTO ",null,{"$f":"SUM(H345:H351)","v":375.43}]
[null,"TOTAL",{"$nulls":5},{"$f":"H352/E352","v":375.43},"OK"]
[null,"BDI                %",{"$nulls":5},{"$f":"1+$M$1","v":1.2149000000000001}]
[null,"TOTAL DO SERVIÇO - R$",{"$nulls":5},{"$f":"ROUND(H353*H354,2)","v":456.11}]
[]
[21,"CODEVASF",null,null," COMPOSIÇÃO DE PREÇO UNITÁRIO",null,null,null,{"$f":"H371","v":5.84},{"$f":"H373","v":7.1}]
[null,"OBRA:  ",{"$f":"$C$2","v":" RECAPEAMENTO E PAVIMENTAÇÃO ASFÁLTICA EM CBUQ - VIAS URBANAS DIVERSAS (SERRA DA SAUDADE / MG) - ITEM 2"},null,null,null,"DATA: ",{"$f":"$H$2","v":" SETEMBRO / 2023   "}]
[null,"SERVIÇO:  ",{"$f":"VLOOKUP(A357,ORÇAMENTO!$A$10:$I$39,3)","v":"PINTURA DE EIXO VIÁRIO SOBRE ASFALTO COM TINTA RETRORREFLETIVA A BASE DE RESINA ACRÍLICA COM MICROESFERAS DE VIDRO, APLICAÇÃO MECÂNICA COM DEMARCADORA AUTOPROPELIDA"},null,"SINAPI",{"$f":"VLOOKUP(A357,ORÇAMENTO!$A$10:$I$43,4)","v":102512},"UNIDADE: ",{"$f":"VLOOKUP(A357,ORÇAMENTO!$A$10:$I$43,5)","v":"M2"}]
[]
[null,"TIPO ITEM","CODIGO ITEM","DESCRIÇÃO ITEM","UNIDADE ITEM","COEFICIENTE","PRECO UNITARIO","CUSTO TOTAL"]
[null,"INSUMO","5318","DILUENTE AGUARRAS","L","0,0020000","25,91",{"$f":"ROUNDDOWN(F362*G362,2)","v":0.05}]
[null,"INSUMO","7343","TINTA ACRILICA A BASE DE SOLVENTE, PARA SINALIZACAO HORIZONTAL VIARIA (NBR 11862)","L","0,0430000","17,82",0.76]
[null,"INSUMO","44477","MICROESFERAS DE VIDRO PARA SINALIZACAO HORIZONTAL VIARIA, TIPO II-A (DROP-ON)","KG","0,0250000","10,74",0.26]
[null,"INSUMO","44478","MICROESFERAS DE VIDRO PARA SINALIZACAO HORIZONTAL VIARIA, TIPO I-B (PREMIX)","KG","0,0110000","10,74",0.11]
[null,"COMPOSICAO","88310","PINTOR COM ENCARGOS COMPLEMENTARES","H","0,0340000","28,66",0.97]
[null,"COMPOSICAO","88316","SERVENTE COM ENCARGOS COMPLEMENTARES","H","0,0140000","19,76",0.27]
[null,"COMPOSICAO","95133","MÁQUINA DEMARCADORA DE FAIXA DE TRÁFEGO À FRIO, AUTOPROPELIDA, POTÊNCIA 38 HP","CHP","0,0003000","186,11",0.05]
[null,"COMPOSICAO","96159","MÁQUINA DEMARCADORA DE FAIXA DE TRÁFEGO À FRIO, AUTOPROPELIDA, POTÊNCIA 38 HP","CHI","0,0334000","100,90",3.37]
[null,"PRODUÇÃO DA EQUIPE",null,null,1,"CUSTO ",null,{"$f":"SUM(H362:H369)","v":5.84}]
[null,"TOTAL",{"$nulls":5},{"$f":"H370/E370","v":5.84},"OK"]
[null,"BDI                %",{"$nulls":5},{"$f":"1+$M$1","v":1.2149000000000001}]
[null,"TOTAL DO SERVIÇO - R$",{"$nulls":5},{"$f":"ROUND(H371*H372,2)","v":7.1}]
[]
[25,"CODEVASF",null,null," COMPOSIÇÃO DE PREÇO UNITÁRIO",null,null,null,{"$f":"H382","v":2689.76},{"$f":"H384","v":3093.22}]
[null,"OBRA:  ",{"$f":"$C$2","v":" RECAPEAMENTO E PAVIMENTAÇÃO ASFÁLTICA EM CBUQ - VIAS URBANAS DIVERSAS (SERRA DA SAUDADE / MG) - ITEM 2"},null,null,null,"DATA: ",{"$f":"$H$2","v":" SETEMBRO / 2023   "}]
[null,"SERVIÇO:  ",{"$f":"VLOOKUP(A375,ORÇAMENTO!$A$10:$I$48,3)","v":"AQUISIÇÃO DE EMULSÃO ASFÁLTICA PARA IMPRIMAÇÃO (EAI) - EXCLUSIVE TRANSPORTE"},null,"SEINFRA",{"$f":"VLOOKUP(A375,ORÇAMENTO!$A$10:$I$48,4)","v":"CPU.7"},"UNIDADE: ",{"$f":"VLOOKUP(A375,ORÇAMENTO!$A$10:$I$48,5)","v":"T"}]
[]
[null,"TIPO ITEM","CODIGO ITEM","DESCRIÇÃO ITEM","UNIDADE ITEM","COEFICIENTE","PRECO UNITARIO","CUSTO TOTAL"]
[null,"INSUMO","ANP","EMULSÃO ASFÁLTICA PARA SERVIÇO DE IMPRIMAÇÃO (CUSTO ANP, INCLUINDO ICMS 18%)","T",1,{"$f":"2.20561*1000*1.2195122","v":2689.7683034420002},{"$f":"ROUNDDOWN(F380*G380,2)","v":2689.76}]
[null,"PRODUÇÃO DA EQUIPE",null,null,1,"CUSTO ",null,{"$f":"SUM(H380:H380)","v":2689.76}]
[null,"TOTAL",{"$nulls":5},{"$f":"H381/E381","v":2689.76}]
[null,"BDI                %",{"$nulls":5},{"$f":"1+$M$2","v":1.1499999999999999}]
[null,"TOTAL DO SERVIÇO - R$",{"$nulls":5},{"$f":"ROUND(H382*H383,2)","v":3093.22},"OK"]
[]
[26,"CODEVASF",null,null," COMPOSIÇÃO DE PREÇO UNITÁRIO",null,null,null,{"$f":"H393","v":2706.7},{"$f":"H395","v":3112.71}]
[null,"OBRA:  ",{"$f":"$C$2","v":" RECAPEAMENTO E PAVIMENTAÇÃO ASFÁLTICA EM CBUQ - VIAS URBANAS DIVERSAS (SERRA DA SAUDADE / MG) - ITEM 2"},null,null,null,"DATA: ",{"$f":"$H$2","v":" SETEMBRO / 2023   "}]
[null,"SERVIÇO:  ",{"$f":"VLOOKUP(A386,ORÇAMENTO!$A$10:$I$48,3)","v":"AQUISIÇÃO DE EMULSAO ASFALTICA CATIONICA RR-1C - EXCLUSIVE TRANSPORTE"},null,"SINAPI",{"$f":"VLOOKUP(A386,ORÇAMENTO!$A$10:$I$48,4)","v":"CPU.8"},"UNIDADE: ",{"$f":"VLOOKUP(A386,ORÇAMENTO!$A$10:$I$48,5)","v":"T"}]
[]
[null,"TIPO ITEM","CODIGO ITEM","DESCRIÇÃO ITEM","UNIDADE ITEM","COEFICIENTE","PRECO UNITARIO","CUSTO TOTAL"]
[null,"INSUMO","ANP","EMULSÃO ASFÁLTICA CATIÔNICA RR-1C(CUSTO ANP, INCLUINDO ICMS 18%)","T",1,{"$f":"2.2195*1.2195122*1000","v":2706.7073279000001},{"$f":"ROUNDDOWN(F391*G391,2)","v":2706.7}]
[null,"PRODUÇÃO DA EQUIPE",null,null,1,"CUSTO ",null,{"$f":"SUM(H391:H391)","v":2706.7}]
[null,"TOTAL",{"$nulls":5},{"$f":"H392/E392","v":2706.7},"OK"]
[null,"BDI                %",{"$nulls":5},{"$f":"1+$M$2","v":1.1499999999999999}]
[null,"TOTAL DO SERVIÇO - R$",{"$nulls":5},{"$f":"ROUND(H393*H394,2)","v":3112.71}]
[]
[27,"CODEVASF",null,null," COMPOSIÇÃO DE PREÇO UNITÁRIO",null,null,null,{"$f":"H404","v":580},{"$f":"H406","v":667}]
[null,"OBRA:  ",{"$f":"$C$2","v":" RECAPEAMENTO E PAVIMENTAÇÃO ASFÁLTICA EM CBUQ - VIAS URBANAS DIVERSAS (SERRA DA SAUDADE / MG) - ITEM 2"},null,null,null,"DATA: ",{"$f":"$H$2","v":" SETEMBRO / 2023   "}]
[null,"SERVIÇO:  ",{"$f":"VLOOKUP(A397,ORÇAMENTO!$A$10:$I$48,3)","v":"AQUISIÇÃO DE CONCRETO BETUMINOSO USINADO A QUENTE (CBUQ) PARA PAVIMENTACAO ASFALTICA, PADRAO DNIT, FAIXA C, COM CAP 50/70 - EXCLUSIVE TRANSPORTE"},null,"SINAPI",{"$f":"VLOOKUP(A397,ORÇAMENTO!$A$10:$I$48,4)","v":"CPU.9"},"UNIDADE: ",{"$f":"VLOOKUP(A397,ORÇAMENTO!$A$10:$I$48,5)","v":"T"}]
[]
[null,"TIPO ITEM","CODIGO ITEM","DESCRIÇÃO ITEM","UNIDADE ITEM","COEFICIENTE","PRECO UNITARIO","CUSTO TOTAL"]
[null,"INSUMO",1518,"CONCRETO BETUMINOSO USINADO A QUENTE (CBUQ) PARA PAVIMENTACAO ASFALTICA, PADRAO DNIT, FAIXA C, COM CAP 50/70 - AQUISICAO POSTO USINA","T",1,580,{"$f":"ROUNDDOWN(F402*G402,2)","v":580}]
[null,"PRODUÇÃO DA EQUIPE",null,null,1,"CUSTO ",null,{"$f":"SUM(H402:H402)","v":580}]
[null,"TOTAL",{"$nulls":5},{"$f":"H403/E403","v":580},"OK"]
[null,"BDI                %",{"$nulls":5},{"$f":"1+$M$2","v":1.1499999999999999}]
[null,"TOTAL DO SERVIÇO - R$",{"$nulls":5},{"$f":"ROUND(H404*H405,2)","v":667}]

{"sheet":"BDI SERV","index":2,"n_rows":37,"n_cols":20,"rows_kept":37,"cut":false,"hidden":false,"merged":[[31,1,31,2],[32,0,34,5],[36,0,36,5],[0,1,2,4],[3,1,4,1],[3,2,4,2],[28,0,28,5],[30,1,30,2]]}
[null,"DETALHAMENTO DO BDI - SERVIÇOS"]
[]
[]
[null,"Item","Descrição dos Serviços","%","%"]
[null,null,null,"PV","CD"]
[]
[null,1,"ADMINISTRAÇÃO CENTRAL"," ",4.01]
[null,"1.1","ESCRITÓRIO CENTRAL"," "," "]
[null,"1.2","VIAGENS"," "," "]
[null,"1.3","OUTROS"," "," "]
[null," "," "," "," "]
[null,2,"IMPOSTOS E TAXAS",{"$f":"SUM(D13:D16)","v":5.65},{"$f":"SUM(E13:E16)","v":7.0600000000000005}]
[null,"2.1","ISS (*)",2,{"$f":"ROUND(D13*1.2515,2)","v":2.5}]
[null,"2.2","PIS",0.65,{"$f":"ROUND(D14*1.2515,2)","v":0.81}]
[null,"2.3","Cofins",3,{"$f":"ROUND(D15*1.2515,2)","v":3.75}]
[null,"2.4","CONTRIBUIÇÃO PREVIDENCIÁRIA SOBRE A RENDA BRUTA",0,{"$f":"ROUND(D16*1.2515,2)","v":0}]
[]
[null,3,"TAXA DE RISCO"," ",{"$f":"SUM(E19:E22)","v":0.96}]
[null,"3.1","SEGURO",null,0.2]
[null,"3.2","RISCO",null,0.56000000000000005]
[null,"3.3","GARANTIA",null,0.2]
[{"$nulls":19},{"$f":"1/0.82","v":1.2195121951219512}]
[null,4,"DESPESAS FINANCEIRAS"," ",1.1100000000000001]
[]
[null,5,"LUCRO",null,8]
[]
[null," ","BDI - CALCULADO"," ",{"$f":"ROUND((((1+(E7+E18)/100)*(1+E23/100)*(1+E25/100)/(1-D12/100)-1)*100),2)","v":21.49}]
[]
["BDI = ((1+((AC+S+R+G)/100))x(1+DF/100)x(1+L/100)/(1-I/100)-1)*100"]
[]
[null,"BDI (CALCULADO):",null,{"$f":"ROUND((((1+((E7+E18)/100))*(1+E23/100)*(1+E25/100))/(1-D12/100)-1)*100,2)","v":21.49},"%"]
[null," "]
["(*) ISS CONFORME LEI MUNICIPAL COMPLEMENTAR Nº 002/2017 - ART. 77 \n"]
[]
[]
[]
["BDI EM CONFORMIDADE COM OS ACÓRDÃOS Nº 2369/2011 e ACÓRDÃO Nº 2.622/2013 - TCU - PLENÁRIO"]

{"sheet":"BDI FORN","index":3,"n_rows":37,"n_cols":5,"rows_kept":37,"cut":false,"hidden":false,"merged":[[31,1,31,2],[32,0,34,5],[36,0,36,5],[0,1,2,4],[3,1,4,1],[3,2,4,2],[28,0,28,5],[30,1,30,2]]}
[null,"DETALHAMENTO DO BDI - FORNECIMENTO \n(MATERIAL ASFÁLTICO)"]
[]
[]
[null,"Item","Descrição dos Serviços","%","%"]
[null,null,null,"PV","CD"]
[]
[null,1,"ADMINISTRAÇÃO CENTRAL"," ",3.72]
[null,"1.1","ESCRITÓRIO CENTRAL"," "," "]
[null,"1.2","VIAGENS"," "," "]
[null,"1.3","OUTROS"," "," "]
[null," "," "," "," "]
[null,2,"IMPOSTOS E TAXAS",{"$f":"SUM(D13:D16)","v":3.65},{"$f":"SUM(E13:E16)","v":4.5600000000000005}]
[null,"2.1","ISS (*)",null,{"$f":"ROUND(D13*1.2515,2)","v":0}]
[null,"2.2","PIS",0.65,{"$f":"ROUND(D14*1.2515,2)","v":0.81}]
[null,"2.3","Cofins",3,{"$f":"ROUND(D15*1.2515,2)","v":3.75}]
[null,"2.4","CONTRIBUIÇÃO PREVIDENCIÁRIA SOBRE A RENDA BRUTA",0,{"$f":"ROUND(D16*1.2515,2)","v":0}]
[]
[null,3,"TAXA DE RISCO"," ",{"$f":"SUM(E19:E22)","v":0.82000000000000006}]
[null,"3.1","SEGURO",null,0.16]
[null,"3.2","RISCO",null,0.5]
[null,"3.3","GARANTIA",null,0.16]
[]
[null,4,"DESPESAS FINANCEIRAS"," ",0.94]
[]
[null,5,"LUCRO",null,5]
[]
[null," ","BDI - CALCULADO"," ",{"$f":"ROUND((((1+(E7+E18)/100)*(1+E23/100)*(1+E25/100)/(1-D12/100)-1)*100),2)","v":15}]
[]
["BDI = ((1+((AC+S+R+G)/100))x(1+DF/100)x(1+L/100)/(1-I/100)-1)*100"]
[]
[null,"BDI (CALCULADO):",null,{"$f":"ROUND((((1+((E7+E18)/100))*(1+E23/100)*(1+E25/100))/(1-D12/100)-1)*100,2)","v":15},"%"]
[null," "]
[]
[]
[]
[]
["BDI EM CONFORMIDADE COM OS ACÓRDÃOS Nº 2369/2011 e ACÓRDÃO Nº 2.622/2013 - TCU - PLENÁRIO"]

{"sheet":"CRONOGRAMA","index":4,"n_rows":21,"n_cols":12,"rows_kept":21,"cut":false,"hidden":false,"merged":[[0,1,0,11],[1,1,2,1],[1,2,2,4],[1,6,1,11],[2,6,2,11],[3,1,3,10],[5,0,6,0],[5,1,6,1],[5,2,6,2],[7,0,8,0],[7,1,8,1],[7,2,8,2],[9,0,10,0],[9,1,10,1],[9,2,10,2],[11,0,12,0],[11,1,12,1],[11,2,12,2],[17,1,18,2],[20,1,24,11],[13,0,14,0],[13,1,14,1],[13,2,14,2],[15,0,16,0],[15,1,16,1],[15,2,16,2]]}
[null,"CRONOGRAMA FÍSICO-FINANCEIRO"]
[null,"OBRA: ",{"$f":"ORÇAMENTO!C5","v":" RECAPEAMENTO E PAVIMENTAÇÃO ASFÁLTICA EM CBUQ - VIAS URBANAS DIVERSAS (SERRA DA SAUDADE / MG) - ITEM 2"},null,null,"VALOR:",{"$f":"ORÇAMENTO!I41","v":2438342.8199999998}]
[{"$nulls":5},"PRAZO: ","180 DIAS "]
[]
[null,"ITEM","ETAPAS/DESCRIÇAO","FISICO/  FINANCEIRO","TOTAL    ETAPAS","MÊS 1","MÊS 2","MÊS 3","MÊS 4","MÊS 5","MÊS 6","TOTAL"]
["A",{"$f":"VLOOKUP(A6,ORÇAMENTO!$A$9:$I$41,2)","v":1},{"$f":"VLOOKUP(A6,ORÇAMENTO!$A$9:$I$41,3)","v":"SERVIÇOS PRELIMINARES "},"FISICO ",{"$f":"ROUND(E7/$G$2,4)","v":9.0800000000000006E-2},0.1,0.2,0.2,0.2,0.2,0.1,{"$f":"SUM(F6:K6)","v":0.99999999999999989}]
[null,null,null,"FINANCEIRO",{"$f":"ORÇAMENTO!I9","v":221440.67},{"$f":"ROUND($E$7*F6,2)","v":22144.07},{"$f":"ROUND($E$7*G6,2)","v":44288.13},{"$f":"ROUND($E$7*H6,2)","v":44288.13},{"$f":"ROUND($E$7*I6,2)","v":44288.13},44288.13,22144.07,{"$f":"SUM(F7:K7)","v":221440.66}]
["B",{"$f":"VLOOKUP(A8,ORÇAMENTO!$A$9:$I$41,2)","v":2},{"$f":"VLOOKUP(A8,ORÇAMENTO!$A$9:$I$41,3)","v":"PAVIMENTAÇÃO"},"FISICO ",{"$f":"ROUND(E9/$G$2,4)","v":0.18790000000000001},0.1,0.2,0.2,0.2,0.2,0.1,{"$f":"SUM(F8:K8)","v":0.99999999999999989}]
[null,null,null,"FINANCEIRO",{"$f":"ORÇAMENTO!I15","v":458046.5},{"$f":"ROUND($E$9*F8,2)","v":45804.65},{"$f":"ROUND($E$9*G8,2)","v":91609.3},{"$f":"ROUND($E$9*H8,2)","v":91609.3},{"$f":"ROUND($E$9*I8,2)","v":91609.3},91609.3,45804.65,{"$f":"SUM(F9:K9)","v":458046.5}]
["C",{"$f":"VLOOKUP(A10,ORÇAMENTO!$A$9:$I$41,2)","v":3},{"$f":"VLOOKUP(A10,ORÇAMENTO!$A$9:$I$41,3)","v":"TRANSPORTE DE MATERIAIS"},"FISICO ",{"$f":"ROUND(E11/$G$2,4)","v":9.8500000000000004E-2},0.25,0.25,0.25,0.25,0,0,{"$f":"SUM(F10:K10)","v":1}]
[null,null,null,"FINANCEIRO",{"$f":"ORÇAMENTO!I23","v":240150},{"$f":"ROUND($E$11*F10,2)","v":60037.5},{"$f":"ROUND($E$11*G10,2)","v":60037.5},{"$f":"ROUND($E$11*H10,2)","v":60037.5},{"$f":"ROUND($E$11*I10,2)","v":60037.5},0,0,{"$f":"SUM(F11:K11)-0.04","v":240149.96}]
["D",{"$f":"VLOOKUP(A12,ORÇAMENTO!$A$9:$I$41,2)","v":4},{"$f":"VLOOKUP(A12,ORÇAMENTO!$A$9:$I$41,3)","v":"TRANSPORTE DE MATERIAL ASFÁLTICO (BDI DIFERENCIADO)"},"FISICO ",{"$f":"ROUND(E13/$G$2,4)","v":3.3599999999999998E-2},0,0.2,0.2,0.2,0.2,0.2,{"$f":"SUM(F12:K12)","v":1}]
[null,null,null,"FINANCEIRO",{"$f":"ORÇAMENTO!I26","v":82048.069999999992},{"$f":"ROUND($E$13*F12,2)","v":0},{"$f":"ROUND($E$13*G12,2)","v":16409.61},{"$f":"ROUND($E$13*H12,2)","v":16409.61},{"$f":"ROUND($E$13*I12,2)","v":16409.61},16409.61,16409.61,{"$f":"SUM(F13:K13)-0.02","v":82048.03}]
["E",{"$f":"VLOOKUP(A14,ORÇAMENTO!$A$9:$I$41,2)","v":5},{"$f":"VLOOKUP(A14,ORÇAMENTO!$A$9:$I$41,3)","v":"DRENAGEM E OBRAS COMPLEMENTARES"},"FISICO ",{"$f":"ROUND(E15/$G$2,4)","v":0.18690000000000001},0,0,0.25,0.25,0.25,0.25,{"$f":"SUM(F14:K14)","v":1}]
[null,null,null,"FINANCEIRO",{"$f":"ORÇAMENTO!I29","v":455644.76},{"$f":"ROUND($E$15*F14,2)","v":0},{"$f":"ROUND($E$15*G14,2)","v":0},{"$f":"ROUND($E$15*H14,2)","v":113911.19},{"$f":"ROUND($E$15*I14,2)","v":113911.19},113911.19,113911.19,{"$f":"SUM(F15:K15)-0.02","v":455644.74}]
["F",{"$f":"VLOOKUP(A16,ORÇAMENTO!$A$9:$I$41,2)","v":6},{"$f":"VLOOKUP(A16,ORÇAMENTO!$A$9:$I$41,3)","v":"FORNECIMENTOS - MATERIAL ASFÁLTICO (BDI DIFERENCIADO)"},"FISICO ",{"$f":"ROUND(E17/$G$2,4)","v":0.40229999999999999},0,0.2,0.2,0.2,0.2,0.2,{"$f":"SUM(F16:K16)","v":1}]
[null,null,null,"FINANCEIRO",{"$f":"ORÇAMENTO!I37","v":981012.82000000007},{"$f":"ROUND($E$17*F16,2)","v":0},{"$f":"ROUND($E$17*G16,2)","v":196202.56},{"$f":"ROUND($E$17*H16,2)","v":196202.56},{"$f":"ROUND($E$17*I16,2)","v":196202.56},196202.56,196202.56,{"$f":"SUM(F17:K17)-0.02","v":981012.78}]
[null,"TOTAL",null,"FISICO ",{"$f":"SUM(F18:K18)","v":0.99999997949426966},{"$f":"F19/$E$19","v":5.2489017930628795E-2},{"$f":"G19/$E$19","v":0.16755113212505529},{"$f":"H19/$E$19","v":0.21426777470118},{"$f":"I19/$E$19","v":0.21426777470118},0.18964551916452826,0.16177876087169726,{"$f":"SUM(F18:K18)","v":0.99999997949426966}]
[null,null,null,"FINANCEIRO",{"$f":"E11+E9+E7+E13+E17+E15","v":2438342.8200000003},{"$f":"F11+F9+F7+F13+F17+F15","v":127986.22},{"$f":"G11+G9+G7+G13+G17+G15","v":408547.1},{"$f":"H11+H9+H7+H13+H17+H15","v":522458.29},{"$f":"I11+I9+I7+I13+I17+I15","v":522458.29},462420.79,394472.08,{"$f":"SUM(F19:K19)+0.05","v":2438342.8199999998}]
[]
[null,"OBSERVAÇÕES:"]

{"sheet":"CALC.MAT","index":5,"n_rows":376,"n_cols":20,"rows_kept":376,"cut":false,"hidden":false,"merged":[[28,1,28,6],[29,1,29,6],[30,1,30,6],[0,1,0,3],[0,4,0,7],[0,12,0,13],[1,2,1,5],[1,12,1,13],[2,2,2,3],[3,1,3,7],[9,1,9,3],[9,5,9,6],[14,12,14,13],[15,2,15,5],[16,2,16,3],[17,1,17,7],[27,1,27,3],[27,5,27,6],[10,1,10,6],[11,1,11,6],[12,1,12,6],[14,1,14,3],[14,4,14,7],[60,1,60,6],[61,1,61,6],[62,1,62,6],[32,1,32,3],[32,4,32,7],[32,12,32,13],[33,2,33,5],[34,2,34,3],[35,1,35,7],[41,1,41,3],[41,5,41,6],[46,12,46,13],[47,2,47,5],[48,2,48,3],[49,1,49,7],[59,1,59,3],[59,5,59,6],[42,1,42,6],[43,1,43,6],[44,1,44,6],[46,1,46,3],[46,4,46,7],[64,1,64,3],[64,4,64,7],[64,12,64,13],[65,2,65,5],[66,2,66,3],[67,1,67,7],[75,1,75,3],[75,5,75,6],[76,1,76,6],[77,1,77,6],[78,1,78,6],[80,1,80,3],[80,4,80,7],[80,12,80,13],[81,2,81,5],[82,2,82,3],[83,1,83,7],[88,1,88,3],[88,5,88,6],[89,1,89,6],[90,1,90,6],[91,1,91,6],[93,1,93,3],[93,4,93,7],[94,2,94,5],[95,2,95,3],[96,1,96,7],[102,1,102,3],[102,5,102,6],[103,1,103,6],[104,1,104,6],[105,1,105,6],[107,1,107,3],[107,4,107,7],[121,1,121,6],[122,1,122,6],[142,1,142,6],[143,1,143,6],[144,1,144,6],[107,12,107,13],[108,2,108,5],[109,2,109,3],[110,1,110,7],[120,1,120,3],[120,5,120,6],[135,12,136,12],[135,13,136,13],[135,14,136,14],[141,1,141,3],[141,5,141,6],[123,1,123,6],[125,1,125,3],[125,4,125,7],[126,2,126,5],[127,2,127,3],[128,1,128,7],[146,1,146,3],[146,4,146,7],[146,12,146,13],[147,2,147,5],[148,2,148,3],[149,1,149,7],[160,1,160,3],[160,5,160,6],[161,1,161,6],[202,1,202,6],[203,1,203,6],[204,1,204,6],[162,1,162,6],[163,1,163,6],[165,1,165,3],[165,4,165,7],[165,12,165,13],[166,2,166,5],[167,2,167,3],[168,1,168,7],[179,1,179,3],[184,12,184,13],[185,2,185,5],[186,2,186,3],[187,1,187,7],[201,1,201,3],[201,5,201,6],[179,5,179,6],[180,1,180,6],[181,1,181,6],[182,1,182,6],[184,1,184,3],[184,4,184,7],[206,1,206,3],[206,4,206,7],[206,12,206,13],[207,2,207,5],[208,2,208,3],[209,1,209,7],[214,1,214,3],[214,5,214,6],[215,1,215,6],[216,1,216,6],[217,1,217,6],[219,1,219,3],[219,4,219,7],[220,2,220,5],[221,2,221,3],[222,1,222,7],[227,1,227,3],[227,5,227,6],[253,1,253,6],[254,1,254,6],[255,1,255,6],[228,1,228,6],[229,1,229,6],[230,1,230,6],[232,1,232,3],[232,4,232,7],[233,2,233,5],[234,2,234,3],[235,1,235,7],[240,1,240,3],[245,12,245,13],[246,2,246,5],[247,2,247,3],[248,1,248,7],[252,1,252,3],[252,5,252,6],[240,5,240,6],[241,1,241,6],[242,1,242,6],[243,1,243,6],[245,1,245,3],[245,4,245,7],[262,14,264,17],[270,1,270,3],[270,5,270,6],[271,1,271,6],[272,1,272,6],[273,1,273,6],[257,1,257,3],[257,4,257,7],[257,12,257,13],[258,2,258,5],[259,2,259,3],[260,1,260,7],[275,1,275,3],[275,4,275,7],[276,2,276,5],[277,2,277,3],[278,1,278,7],[287,1,287,3],[287,5,287,6],[288,1,288,6],[289,1,289,6],[290,1,290,6],[292,1,292,3],[292,4,292,7],[293,2,293,5],[294,2,294,3],[295,1,295,7],[304,1,304,3],[304,5,304,6],[305,1,305,6],[306,1,306,6],[307,1,307,6],[309,1,309,3],[309,4,309,7],[310,2,310,5],[311,2,311,3],[312,1,312,7],[321,1,321,3],[321,5,321,6],[322,1,322,6],[323,1,323,6],[324,1,324,6],[326,1,326,3],[326,4,326,7],[327,2,327,5],[328,2,328,3],[329,1,329,7],[339,1,339,3],[339,5,339,6],[340,1,340,6],[341,1,341,6],[342,1,342,6],[344,1,344,3],[344,4,344,7],[345,2,345,5],[346,2,346,3],[347,1,347,7],[358,1,358,7],[361,1,361,3],[361,5,361,6],[362,1,362,6],[363,1,363,6],[364,1,364,6],[350,1,350,3],[350,5,350,6],[351,1,351,6],[352,1,352,6],[353,1,353,6],[355,1,355,3],[355,4,355,7],[356,2,356,5],[357,2,357,3],[375,1,375,6],[366,1,366,3],[366,4,366,7],[367,2,367,5],[368,2,368,3],[369,1,369,7],[372,1,372,3],[372,5,372,6],[373,1,373,6],[374,1,374,6]]}
[1,"CODEVASF",null,null," COMPOSIÇÃO DE PREÇO UNITÁRIO",null,null,null,"MATERIAIS",{"$f":"SUMIF(K$6:K$344,\"M\",J$6:J$344)","v":202532.12000000002},{"$f":"J1*(1+O$1)","v":246056.27258800005},{"$f":"K1/K$5","v":0.2458797396788743},"BDI CALCULADO:",null,{"$f":"ORÇAMENTO!I6","v":0.21489999999999998}]
[{"$f":"A1","v":1},"OBRA:  "," PAVIMENTAÇÃO ASFÁLTICA EM CBUQ - ESTRADA DE ACESSO AOS TÚNIES (SERRA DA SAUDADE / MG) - ITEM 2",null,null,null,"DATA: "," SETEMBRO / 2023   ","MAO DE OBRA",{"$f":"SUMIF(K$6:K$344,\"P\",J$6:J$344)","v":175738.97869379929},{"$f":"J2*(1+O$1)","v":213505.28521509678},{"$f":"K2/K$5","v":0.21335210599021331},"BDI DIFERENCIADO:",null,{"$f":"'BDI FORN'!D31/100","v":0.15}]
[{"$f":"A2","v":1},"SERVIÇO:  ","MOBILIZAÇÃO E DESMOBILIZAÇÃO",null,"Referência:","CPU.1","UNIDADE: ","GL","EQUIPAMENTOS",{"$f":"SUMIF(K$6:K$344,\"E\",J$6:J$344)","v":445432.88059506984},{"$f":"J3*(1+O$1)","v":541156.40663495043},0.54076815433091241]
[1]
[1,"TIPO ITEM","CODIGO ITEM","DESCRIÇÃO ITEM","UNIDADE ITEM","COEFICIENTE","PRECO UNITARIO","CUSTO TOTAL","VALOR SERVIÇO:",{"$f":"ORÇAMENTO!I9+ORÇAMENTO!I15+ORÇAMENTO!I23+ORÇAMENTO!I29","v":1375281.9300000002},{"$f":"SUM(K1:K3)","v":1000717.9644380473}]
[1,"COMPOSICAO",89876,"CAMINHÃO BASCULANTE 14 M3, COM CAVALO MECÂNICO DE CAPACIDADE MÁXIMA DE TRAÇÃO COMBINADO DE 36000 KG, POTÊNCIA 286 CV, INCLUSIVE SEMIREBOQUE COM CAÇAMBA METÁLICA","CHP DIURNO.",8,316.13,2529.04,{"$f":"VLOOKUP(A6,ORÇAMENTO!A$10:F$40,6)/E$10","v":2},{"$f":"H6*I6","v":5058.08},"E"]
[1,"COMPOSICAO",89877,"CAMINHÃO BASCULANTE 14 M3, COM CAVALO MECÂNICO DE CAPACIDADE MÁXIMA DE TRAÇÃO COMBINADO DE 36000 KG, POTÊNCIA 286 CV, INCLUSIVE SEMIREBOQUE COM CAÇAMBA METÁLICA","CHI DIURNO.",8,89.75,718,{"$f":"VLOOKUP(A7,ORÇAMENTO!A$10:F$40,6)/E$10","v":2},{"$f":"H7*I7","v":1436},"E"]
[1,"COMPOSICAO",5914640,"TRANSPORTE COM CAVALO MECÂNICO COM SEMIRREBOQUE COM CAPACIDADE DE 30 T - RODOVIA PAVIMENTADA","T.KM",5805,0.57999999999999996,3366.9,{"$f":"VLOOKUP(A8,ORÇAMENTO!A$10:F$40,6)/E$10","v":2},6733.8,"E"]
[1,"COMPOSIÇÃO",88316,"SERVENTE COM ENCARGOS COMPLEMENTARES","H",16,19.760000000000002,316.16000000000003,{"$f":"VLOOKUP(A9,ORÇAMENTO!A$10:F$40,6)/E$10","v":2},{"$f":"H9*I9","v":632.32000000000005},"P"]
[1,"PRODUÇÃO DA EQUIPE",null,null,0.5,"CUSTO ",null,6930.1]
[1,"TOTAL",{"$nulls":5},13860.2]
[1,"BDI                %",{"$nulls":5},1.2149000000000001]
[1,"TOTAL DO SERVIÇO - R$",{"$nulls":5},16838.759999999998]
[1]
[{"$f":"A1+1","v":2},"CODEVASF",null,null," COMPOSIÇÃO DE PREÇO UNITÁRIO"]
[{"$f":"A15","v":2},"OBRA:  "," PAVIMENTAÇÃO ASFÁLTICA EM CBUQ - ESTRADA DE ACESSO AOS TÚNIES (SERRA DA SAUDADE / MG) - ITEM 2",null,null,null,"DATA: "," SETEMBRO / 2023   "]
[2,"SERVIÇO:  ","ADMINISTRAÇÃO LOCAL",null,"SINAPI","CPU.2","UNIDADE: ","GL"]
[2]
[2,"TIPO ITEM","CODIGO ITEM","DESCRIÇÃO ITEM","UNIDADE ITEM","COEFICIENTE","PRECO UNITARIO","CUSTO TOTAL"]
[2,"INSUMO",14250,"ENERGIA ELÉTRICA","kwh",60,0.94,56.4,{"$f":"VLOOKUP(A20,ORÇAMENTO!A$10:F$40,6)/E$28","v":3.0000030000030002},169.2001692001692,"E"]
[2,"INSUMO",44480,"TARIFA \"A\" - ÁGUA/ESGOTO ","m³",6,17.78,106.68,{"$f":"VLOOKUP(A21,ORÇAMENTO!A$10:F$40,6)/E$28","v":3.0000030000030002},320.04032004032007,"E"]
[2,"COTAÇÃO","MERC.","TELEFONE (PLANO CONTROLE)","UNID",2,59.9,119.8,{"$f":"VLOOKUP(A22,ORÇAMENTO!A$10:F$40,6)/E$28","v":3.0000030000030002},359.40035940035943,"E"]
[2,"INSUMO","ED-50155 SEINFRA","BANHEIRO QUÍMICO 110 X 120 X 230 CM COM MANUTENÇÃO (CONSIDERANDO OBRAS SIMULTÂNEAS)","MÊS",2,820,1640,{"$f":"VLOOKUP(A23,ORÇAMENTO!A$10:F$40,6)/E$28","v":3.0000030000030002},4920.0049200049207,"E"]
[2,"COMPOSICAO",90777,"Engenheiro Civil Júnior com encargos complementares","H",55,114.12,6276.6,{"$f":"VLOOKUP(A24,ORÇAMENTO!A$10:F$40,6)/E$28","v":3.0000030000030002},18829.818829818832,"P"]
[2,"COMPOSICAO",90776,"Encarregado Geral com encargos complementares","H",110,57.73,6350.3,{"$f":"VLOOKUP(A25,ORÇAMENTO!A$10:F$40,6)/E$28","v":3.0000030000030002},19050.919050919052,"P"]
[2,"COMPOSICAO",88321,"Tecnico de Laboratório com encargos complementares","H",55,45.45,2499.75,{"$f":"VLOOKUP(A26,ORÇAMENTO!A$10:F$40,6)/E$28","v":3.0000030000030002},7499.2574992575001,"P"]
[2,"COMPOSICAO",90772,"Auxiliar de escritório com encargos complementares","H",55,23.72,1304.5999999999999,{"$f":"VLOOKUP(A27,ORÇAMENTO!A$10:F$40,6)/E$28","v":3.0000030000030002},3913.8039138039139,"P"]
[2,"PRODUÇÃO DA EQUIPE",null,null,0.33333299999999999,"CUSTO ",null,18354.129999999997]
[2,"TOTAL",{"$nulls":5},55062.45]
[2,"BDI                %",{"$nulls":5},1.2149000000000001]
[2,"TOTAL DO SERVIÇO - R$",{"$nulls":5},66895.37]
[2]
[{"$f":"A15+1","v":3},"CODEVASF",null,null," COMPOSIÇÃO DE PREÇO UNITÁRIO"]
[{"$f":"A33","v":3},"OBRA:  "," PAVIMENTAÇÃO ASFÁLTICA EM CBUQ - ESTRADA DE ACESSO AOS TÚNIES (SERRA DA SAUDADE / MG) - ITEM 2",null,null,null,"DATA: "," SETEMBRO / 2023   "]
[3,"SERVIÇO:  ","CANTEIRO DE OBRAS",null,"SINAPI","CPU.3","UNIDADE: ","GL"]
[3]
[3,"TIPO ITEM","CODIGO ITEM","DESCRIÇÃO ITEM","UNIDADE ITEM","COEFICIENTE","PRECO UNITARIO","CUSTO TOTAL"]
[3,"INSUMO",10775,"LOCACAO DE CONTAINER 2,30 X 6,00 M, ALT. 2,50 M, COM 1 SANITARIO, PARA ESCRITORIO, COMPLETO, SEM DIVISORIAS INTERNAS","MÊS",3,975,2925,{"$f":"VLOOKUP(A38,ORÇAMENTO!A$10:F$40,6)","v":1},{"$f":"H38*I38","v":2925},"E"]
[3,"INSUMO",10779,"LOCACAO DE CONTAINER 2,30 X 4,30 M, ALT. 2,50 M, P/ SANITARIO, C/ 5 BACIAS, 1 LAVATORIO E 4 MICTORIOS","MÊS",3,1218.75,3656.25,{"$f":"VLOOKUP(A39,ORÇAMENTO!A$10:F$40,6)","v":1},3656.25,"E"]
[3,"INSUMO","37525","TELA PLASTICA TECIDA LISTRADA BRANCA E LARANJA, TIPO GUARDA CORPO, EM POLIETILENO MONOFILADO, ROLO 1,20 X 50 M (L X C)","M",100,3.69,369,{"$f":"VLOOKUP(A40,ORÇAMENTO!A$10:F$40,6)","v":1},369,"M"]
[3,{"$nulls":6},0,{"$f":"VLOOKUP(A41,ORÇAMENTO!A$10:F$40,6)","v":1},0,"E"]
[3,"PRODUÇÃO DA EQUIPE",null,null,1,"CUSTO ",null,6950.25]
[3,"TOTAL",{"$nulls":5},6950.25]
[3,"BDI                %",{"$nulls":5},1.2149000000000001]
[3,"TOTAL DO SERVIÇO - R$",{"$nulls":5},8443.86]
[3]
[{"$f":"A33+1","v":4},"CODEVASF",null,null," COMPOSIÇÃO DE PREÇO UNITÁRIO"]
[{"$f":"A47","v":4},"OBRA:  "," PAVIMENTAÇÃO ASFÁLTICA EM CBUQ - ESTRADA DE ACESSO AOS TÚNIES (SERRA DA SAUDADE / MG) - ITEM 2",null,null,null,"DATA: "," SETEMBRO / 2023   "]
[4,"SERVIÇO:  ","PLACA DE OBRA EM CHAPA DE AÇO GALVANIZADO",null,"SINAPI",103689,"UNIDADE: ","M2"]
[4]
[4,"TIPO ITEM","CODIGO ITEM","DESCRIÇÃO ITEM","UNIDADE ITEM","COEFICIENTE","PRECO UNITARIO","CUSTO TOTAL"]
[4,"INSUMO","4509","SARRAFO *2,5 X 10* CM EM PINUS, MISTA OU EQUIVALENTE DA REGIAO - BRUTA","M","3,2083000","4,41",14.14,{"$f":"VLOOKUP(A52,ORÇAMENTO!A$10:F$40,6)","v":6},{"$f":"H52*I52","v":84.84},"M"]
[4,"INSUMO","4813","PLACA DE OBRA (PARA CONSTRUCAO CIVIL) EM CHAPA GALVANIZADA *N. 22*, ADESIVADA, DE *2,4 X 1,2* M (SEM POSTES PARA FIXACAO)","M2","1,0000000","250,00",250,{"$f":"VLOOKUP(A53,ORÇAMENTO!A$10:F$40,6)","v":6},1500,"M"]
[4,"INSUMO","5065","PREGO DE ACO POLIDO COM CABECA 10 X 10 (7/8 X 17)","KG","0,0113000","36,57",0.41,{"$f":"VLOOKUP(A54,ORÇAMENTO!A$10:F$40,6)","v":6},2.46,"M"]
[4,"INSUMO","5069","PREGO DE ACO POLIDO COM CABECA 17 X 27 (2 1/2 X 11)","KG","0,0132000","19,59",0.25,{"$f":"VLOOKUP(A55,ORÇAMENTO!A$10:F$40,6)","v":6},1.5,"M"]
[4,"COMPOSICAO","88262","CARPINTEIRO DE FORMAS COM ENCARGOS COMPLEMENTARES","H","0,3729000","27,05",10.08,{"$f":"VLOOKUP(A56,ORÇAMENTO!A$10:F$40,6)","v":6},60.480000000000004,"P"]
[4,"COMPOSICAO","88316","SERVENTE COM ENCARGOS COMPLEMENTARES","H","1,1186000","19,76",22.1,{"$f":"VLOOKUP(A57,ORÇAMENTO!A$10:F$40,6)","v":6},132.60000000000002,"P"]
[4,"INSUMO",4115,"MADEIRA ROLICA TRATADA, D = 12 A 15 CM, H = 3,00 M, EM EUCALIPTO OU EQUIVALENTE","M",2,21.76,43.52,{"$f":"VLOOKUP(A58,ORÇAMENTO!A$10:F$40,6)","v":6},261.12,"M"]
[4,{"$nulls":6},0,{"$f":"VLOOKUP(A59,ORÇAMENTO!A$10:F$40,6)","v":6},0,"E"]
[4,"PRODUÇÃO DA EQUIPE",null,null,1,"CUSTO ",null,340.5]
[4,"TOTAL",{"$nulls":5},340.5]
[4,"BDI                %",{"$nulls":5},1.2149000000000001]
[4,"TOTAL DO SERVIÇO - R$",{"$nulls":5},413.67]
[4]
[{"$f":"A47+1","v":5},"CODEVASF",null,null," COMPOSIÇÃO DE PREÇO UNITÁRIO"]
[{"$f":"A65","v":5},"OBRA:  "," PAVIMENTAÇÃO ASFÁLTICA EM CBUQ - ESTRADA DE ACESSO AOS TÚNIES (SERRA DA SAUDADE / MG) - ITEM 2",null,null,null,"DATA: "," SETEMBRO / 2023   "]
[5,"SERVIÇO:  ","SERVIÇOS TOPOGRÁFICOS PARA PAVIMENTAÇÃO, INCLUSIVE NOTA DE SERVIÇO, ACOMPANHAMENTO E GREIDE",null,"SINAPI",78472,"UNIDADE: ","M2"]
[5]
[5,"TIPO ITEM","CODIGO ITEM","DESCRIÇÃO ITEM","UNIDADE ITEM","COEFICIENTE","PRECO UNITARIO","CUSTO TOTAL"]
[5,"COMPOSICAO",88253,"AUXILIAR DE TOPÓGRAFO COM ENCARGOS COMPLEMENTARES","H",2.5000000000000001E-3,21.57,0.05,{"$f":"VLOOKUP(A70,ORÇAMENTO!A$10:F$40,6)","v":13999.998},699.99990000000003,"P"]
[5,"COMPOSICAO",88288,"NIVELADOR COM ENCARGOS COMPLEMENTARES","H",2.5000000000000001E-3,26.99,0.06,{"$f":"VLOOKUP(A71,ORÇAMENTO!A$10:F$40,6)","v":13999.998},{"$f":"H71*I71","v":839.99987999999996},"P"]
[5,"COMPOSICAO",88316,"SERVENTE COM ENCARGOS COMPLEMENTARES","H",7.4999999999999997E-3,19.760000000000002,0.14000000000000001,{"$f":"VLOOKUP(A72,ORÇAMENTO!A$10:F$40,6)","v":13999.998},1959.99972,"P"]
[5,"COMPOSICAO",88597,"DESENHISTA DETALHISTA COM ENCARGOS COMPLEMENTARES ","H",2E-3,29.72,0.05,{"$f":"VLOOKUP(A73,ORÇAMENTO!A$10:F$40,6)","v":13999.998},699.99990000000003,"P"]
[5,"COMPOSICAO",92145,"CAMINHONETE CABINE SIMPLES COM MOTOR 1.6 FLEX, CÂMBIO MANUAL, POTÊNCIA 101/104 CV, 2 PORTAS","CHP",5.0000000000000001E-4,74.75,0.03,{"$f":"VLOOKUP(A74,ORÇAMENTO!A$10:F$40,6)","v":13999.998},419.99993999999998,"E"]
[5,{"$nulls":6},0,{"$f":"VLOOKUP(A75,ORÇAMENTO!A$10:F$40,6)","v":13999.998},0,"E"]
[5,"PRODUÇÃO DA EQUIPE",null,null,1,"CUSTO ",null,0.32999999999999996]
[5,"TOTAL",{"$nulls":5},0.32999999999999996]
[5,"BDI                %",{"$nulls":5},1.2149000000000001]
[5,"TOTAL DO SERVIÇO - R$",{"$nulls":5},0.4]
[5]
[{"$f":"A65+1","v":6},"CODEVASF",null,null," COMPOSIÇÃO DE PREÇO UNITÁRIO"]
[{"$f":"A81","v":6},"OBRA:  "," PAVIMENTAÇÃO ASFÁLTICA EM CBUQ - ESTRADA DE ACESSO AOS TÚNIES (SERRA DA SAUDADE / MG) - ITEM 2",null,null,null,"DATA: "," SETEMBRO / 2023   "]
[6,"SERVIÇO:  ","ESCAVAÇÃO HORIZONTAL EM SOLO DE 1A CATEGORIA ",null,"SINAPI",101116,"UNIDADE: ","M3"]
[6]
[6,"TIPO ITEM","CODIGO ITEM","DESCRIÇÃO ITEM","UNIDADE ITEM","COEFICIENTE","PRECO UNITARIO","CUSTO TOTAL"]
[6,"COMPOSICAO","5847","TRATOR DE ESTEIRAS, POTÊNCIA 170 HP, PESO OPERACIONAL 19 T, CAÇAMBA 5,2 M3","CHP","0,0048000","253,93",1.21,{"$f":"VLOOKUP(A86,ORÇAMENTO!A$10:F$40,6)","v":2800},3388,"E"]
[6,"COMPOSICAO","5849","TRATOR DE ESTEIRAS, POTÊNCIA 170 HP, PESO OPERACIONAL 19 T, CAÇAMBA 5,2 M3","CHI","0,0082000","90,40",0.74,{"$f":"VLOOKUP(A87,ORÇAMENTO!A$10:F$40,6)","v":2800},2072,"E"]
[6,"COMPOSICAO","88316","SERVENTE COM ENCARGOS COMPLEMENTARES","H","0,0131000","19,76",0.25,{"$f":"VLOOKUP(A88,ORÇAMENTO!A$10:F$40,6)","v":2800},700,"P"]
[6,"PRODUÇÃO DA EQUIPE",null,null,1,"CUSTO ",null,2.2000000000000002]
[6,"TOTAL",{"$nulls":5},2.2000000000000002]
[6,"BDI                %",{"$nulls":5},1.2149000000000001]
[6,"TOTAL DO SERVIÇO - R$",{"$nulls":5},2.67]
[]
[7,"CODEVASF",null,null," COMPOSIÇÃO DE PREÇO UNITÁRIO"]
[{"$f":"A94","v":7},"OBRA:  "," PAVIMENTAÇÃO ASFÁLTICA EM CBUQ - ESTRADA DE ACESSO AOS TÚNIES (SERRA DA SAUDADE / MG) - ITEM 2",null,null,null,"DATA: "," SETEMBRO / 2023   "]
[7,"SERVIÇO:  ","CARGA, MANOBRA E DESCARGA DE SOLOS E MATERIAIS GRANULARES EM CAMINHÃO BASCULANTE",null,"SINAPI",100976,"UNIDADE: ","M3"]
[7]
[7,"TIPO ITEM","CODIGO ITEM","DESCRIÇÃO ITEM","UNIDADE ITEM","COEFICIENTE","PRECO UNITARIO","CUSTO TOTAL"]
[7,"COMPOSICAO","5940","PÁ CARREGADEIRA SOBRE RODAS, POTÊNCIA LÍQUIDA 128 HP, CAPACIDADE DA CAÇAMBA 1,7 A 2,8 M3, PESO OPERACIONAL 11632 KG","CHP","0,0083000","217,72",1.8,{"$f":"VLOOKUP(A99,ORÇAMENTO!A$10:F$40,6)","v":2800},5040,"E"]
[7,"COMPOSICAO","5942","PÁ CARREGADEIRA SOBRE RODAS, POTÊNCIA LÍQUIDA 128 HP, CAPACIDADE DA CAÇAMBA 1,7 A 2,8 M3, PESO OPERACIONAL 11632 KG","CHI","0,0074000","95,85",0.7,{"$f":"VLOOKUP(A100,ORÇAMENTO!A$10:F$40,6)","v":2800},1959.9999999999998,"E"]
[7,"COMPOSICAO","89883","CAMINHÃO BASCULANTE 18 M3, COM CAVALO MECÂNICO DE CAPACIDADE MÁXIMA DE TRAÇÃO COMBINADO DE 45000 KG, POTÊNCIA 330 CV, INCLUSIVE SEMIREBOQUE COM CAÇAMBA METÁLICA","CHP","0,0153000","348,45",5.33,{"$f":"VLOOKUP(A101,ORÇAMENTO!A$10:F$40,6)","v":2800},14924,"E"]
[7,"COMPOSICAO","89884","CAMINHÃO BASCULANTE 18 M3, COM CAVALO MECÂNICO DE CAPACIDADE MÁXIMA DE TRAÇÃO COMBINADO DE 45000 KG, POTÊNCIA 330 CV, INCLUSIVE SEMIREBOQUE COM CAÇAMBA METÁLICA","CHI","0,0095000","93,65",0.88,{"$f":"VLOOKUP(A102,ORÇAMENTO!A$10:F$40,6)","v":2800},2464,"E"]
[7,"PRODUÇÃO DA EQUIPE",null,null,1,"CUSTO ",null,8.7100000000000009]
[7,"TOTAL",{"$nulls":5},8.7100000000000009]
[7,"BDI                %",{"$nulls":5},1.2149000000000001]
[7,"TOTAL DO SERVIÇO - R$",{"$nulls":5},10.58]
[7]
[8,"CODEVASF",null,null," COMPOSIÇÃO DE PREÇO UNITÁRIO"]
[{"$f":"A108","v":8},"OBRA:  "," PAVIMENTAÇÃO ASFÁLTICA EM CBUQ - ESTRADA DE ACESSO AOS TÚNIES (SERRA DA SAUDADE / MG) - ITEM 2",null,null,null,"DATA: "," SETEMBRO / 2023   "]
[8,"SERVIÇO:  ","REGULARIZAÇÃO E COMPACTAÇÃO DO SUBLEITO ",null,"SICRO",100576,"UNIDADE: ","M2"]
[8]
[8,"TIPO ITEM","CODIGO ITEM","DESCRIÇÃO ITEM","UNIDADE ITEM","COEFICIENTE","PRECO UNITARIO","CUSTO TOTAL"]
[8,"COMPOSICAO","5901","CAMINHÃO PIPA 10.000 L TRUCADO, PESO BRUTO TOTAL 23.000 KG, CARGA ÚTIL MÁXIMA 15.935 KG, DISTÂNCIA ENTRE EIXOS 4,8 M, POTÊNCIA 230 CV, INCLUSIVE TANQUE DE AÇO PARA TRANSPORTE DE ÁGUA","CHP","0,0010000","294,94",0.28999999999999998,{"$f":"VLOOKUP(A113,ORÇAMENTO!A$10:F$40,6)","v":14000.000000000002},4060.0000000000005,"E"]
[8,"COMPOSICAO","5903","CAMINHÃO PIPA 10.000 L TRUCADO, PESO BRUTO TOTAL 23.000 KG, CARGA ÚTIL MÁXIMA 15.935 KG, DISTÂNCIA ENTRE EIXOS 4,8 M, POTÊNCIA 230 CV, INCLUSIVE TANQUE DE AÇO PARA TRANSPORTE DE ÁGUA","CHI","0,0070000","72,55",0.5,{"$f":"VLOOKUP(A114,ORÇAMENTO!A$10:F$40,6)","v":14000.000000000002},7000.0000000000009,"E"]
[8,"COMPOSICAO","5932","MOTONIVELADORA POTÊNCIA BÁSICA LÍQUIDA (PRIMEIRA MARCHA) 125 HP, PESO BRUTO 13032 KG, LARGURA DA LÂMINA DE 3,7 M","CHP","0,0001000","262,71",0.02,{"$f":"VLOOKUP(A115,ORÇAMENTO!A$10:F$40,6)","v":14000.000000000002},280.00000000000006,"E"]
[8,"COMPOSICAO","5934","MOTONIVELADORA POTÊNCIA BÁSICA LÍQUIDA (PRIMEIRA MARCHA) 125 HP, PESO BRUTO 13032 KG, LARGURA DA LÂMINA DE 3,7 M","CHI","0,0080000","109,40",0.87,{"$f":"VLOOKUP(A116,ORÇAMENTO!A$10:F$40,6)","v":14000.000000000002},12180.000000000002,"E"]
[8,"COMPOSICAO","73436","ROLO COMPACTADOR VIBRATÓRIO PÉ DE CARNEIRO PARA SOLOS, POTÊNCIA 80 HP, PESO OPERACIONAL SEM/COM LASTRO 7,4 / 8,8 T, LARGURA DE TRABALHO 1,68 M","CHP","0,0020000","163,19",0.32,{"$f":"VLOOKUP(A117,ORÇAMENTO!A$10:F$40,6)","v":14000.000000000002},4480.0000000000009,"E"]
[8,"COMPOSICAO","88316","SERVENTE COM ENCARGOS COMPLEMENTARES","H","0,0080000","19,76",0.15,{"$f":"VLOOKUP(A118,ORÇAMENTO!A$10:F$40,6)","v":14000.000000000002},2100,"P"]
[8,"COMPOSICAO","93244","ROLO COMPACTADOR VIBRATÓRIO PÉ DE CARNEIRO PARA SOLOS, POTÊNCIA 80 HP, PESO OPERACIONAL SEM/COM LASTRO 7,4 / 8,8 T, LARGURA DE TRABALHO 1,68 M","CHI","0,0060000","71,18",0.42,{"$f":"VLOOKUP(A119,ORÇAMENTO!A$10:F$40,6)","v":14000.000000000002},5880.0000000000009,"E"]
[8,{"$nulls":7},{"$f":"VLOOKUP(A120,ORÇAMENTO!A$10:F$40,6)","v":14000.000000000002},0,"E"]
[8,"PRODUÇÃO DA EQUIPE",null,null,1,"CUSTO ",null,2.57]
[8,"TOTAL",{"$nulls":5},2.57]
[8,"BDI                %",{"$nulls":5},1.2149000000000001]
[8,"TOTAL DO SERVIÇO - R$",{"$nulls":5},3.12]
[8]
[9,"CODEVASF",null,null," COMPOSIÇÃO DE PREÇO UNITÁRIO"]
[{"$f":"A126","v":9},"OBRA:  "," PAVIMENTAÇÃO ASFÁLTICA EM CBUQ - ESTRADA DE ACESSO AOS TÚNIES (SERRA DA SAUDADE / MG) - ITEM 2",null,null,null,"DATA: "," SETEMBRO / 2023   "]
[9,"SERVIÇO:  ","EXECUÇÃO E COMPACTAÇÃO DE BASE E OU SUB BASE PARA PAVIMENTAÇÃO DE BICA CORRIDA - EXCLUSIVE CARGA E TRANSPORTE",null,"SINAPI",96396,"UNIDADE: ","M3"]
[9]
[9,"TIPO ITEM","CODIGO ITEM","DESCRIÇÃO ITEM","UNIDADE ITEM","COEFICIENTE","PRECO UNITARIO","CUSTO TOTAL"]
[9,"COMPOSICAO","5684","ROLO COMPACTADOR VIBRATÓRIO DE UM CILINDRO AÇO LISO, POTÊNCIA 80 HP, PESO OPERACIONAL MÁXIMO 8,1 T, IMPACTO DINÂMICO 16,15 / 9,5 T, LARGURA DE TRABALHO 1,68 M","CHP","0,0090000","159,98",1.43,{"$f":"VLOOKUP(A131,ORÇAMENTO!A$10:F$40,6)","v":2000.0000000000002},2860,"E"]
[9,"COMPOSICAO","5685","ROLO COMPACTADOR VIBRATÓRIO DE UM CILINDRO AÇO LISO, POTÊNCIA 80 HP, PESO OPERACIONAL MÁXIMO 8,1 T, IMPACTO DINÂMICO 16,15 / 9,5 T, LARGURA DE TRABALHO 1,68 M","CHI","0,0210000","69,53",1.46,{"$f":"VLOOKUP(A132,ORÇAMENTO!A$10:F$40,6)","v":2000.0000000000002},2920.0000000000005,"E"]
[9,"COMPOSICAO","5901","CAMINHÃO PIPA 10.000 L TRUCADO, PESO BRUTO TOTAL 23.000 KG, CARGA ÚTIL MÁXIMA 15.935 KG, DISTÂNCIA ENTRE EIXOS 4,8 M, POTÊNCIA 230 CV, INCLUSIVE TANQUE DE AÇO PARA TRANSPORTE DE ÁGUA","CHP","0,0020000","294,94",0.57999999999999996,{"$f":"VLOOKUP(A133,ORÇAMENTO!A$10:F$40,6)","v":2000.0000000000002},1160,"E"]
[9,"COMPOSICAO","5903","CAMINHÃO PIPA 10.000 L TRUCADO, PESO BRUTO TOTAL 23.000 KG, CARGA ÚTIL MÁXIMA 15.935 KG, DISTÂNCIA ENTRE EIXOS 4,8 M, POTÊNCIA 230 CV, INCLUSIVE TANQUE DE AÇO PARA TRANSPORTE DE ÁGUA","CHI","0,0280000","72,55",2.0299999999999998,{"$f":"VLOOKUP(A134,ORÇAMENTO!A$10:F$40,6)","v":2000.0000000000002},4060,"E"]
[9,"COMPOSICAO","5932","MOTONIVELADORA POTÊNCIA BÁSICA LÍQUIDA (PRIMEIRA MARCHA) 125 HP, PESO BRUTO 13032 KG, LARGURA DA LÂMINA DE 3,7 M","CHP","0,0080000","262,71",2.1,{"$f":"VLOOKUP(A135,ORÇAMENTO!A$10:F$40,6)","v":2000.0000000000002},{"$f":"H135*I135","v":4200.0000000000009},"E"]
[9,"COMPOSICAO","5934","MOTONIVELADORA POTÊNCIA BÁSICA LÍQUIDA (PRIMEIRA MARCHA) 125 HP, PESO BRUTO 13032 KG, LARGURA DA LÂMINA DE 3,7 M","CHI","0,0220000","109,40",2.4,{"$f":"VLOOKUP(A136,ORÇAMENTO!A$10:F$40,6)","v":2000.0000000000002},4800,"E"]
[9,"COMPOSICAO","88316","SERVENTE COM ENCARGOS COMPLEMENTARES","H","0,0300000","19,76",0.59,{"$f":"VLOOKUP(A137,ORÇAMENTO!A$10:F$40,6)","v":2000.0000000000002},1180,"P"]
[9,"COMPOSICAO",4748,"PEDRA BRITADA OU BICA CORRIDA, NAO CLASSIFICADA (POSTO PEDREIRA/FORNECEDOR, SEM FRETE)","M3","1,0000000",{"$f":"CPU!G138","v":91},0,{"$f":"VLOOKUP(A138,ORÇAMENTO!A$10:F$40,6)","v":2000.0000000000002},0,"M"]
[9,"COMPOSICAO","96463","ROLO COMPACTADOR DE PNEUS, ESTATICO, PRESSAO VARIAVEL, POTENCIA 110 HP, PESO SEM/COM LASTRO 10,8/27 T, LARGURA DE ROLAGEM 2,30 M","CHP","0,0040000","218,21",0.87,{"$f":"VLOOKUP(A139,ORÇAMENTO!A$10:F$40,6)","v":2000.0000000000002},1740.0000000000002,"E"]
[9,"COMPOSICAO","96464","ROLO COMPACTADOR DE PNEUS, ESTATICO, PRESSAO VARIAVEL, POTENCIA 110 HP, PESO SEM/COM LASTRO 10,8/27 T, LARGURA DE ROLAGEM 2,30 M","CHI","0,0260000","95,83",2.4900000000000002,{"$f":"VLOOKUP(A140,ORÇAMENTO!A$10:F$40,6)","v":2000.0000000000002},4980.0000000000009,"E"]
[9,{"$nulls":6},0,{"$f":"VLOOKUP(A141,ORÇAMENTO!A$10:F$40,6)","v":2000.0000000000002},0,"E"]
[9,"PRODUÇÃO DA EQUIPE",null,null,1,"CUSTO ",null,13.95]
[9,"TOTAL",{"$nulls":5},13.95]
[9,"BDI                %",{"$nulls":5},1.2149000000000001]
[9,"TOTAL DO SERVIÇO - R$",{"$nulls":5},16.95]
[9]
[10,"CODEVASF",null,null," COMPOSIÇÃO DE PREÇO UNITÁRIO"]
[{"$f":"A147","v":10},"OBRA:  "," PAVIMENTAÇÃO ASFÁLTICA EM CBUQ - ESTRADA DE ACESSO AOS TÚNIES (SERRA DA SAUDADE / MG) - ITEM 2",null,null,null,"DATA: "," SETEMBRO / 2023   "]
[10,"SERVIÇO:  ","IMPRIMAÇÃO COM EMULSÃO ASFÁLTICA (EAI)",null,"SINAPI",96401,"UNIDADE: ","M2"]
[10]
[10,"TIPO ITEM","CODIGO ITEM","DESCRIÇÃO ITEM","UNIDADE ITEM","COEFICIENTE","PRECO UNITARIO","CUSTO TOTAL"]
[10,"COMPOSICAO",5839,"VASSOURA MECÂNICA REBOCÁVEL COM ESCOVA CILÍNDRICA, LARGURA ÚTIL DE VARRIMENTO DE 2,44 M ","CHP","0,0020000",10.3,0.02,{"$f":"VLOOKUP(A152,ORÇAMENTO!A$10:F$40,6)","v":14000.000000000002},280.00000000000006,"E"]
[10,"COMPOSICAO",5841,"VASSOURA MECÂNICA REBOCÁVEL COM ESCOVA CILÍNDRICA, LARGURA ÚTIL DE VARRIMENTO DE 2,44 M ","CHI","0,0040000",5.18,0.02,{"$f":"VLOOKUP(A153,ORÇAMENTO!A$10:F$40,6)","v":14000.000000000002},280.00000000000006,"E"]
[10,"INSUMO","ANP","EMULSÃO ASFÁLTICA PARA IMPRIMAÇÃO - EAI (FORNECIMENTO COM BDI DIFERENCIADO)","T",1.2999999999999999E-3,null,0,{"$f":"VLOOKUP(A154,ORÇAMENTO!A$10:F$40,6)","v":14000.000000000002},0,"M"]
[10,"COMPOSICAO",83362,"ESPARGIDOR DE ASFALTO PRESSURIZADO, TANQUE 6 M3 COM ISOLAÇÃO TÉRMICA, AQUECIDO COM 2 MAÇARICOS, COM BARRA ESPARGIDORA 3,60 M, MONTADO SOBRE CAMINHÃO  TOCO, PBT 14.300 KG, POTÊNCIA 185 CV","CHP","0,0010000",256.33999999999997,0.25,{"$f":"VLOOKUP(A155,ORÇAMENTO!A$10:F$40,6)","v":14000.000000000002},3500.0000000000005,"E"]
[10,"COMPOSICAO",88316,"SERVENTE COM ENCARGOS COMPLEMENTARES","H","0,0060000",19.760000000000002,0.11,{"$f":"VLOOKUP(A156,ORÇAMENTO!A$10:F$40,6)","v":14000.000000000002},1540.0000000000002,"P"]
[10,"COMPOSICAO",89035,"TRATOR DE PNEUS, POTÊNCIA 85 CV, TRAÇÃO 4X4, PESO COM LASTRO DE 4.675 KG ","CHP","0,0020000",135.08000000000001,0.27,{"$f":"VLOOKUP(A157,ORÇAMENTO!A$10:F$40,6)","v":14000.000000000002},3780.0000000000009,"E"]
[10,"COMPOSICAO",89036,"TRATOR DE PNEUS, POTÊNCIA 85 CV, TRAÇÃO 4X4, PESO COM LASTRO DE 4.675 KG ","CHI","0,0040000",56.48,0.22,{"$f":"VLOOKUP(A158,ORÇAMENTO!A$10:F$40,6)","v":14000.000000000002},3080.0000000000005,"E"]
[10,"COMPOSICAO",91486,"ESPARGIDOR DE ASFALTO PRESSURIZADO, TANQUE 6 M3 COM ISOLAÇÃO TÉRMICA, AQUECIDO COM 2 MAÇARICOS, COM BARRA ESPARGIDORA 3,60 M, MONTADO SOBRE CAMINHÃO  TOCO, PBT 14.300 KG, POTÊNCIA 185 CV","CHI","0,0050000",68.430000000000007,0.34,{"$f":"VLOOKUP(A159,ORÇAMENTO!A$10:F$40,6)","v":14000.000000000002},4760.0000000000009,"E"]
[10,{"$nulls":6},0,{"$f":"VLOOKUP(A160,ORÇAMENTO!A$10:F$40,6)","v":14000.000000000002},0,"E"]
[10,"PRODUÇÃO DA EQUIPE",null,null,1,"CUSTO ",null,1.23]
[10,"TOTAL",{"$nulls":5},1.23]
[10,"BDI                %",{"$nulls":5},1.2149000000000001]
[10,"TOTAL DO SERVIÇO - R$",{"$nulls":5},1.49]
[10]
[11,"CODEVASF",null,null," COMPOSIÇÃO DE PREÇO UNITÁRIO"]
[{"$f":"A166","v":11},"OBRA:  "," PAVIMENTAÇÃO ASFÁLTICA EM CBUQ - ESTRADA DE ACESSO AOS TÚNIES (SERRA DA SAUDADE / MG) - ITEM 2",null,null,null,"DATA: "," SETEMBRO / 2023   "]
[11,"SERVIÇO:  ","PINTURA DE LIGAÇÃO COM EMULSÃO ASFÁLTICA RR-1C",null,"SINAPI",96402,"UNIDADE: ","M2"]
[11]
[11,"TIPO ITEM","CODIGO ITEM","DESCRIÇÃO ITEM","UNIDADE ITEM","COEFICIENTE","PRECO UNITARIO","CUSTO TOTAL"]
[11,"COMPOSICAO",5839,"VASSOURA MECÂNICA REBOCÁVEL COM ESCOVA CILÍNDRICA, LARGURA ÚTIL DE VARRIMENTO DE 2,44 M","CHP","0,0020000",10.3,0.02,{"$f":"VLOOKUP(A171,ORÇAMENTO!A$10:F$40,6)","v":14599.999999999998},291.99999999999994,"E"]
[11,"COMPOSICAO",5841,"VASSOURA MECÂNICA REBOCÁVEL COM ESCOVA CILÍNDRICA, LARGURA ÚTIL DE VARRIMENTO DE 2,44 M","CHI","0,0040000",5.18,0.02,{"$f":"VLOOKUP(A172,ORÇAMENTO!A$10:F$40,6)","v":14599.999999999998},291.99999999999994,"E"]
[11,"INSUMO",41903,"EMULSAO ASFALTICA CATIONICA RR-2C PARA USO EM PAVIMENTACAO ASFALTICA (FORNECIMENTO COM BDI DIFERENCIADO)","KG","0,4500000",null,0,{"$f":"VLOOKUP(A173,ORÇAMENTO!A$10:F$40,6)","v":14599.999999999998},0,"M"]
[11,"COMPOSICAO",83362,"ESPARGIDOR DE ASFALTO PRESSURIZADO, TANQUE 6 M3 COM ISOLAÇÃO TÉRMICA, AQUECIDO COM 2 MAÇARICOS, COM BARRA ESPARGIDORA 3,60 M, MONTADO SOBRE CAMINHÃO  TOCO, PBT 14.300 KG, POTÊNCIA 185 CV","CHP","0,0004000",256.33999999999997,0.1,{"$f":"VLOOKUP(A174,ORÇAMENTO!A$10:F$40,6)","v":14599.999999999998},1460,"E"]
[11,"COMPOSICAO",88316,"SERVENTE COM ENCARGOS COMPLEMENTARES","H","0,0055000",19.760000000000002,0.1,{"$f":"VLOOKUP(A175,ORÇAMENTO!A$10:F$40,6)","v":14599.999999999998},1460,"P"]
[11,"COMPOSICAO",89035,"TRATOR DE PNEUS, POTÊNCIA 85 CV, TRAÇÃO 4X4, PESO COM LASTRO DE 4.675 KG","CHP","0,0017000",135.08000000000001,0.22,{"$f":"VLOOKUP(A176,ORÇAMENTO!A$10:F$40,6)","v":14599.999999999998},3211.9999999999995,"E"]
[11,"COMPOSICAO",89036,"TRATOR DE PNEUS, POTÊNCIA 85 CV, TRAÇÃO 4X4, PESO COM LASTRO DE 4.675 KG","CHI","0,0038000",56.48,0.21,{"$f":"VLOOKUP(A177,ORÇAMENTO!A$10:F$40,6)","v":14599.999999999998},3065.9999999999995,"E"]
[11,"COMPOSICAO",91486,"ESPARGIDOR DE ASFALTO PRESSURIZADO, TANQUE 6 M3 COM ISOLAÇÃO TÉRMICA, AQUECIDO COM 2 MAÇARICOS, COM BARRA ESPARGIDORA 3,60 M, MONTADO SOBRE CAMINHÃO  TOCO, PBT 14.300 KG, POTÊNCIA 185 CV","CHI","0,0051000",68.430000000000007,0.34,{"$f":"VLOOKUP(A178,ORÇAMENTO!A$10:F$40,6)","v":14599.999999999998},4964,"E"]
[11,{"$nulls":6},0,{"$f":"VLOOKUP(A179,ORÇAMENTO!A$10:F$40,6)","v":14599.999999999998},0,"E"]
[11,"PRODUÇÃO DA EQUIPE",null,null,1,"CUSTO ",null,1.01]
[11,"TOTAL",{"$nulls":5},1.01]
[11,"BDI                %",{"$nulls":5},1.2149000000000001]
[11,"TOTAL DO SERVIÇO - R$",{"$nulls":5},1.23]
[11]
[12,"CODEVASF",null,null," COMPOSIÇÃO DE PREÇO UNITÁRIO"]
[{"$f":"A185","v":12},"OBRA:  "," PAVIMENTAÇÃO ASFÁLTICA EM CBUQ - ESTRADA DE ACESSO AOS TÚNIES (SERRA DA SAUDADE / MG) - ITEM 2",null,null,null,"DATA: "," SETEMBRO / 2023   "]
[12,"SERVIÇO:  ","EXECUÇÃO DE PAVIMENTO COM APLICAÇÃO DE CONCRETO ASFÁLTICO USINADO A QUENTE (CBUQ), CAMADA DE ROLAMENTO - EXCLUSIVE TRANSPORTE",null,"SINAPI",95995,"UNIDADE: ","M3"]
[12]
[12,"TIPO ITEM","CODIGO ITEM","DESCRIÇÃO ITEM","UNIDADE ITEM","COEFICIENTE","PRECO UNITARIO","CUSTO TOTAL"]
[12,"INSUMO",1518,"CONCRETO BETUMINOSO USINADO A QUENTE (CBUQ) PARA PAVIMENTACAO ASFALTICA, PADRAO DNIT, FAIXA C, COM CAP 50/70 - AQUISICAO POSTO USINA (FORNECIMENTO COM BDI DIFERENCIADO)","T","2,5548000",null,0,{"$f":"VLOOKUP(A190,ORÇAMENTO!A$10:F$40,6)","v":530},0,"M"]
[12,"COMPOSICAO","5835","VIBROACABADORA DE ASFALTO SOBRE ESTEIRAS, LARGURA DE PAVIMENTAÇÃO 1,90 M A 5,30 M, POTÊNCIA 105 HP CAPACIDADE 450 T/H","CHP","0,0464000","396,75",18.399999999999999,{"$f":"VLOOKUP(A191,ORÇAMENTO!A$10:F$40,6)","v":530},9752,"E"]
[12,"COMPOSICAO","5837","VIBROACABADORA DE ASFALTO SOBRE ESTEIRAS, LARGURA DE PAVIMENTAÇÃO 1,90 M A 5,30 M, POTÊNCIA 105 HP CAPACIDADE 450 T/H ","CHI","0,0949000","165,12",15.66,{"$f":"VLOOKUP(A192,ORÇAMENTO!A$10:F$40,6)","v":530},8299.7999999999993,"E"]
[12,"COMPOSICAO",88314,"RASTELEIRO COM ENCARGOS COMPLEMENTARES","H","1,1301000","26,52",29.97,{"$f":"VLOOKUP(A193,ORÇAMENTO!A$10:F$40,6)","v":530},15884.099999999999,"P"]
[12,"COMPOSICAO",91386,"CAMINHÃO BASCULANTE 10 M3, TRUCADO CABINE SIMPLES, PESO BRUTO TOTAL 23.000 KG, CARGA ÚTIL MÁXIMA 15.935 KG, DISTÂNCIA ENTRE EIXOS 4,80 M, POTÊNCIA 230 CV INCLUSIVE CAÇAMBA METÁLICA ","CHP","0,0464000","252,13",11.69,{"$f":"VLOOKUP(A194,ORÇAMENTO!A$10:F$40,6)","v":530},6195.7,"E"]
[12,"COMPOSICAO",95631,"ROLO COMPACTADOR VIBRATORIO TANDEM, ACO LISO, POTENCIA 125 HP, PESO SEM/COM LASTRO 10,20/11,65 T, LARGURA DE TRABALHO 1,73 M ","CHP","0,0805000","228,02",18.350000000000001,{"$f":"VLOOKUP(A195,ORÇAMENTO!A$10:F$40,6)","v":530},9725.5,"E"]
[12,"COMPOSICAO",95632,"ROLO COMPACTADOR VIBRATORIO TANDEM, ACO LISO, POTENCIA 125 HP, PESO SEM/COM LASTRO 10,20/11,65 T, LARGURA DE TRABALHO 1,73 M ","CHI","0,0607000","89,32",5.42,{"$f":"VLOOKUP(A196,ORÇAMENTO!A$10:F$40,6)","v":530},2872.6,"E"]
[12,"COMPOSICAO",96155,"TRATOR DE PNEUS COM POTÊNCIA DE 85 CV, TRAÇÃO 4X4, COM VASSOURA MECÂNICA ACOPLADA ","CHI","0,1071000","61,42",6.57,{"$f":"VLOOKUP(A197,ORÇAMENTO!A$10:F$40,6)","v":530},3482.1000000000004,"E"]
[12,"COMPOSICAO",96157,"TRATOR DE PNEUS COM POTÊNCIA DE 85 CV, TRAÇÃO 4X4, COM VASSOURA MECÂNICA ACOPLADA","CHP","0,0341000","144,29",4.92,{"$f":"VLOOKUP(A198,ORÇAMENTO!A$10:F$40,6)","v":530},2607.6,"E"]
[12,"COMPOSICAO",96463,"ROLO COMPACTADOR DE PNEUS, ESTATICO, PRESSAO VARIAVEL, POTENCIA 110 HP, PESO SEM/COM LASTRO 10,8/27 T, LARGURA DE ROLAGEM 2,30 M ","CHP","0,0419000","218,21",9.14,{"$f":"VLOOKUP(A199,ORÇAMENTO!A$10:F$40,6)","v":530},{"$f":"H199*I199","v":4844.2000000000007},"E"]
[12,"COMPOSICAO",96464,"ROLO COMPACTADOR DE PNEUS, ESTATICO, PRESSAO VARIAVEL, POTENCIA 110 HP, PESO SEM/COM LASTRO 10,8/27 T, LARGURA DE ROLAGEM 2,30 M ","CHI","0,0990000","95,83",9.48,{"$f":"VLOOKUP(A200,ORÇAMENTO!A$10:F$40,6)","v":530},5024.4000000000005,"E"]
[12,{"$nulls":6},0,{"$f":"VLOOKUP(A201,ORÇAMENTO!A$10:F$40,6)","v":530},0,"E"]
[12,"PRODUÇÃO DA EQUIPE",null,null,1,"CUSTO ",null,129.6]
[12,"TOTAL",{"$nulls":5},129.6]
[12,"BDI                %",{"$nulls":5},1.2149000000000001]
[12,"TOTAL DO SERVIÇO - R$",{"$nulls":5},157.44999999999999]
[12]
[13,"CODEVASF",null,null," COMPOSIÇÃO DE PREÇO UNITÁRIO"]
[{"$f":"A207","v":13},"OBRA:  "," PAVIMENTAÇÃO ASFÁLTICA EM CBUQ - ESTRADA DE ACESSO AOS TÚNIES (SERRA DA SAUDADE / MG) - ITEM 2",null,null,null,"DATA: "," SETEMBRO / 2023   "]
[13,"SERVIÇO:  ","TRANSPORTE COM CAMINHÃO BASCULANTE, EM VIA URBANA PAVIMENTADA",null,"SINAPI",95427,"UNIDADE: ","M3XKM"]
[13]
[13,"TIPO ITEM","CODIGO ITEM","DESCRIÇÃO ITEM","UNIDADE ITEM","COEFICIENTE","PRECO UNITARIO","CUSTO TOTAL"]
[13,"COMPOSICAO","89883","CAMINHÃO BASCULANTE 18 M3, COM CAVALO MECÂNICO DE CAPACIDADE MÁXIMA DE TRAÇÃO COMBINADO DE 45000 KG, POTÊNCIA 330 CV, INCLUSIVE SEMIREBOQUE COM CAÇAMBA METÁLICA","CHP","0,0019000",348.45,0.66,{"$f":"VLOOKUP(A212,ORÇAMENTO!A$10:F$40,6)","v":260000.00157056004},171600.00103656962,"E"]
[13,"COMPOSICAO","89884","CAMINHÃO BASCULANTE 18 M3, COM CAVALO MECÂNICO DE CAPACIDADE MÁXIMA DE TRAÇÃO COMBINADO DE 45000 KG, POTÊNCIA 330 CV, INCLUSIVE SEMIREBOQUE COM CAÇAMBA METÁLICA","CHI","0,0008000",93.65,7.0000000000000007E-2,{"$f":"VLOOKUP(A213,ORÇAMENTO!A$10:F$40,6)","v":260000.00157056004},18200.000109939203,"E"]
[13,{"$nulls":6},0,{"$f":"VLOOKUP(A214,ORÇAMENTO!A$10:F$40,6)","v":260000.00157056004},0,"E"]
[13,"PRODUÇÃO DA EQUIPE",null,null,1,"CUSTO ",null,0.73]
[13,"TOTAL",{"$nulls":5},0.73]
[13,"BDI                %",{"$nulls":5},1.2149000000000001]
[13,"TOTAL DO SERVIÇO - R$",{"$nulls":5},0.89]
[13]
[14,"CODEVASF",null,null," COMPOSIÇÃO DE PREÇO UNITÁRIO"]
[{"$f":"A220","v":14},"OBRA:  "," PAVIMENTAÇÃO ASFÁLTICA EM CBUQ - ESTRADA DE ACESSO AOS TÚNIES (SERRA DA SAUDADE / MG) - ITEM 2",null,null,null,"DATA: "," SETEMBRO / 2023   "]
[14,"SERVIÇO:  ","TRANSPORTE COM CAMINHÃO CARROCERIA 9T, EM VIA URBANA PAVIMENTADA",null,"SINAPI",100947,"UNIDADE: ","TXKM"]
[14]
[14,"TIPO ITEM","CODIGO ITEM","DESCRIÇÃO ITEM","UNIDADE ITEM","COEFICIENTE","PRECO UNITARIO","CUSTO TOTAL"]
[14,"COMPOSICAO","5824","CAMINHÃO TOCO, PBT 16.000 KG, CARGA ÚTIL MÁX. 10.685 KG, DIST. ENTRE EIXOS 4,8 M, POTÊNCIA 189 CV, INCLUSIVE CARROCERIA FIXA ABERTA DE MADEIRA P/ TRANSPORTE GERAL DE CARGA SECA, DIMEN. APROX. 2,5 X 7,00 X 0,50 M ","CHP",3.8999999999999998E-3,202.74,0.79,{"$f":"VLOOKUP(A225,ORÇAMENTO!A$10:F$40,6)","v":7000.0036309856005},5530.0028684786248,"E"]
[14,"COMPOSICAO","5826","CAMINHÃO TOCO, PBT 16.000 KG, CARGA ÚTIL MÁX. 10.685 KG, DIST. ENTRE EIXOS 4,8 M, POTÊNCIA 189 CV, INCLUSIVE CARROCERIA FIXA ABERTA DE MADEIRA P/ TRANSPORTE GERAL DE CARGA SECA, DIMEN. APROX. 2,5 X 7,00 X 0,50 M ","CHI","0,0040000",60.95,0.24,{"$f":"VLOOKUP(A226,ORÇAMENTO!A$10:F$40,6)","v":7000.0036309856005},1680.000871436544,"E"]
[14,{"$nulls":6},0,{"$f":"VLOOKUP(A227,ORÇAMENTO!A$10:F$40,6)","v":7000.0036309856005},0,"E"]
[14,"PRODUÇÃO DA EQUIPE",null,null,1,"CUSTO ",null,1.03]
[14,"TOTAL",{"$nulls":5},1.03]
[14,"BDI                %",{"$nulls":5},1.2149000000000001]
[14,"TOTAL DO SERVIÇO - R$",{"$nulls":5},1.25]
[14]
[15,"CODEVASF",null,null," COMPOSIÇÃO DE PREÇO UNITÁRIO"]
[{"$f":"A233","v":15},"OBRA:  "," PAVIMENTAÇÃO ASFÁLTICA EM CBUQ - ESTRADA DE ACESSO AOS TÚNIES (SERRA DA SAUDADE / MG) - ITEM 2",null,null,null,"DATA: "," SETEMBRO / 2023   "]
[15,"SERVIÇO:  ","TRANSPORTE DE MASSA ASFÁLTICA COM CAMINHÃO BASCULANTE, EM VIA URBANA PAVIMENTADA (BDI DIFERENCIADO)",null,"SINAPI",95430,"UNIDADE: ","TXKM"]
[15]
[15,"TIPO ITEM","CODIGO ITEM","DESCRIÇÃO ITEM","UNIDADE ITEM","COEFICIENTE","PRECO UNITARIO","CUSTO TOTAL"]
[15,"COMPOSICAO","89883","CAMINHÃO BASCULANTE 18 M3, COM CAVALO MECÂNICO DE CAPACIDADE MÁXIMA DE TRAÇÃO COMBINADO DE 45000 KG, POTÊNCIA 330 CV, INCLUSIVE SEMIREBOQUE COM CAÇAMBA METÁLICA","CHP","0,0012000",348.45,0.41]
[15,"COMPOSICAO","89884","CAMINHÃO BASCULANTE 18 M3, COM CAVALO MECÂNICO DE CAPACIDADE MÁXIMA DE TRAÇÃO COMBINADO DE 45000 KG, POTÊNCIA 330 CV, INCLUSIVE SEMIREBOQUE COM CAÇAMBA METÁLICA","CHI","0,0005000",93.65,0.04]
[15,{"$nulls":6},0]
[15,"PRODUÇÃO DA EQUIPE",null,null,1,"CUSTO ",null,0.44999999999999996]
[15,"TOTAL",{"$nulls":5},0.44999999999999996]
[15,"BDI                %",{"$nulls":5},1.1499999999999999]
[15,"TOTAL DO SERVIÇO - R$",{"$nulls":5},0.52]
[15]
[16,"CODEVASF",null,null," COMPOSIÇÃO DE PREÇO UNITÁRIO"]
[{"$f":"A246","v":16},"OBRA:  "," PAVIMENTAÇÃO ASFÁLTICA EM CBUQ - ESTRADA DE ACESSO AOS TÚNIES (SERRA DA SAUDADE / MG) - ITEM 2",null,null,null,"DATA: "," SETEMBRO / 2023   "]
[16,"SERVIÇO:  ","TRANSPORTE COM CAMINHÃO TANQUE DE TRANSPORTE DE MATERIAL ASFÁLTICO DE 30000 L, EM VIA URBANA PAVIMENTADA (BDI DIFERENCIADO)",null,"SINAPI",102331,"UNIDADE: ","TXKM"]
[16]
[16,"TIPO ITEM","CODIGO ITEM","DESCRIÇÃO ITEM","UNIDADE ITEM","COEFICIENTE","PRECO UNITARIO","CUSTO TOTAL"]
[16,"COMPOSICAO","91645","CAMINHÃO DE TRANSPORTE DE MATERIAL ASFÁLTICO 30.000 L, COM CAVALO MECÂNICO DE CAPACIDADE MÁXIMA DE TRAÇÃO COMBINADO DE 66.000 KG, POTÊNCIA 360 CV, INCLUSIVE TANQUE DE ASFALTO COM SERPENTINA ","CHP","0,0011000","442,21",0.48]
[16,"COMPOSICAO","91646","CAMINHÃO DE TRANSPORTE DE MATERIAL ASFÁLTICO 30.000 L, COM CAVALO MECÂNICO DE CAPACIDADE MÁXIMA DE TRAÇÃO COMBINADO DE 66.000 KG, POTÊNCIA 360 CV, INCLUSIVE TANQUE DE ASFALTO COM SERPENTINA","CHI","0,0005000","98,91",0.04]
[16,"PRODUÇÃO DA EQUIPE",null,null,1,"CUSTO ",null,0.52]
[16,"TOTAL",{"$nulls":5},0.52]
[16,"BDI                %",{"$nulls":5},1.1499999999999999]
[16,"TOTAL DO SERVIÇO - R$",{"$nulls":5},0.6]
[16]
[17,"CODEVASF",null,null," COMPOSIÇÃO DE PREÇO UNITÁRIO"]
[{"$f":"A258","v":17},"OBRA:  "," PAVIMENTAÇÃO ASFÁLTICA EM CBUQ - ESTRADA DE ACESSO AOS TÚNIES (SERRA DA SAUDADE / MG) - ITEM 2",null,null,null,"DATA: "," SETEMBRO / 2023   "]
[17,"SERVIÇO:  ","GUIA (MEIO-FIO) E SARJETA CONJUGADOS DE CONCRETO, MOLDADA IN LOCO EM M CR 57,38 TRECHO RETO COM EXTRUSORA, 45 CM BASE (15 CM BASE DA GUIA + 30 CM BAS E DA SARJETA) X 22 CM ALTURA ",null,"SINAPI",94267,"UNIDADE: ","M"]
[17]
[17,"TIPO ITEM","CODIGO ITEM","DESCRIÇÃO ITEM","UNIDADE ITEM","COEFICIENTE","PRECO UNITARIO","CUSTO TOTAL"]
[17,"INSUMO","370","AREIA MEDIA - POSTO JAZIDA/FORNECEDOR (RETIRADO NA JAZIDA, SEM TRANSPORTE)","M3","0,0150000","97,50",1.46,{"$f":"VLOOKUP(A263,ORÇAMENTO!A$10:F$40,6)","v":4600},{"$f":"H263*I263","v":6716},"M"]
[17,"INSUMO","34492","CONCRETO USINADO BOMBEAVEL, CLASSE DE RESISTENCIA C20, COM BRITA 0 E 1, SLUMP = 100 +/- 20 MM, EXCLUI SERVICO DE BOMBEAMENTO (NBR 8953)","M3","0,0630000","550,00",34.65,{"$f":"VLOOKUP(A264,ORÇAMENTO!A$10:F$40,6)","v":4600},159390,"M",{"$nulls":7},{"$f":"AVERAGE(I264:N264)","v":81995},"(MÉDIA)"]
[17,"COMPOSICAO","88243","AJUDANTE ESPECIALIZADO COM ENCARGOS COMPLEMENTARES","H","0,1090000","21,76",2.37,{"$f":"VLOOKUP(A265,ORÇAMENTO!A$10:F$40,6)","v":4600},10902,"P"]
[17,"COMPOSICAO","88309","PEDREIRO COM ENCARGOS COMPLEMENTARES","H","0,2440000","27,45",6.69,{"$f":"VLOOKUP(A266,ORÇAMENTO!A$10:F$40,6)","v":4600},30774,"P"]
[17,"COMPOSICAO","88316","SERVENTE COM ENCARGOS COMPLEMENTARES","H","0,4870000","19,76",9.6199999999999992,{"$f":"VLOOKUP(A267,ORÇAMENTO!A$10:F$40,6)","v":4600},44252,"P"]
[17,"COMPOSICAO","88631","ARGAMASSA TRAÇO 1:4 (EM VOLUME DE CIMENTO E AREIA MÉDIA ÚMIDA), PREPARO MANUAL. AF_08/2019","M3","0,0030000","575,87",1.72,{"$f":"VLOOKUP(A268,ORÇAMENTO!A$10:F$40,6)","v":4600},7912,"M"]
[17,"COMPOSICAO","92960","MÁQUINA EXTRUSORA DE CONCRETO PARA GUIAS E SARJETAS, MOTOR A DIESEL, POTÊNCIA 14 CV - CHP DIURNO. AF_12/2015","CHP","0,0180000","18,46",0.33,{"$f":"VLOOKUP(A269,ORÇAMENTO!A$10:F$40,6)","v":4600},1518,"E"]
[17,"COMPOSICAO","92961","MÁQUINA EXTRUSORA DE CONCRETO PARA GUIAS E SARJETAS, MOTOR A DIESEL, POTÊNCIA 14 CV - CHI DIURNO. AF_12/2015","CHI","0,0910000","5,38",0.48,{"$f":"VLOOKUP(A270,ORÇAMENTO!A$10:F$40,6)","v":4600},2208,"E"]
[17,"PRODUÇÃO DA EQUIPE",null,null,1,"CUSTO ",null,57.319999999999986]
[17,"TOTAL",{"$nulls":5},57.319999999999986]
[17,"BDI                %",{"$nulls":5},1.2149000000000001]
[17,"TOTAL DO SERVIÇO - R$",{"$nulls":5},69.64]
[17]
[18,"CODEVASF",null,null," COMPOSIÇÃO DE PREÇO UNITÁRIO"]
[{"$f":"A276","v":18},"OBRA:  "," PAVIMENTAÇÃO ASFÁLTICA EM CBUQ - ESTRADA DE ACESSO AOS TÚNIES (SERRA DA SAUDADE / MG) - ITEM 2",null,null,null,"DATA: "," SETEMBRO / 2023   "]
[18,"SERVIÇO:  ","FORNECIMENTO E INSTALAÇÃO DE PLACA DE SINALIZAÇÃO VIÁRIA - REGULAMENTAÇÃO CIRCULAR ",null,"SINAPI","CPU.4","UNIDADE: ","UN."]
[18]
[18,"TIPO ITEM","CODIGO ITEM","DESCRIÇÃO ITEM","UNIDADE ITEM","COEFICIENTE","PRECO UNITARIO","CUSTO TOTAL"]
[18,"COMPOSICAO",94962,"CONCRETO MAGRO PARA LASTRO, TRAÇO 1:4,5:4,5 (EM MASSA SECA DE CIMENTO/ AREIA / BRITA 1)","M3",2.4E-2,402.82,9.66,{"$f":"VLOOKUP(A281,ORÇAMENTO!A$10:F$40,6)","v":12},115.92,"M"]
[18,"COMPOSICAO",93358,"ESCAVAÇÃO MANUAL DE VALA COM PROFUNDIDADE MENOR OU IGUAL A 1,30 M","M3",2.4E-2,78.17,1.87,{"$f":"VLOOKUP(A282,ORÇAMENTO!A$10:F$40,6)","v":12},22.44,"P"]
[18,"COMPOSICAO",88309,"PEDREIRO COM ENCARGOS COMPLEMENTARES","H",0.2,27.45,5.49,{"$f":"VLOOKUP(A283,ORÇAMENTO!A$10:F$40,6)","v":12},65.88,"P"]
[18,"COMPOSICAO",88316,"SERVENTE COM ENCARGOS COMPLEMENTARES","H",1,19.760000000000002,19.760000000000002,{"$f":"VLOOKUP(A284,ORÇAMENTO!A$10:F$40,6)","v":12},237.12,"P"]
[18,"COMPOSICAO",103670,"LANÇAMENTO COM USO DE BALDES, ADENSAMENTO E ACABAMENTO DE CONCRETO EM ESTRUTURAS","M3",2.4E-2,281.77999999999997,6.76,{"$f":"VLOOKUP(A285,ORÇAMENTO!A$10:F$40,6)","v":12},81.12,"P"]
[18,"INSUMO",34723,"PLACA DE SINALIZACAO EM CHAPA DE ACO NUM 16 COM PINTURA REFLETIVA (CIRCULAR - D=50CM) ","M2",0.19625000000000001,577.5,113.33,{"$f":"VLOOKUP(A286,ORÇAMENTO!A$10:F$40,6)","v":12},1359.96,"M"]
[18,"INSUMO",21013,"TUBO AÇO GALVANIZADO COM COSTURA, CLASSE LEVE, DN 50 MM ( 2\")E = 3,00 MM, *4,40* KG/M ","M",3.5,75.98,265.93,{"$f":"VLOOKUP(A287,ORÇAMENTO!A$10:F$40,6)","v":12},3191.16,"M"]
[18,"PRODUÇÃO DA EQUIPE",null,null,1,"CUSTO ",null,422.8]
[18,"TOTAL",{"$nulls":5},422.8]
[18,"BDI                %",{"$nulls":5},1.2149000000000001]
[18,"TOTAL DO SERVIÇO - R$",{"$nulls":5},513.66]
[18]
[19,"CODEVASF",null,null," COMPOSIÇÃO DE PREÇO UNITÁRIO"]
[{"$f":"A293","v":19},"OBRA:  "," PAVIMENTAÇÃO ASFÁLTICA EM CBUQ - ESTRADA DE ACESSO AOS TÚNIES (SERRA DA SAUDADE / MG) - ITEM 2",null,null,null,"DATA: "," SETEMBRO / 2023   "]
[19,"SERVIÇO:  ","FORNECIMENTO E INSTALAÇÃO DE PLACA DE SINALIZAÇÃO VIÁRIA - REGULAMENTAÇÃO (PARE)",null,"SINAPI","CPU.5","UNIDADE: ","UN."]
[19]
[19,"TIPO ITEM","CODIGO ITEM","DESCRIÇÃO ITEM","UNIDADE ITEM","COEFICIENTE","PRECO UNITARIO","CUSTO TOTAL"]
[19,"COMPOSICAO",94962,"CONCRETO MAGRO PARA LASTRO, TRAÇO 1:4,5:4,5 (EM MASSA SECA DE CIMENTO/ AREIA/ BRITA 1)","M3",2.4E-2,402.82,9.66,{"$f":"VLOOKUP(A298,ORÇAMENTO!A$10:F$40,6)","v":24},231.84,"M"]
[19,"COMPOSICAO",93358,"ESCAVAÇÃO MANUAL DE VALA COM PROFUNDIDADE MENOR OU IGUAL A 1,30 M","M3",2.4E-2,78.17,1.87,{"$f":"VLOOKUP(A299,ORÇAMENTO!A$10:F$40,6)","v":24},44.88,"P"]
[19,"COMPOSICAO",88309,"PEDREIRO COM ENCARGOS COMPLEMENTARES","H",0.2,27.45,5.49,{"$f":"VLOOKUP(A300,ORÇAMENTO!A$10:F$40,6)","v":24},131.76,"P"]
[19,"COMPOSICAO",88316,"SERVENTE COM ENCARGOS COMPLEMENTARES","H",1,19.760000000000002,19.760000000000002,{"$f":"VLOOKUP(A301,ORÇAMENTO!A$10:F$40,6)","v":24},474.24,"P"]
[19,"COMPOSICAO",103670,"LANÇAMENTO COM USO DE BALDES, ADENSAMENTO E ACABAMENTO DE CONCRETO EM ESTRUTURAS","M3",2.4E-2,281.77999999999997,6.76,{"$f":"VLOOKUP(A302,ORÇAMENTO!A$10:F$40,6)","v":24},162.24,"P"]
[19,"INSUMO",34723,"PLACA DE SINALIZACAO EM CHAPA DE ACO NUM 16 COM PINTURA REFLETIVA ","M2",0.3,577.5,173.25,{"$f":"VLOOKUP(A303,ORÇAMENTO!A$10:F$40,6)","v":24},4158,"M"]
[19,"INSUMO",21013,"TUBO AÇO GALVANIZADO COM COSTURA, CLASSE LEVE, DN 50 MM ( 2\")E = 3,00 MM, *4,40* KG/M","M",3.5,75.98,265.93,{"$f":"VLOOKUP(A304,ORÇAMENTO!A$10:F$40,6)","v":24},6382.32,"M"]
[19,"PRODUÇÃO DA EQUIPE",null,null,1,"CUSTO ",null,482.72]
[19,"TOTAL",{"$nulls":5},482.72]
[19,"BDI                %",{"$nulls":5},1.2149000000000001]
[19,"TOTAL DO SERVIÇO - R$",{"$nulls":5},586.46]
[19]
[20,"CODEVASF",null,null," COMPOSIÇÃO DE PREÇO UNITÁRIO"]
[{"$f":"A310","v":20},"OBRA:  "," PAVIMENTAÇÃO ASFÁLTICA EM CBUQ - ESTRADA DE ACESSO AOS TÚNIES (SERRA DA SAUDADE / MG) - ITEM 2",null,null,null,"DATA: "," SETEMBRO / 2023   "]
[20,"SERVIÇO:  ","FORNECIMENTO E INSTALAÇÃO DE PLACA DE AÇO PARA IDENTIFICACAO DE RUA, *45 CM X 20* CM, INCLUSIVE SUPORTE EM TUBO DE AÇO GALVANIZADO (02 PLACAS POR SUPORTE)                                  ",null,"SINAPI","CPU.6","UNIDADE: ","UN."]
[20]
[20,"TIPO ITEM","CODIGO ITEM","DESCRIÇÃO ITEM","UNIDADE ITEM","COEFICIENTE","PRECO UNITARIO","CUSTO TOTAL"]
[20,"COMPOSICAO",94962,"CONCRETO MAGRO PARA LASTRO, TRAÇO 1:4,5:4,5 (EM MASSA SECA DE CIMENTO/ AREIA/ BRITA 1)","M3",2.4E-2,402.82,9.66,{"$f":"VLOOKUP(A315,ORÇAMENTO!A$10:F$40,6)","v":40},386.4,"E"]
[20,"COMPOSICAO",93358,"ESCAVAÇÃO MANUAL DE VALA COM PROFUNDIDADE MENOR OU IGUAL A 1,30 M","M3",2.4E-2,78.17,1.87,{"$f":"VLOOKUP(A316,ORÇAMENTO!A$10:F$40,6)","v":40},74.800000000000011,"E"]
[20,"COMPOSICAO",88309,"PEDREIRO COM ENCARGOS COMPLEMENTARES","H",0.2,27.45,5.49,{"$f":"VLOOKUP(A317,ORÇAMENTO!A$10:F$40,6)","v":40},219.60000000000002,"E"]
[20,"COMPOSICAO",88316,"SERVENTE COM ENCARGOS COMPLEMENTARES","H",1,19.760000000000002,19.760000000000002,{"$f":"VLOOKUP(A318,ORÇAMENTO!A$10:F$40,6)","v":40},790.40000000000009,"E"]
[20,"COMPOSICAO",103670,"LANÇAMENTO COM USO DE BALDES, ADENSAMENTO E ACABAMENTO DE CONCRETO EM ESTRUTURAS","M3",2.4E-2,281.77999999999997,6.76,{"$f":"VLOOKUP(A319,ORÇAMENTO!A$10:F$40,6)","v":40},270.39999999999998,"E"]
[20,"INSUMO",34723,"PLACA DE SINALIZACAO EM CHAPA DE ACO NUM 16 COM PINTURA REFLETIVA (CIRCULAR - D=50CM) ","M2",0.18000000000000002,577.5,103.95,{"$f":"VLOOKUP(A320,ORÇAMENTO!A$10:F$40,6)","v":40},4158,"E"]
[20,"INSUMO",21012,"TUBO AÇO GALVANIZADO COM COSTURA, CLASSE LEVE, DN 40 MM (1.1/2\")E = 3,00 MM, *3,48* KG/M","M",3,75.98,227.94,{"$f":"VLOOKUP(A321,ORÇAMENTO!A$10:F$40,6)","v":40},9117.6,"E"]
[20,"PRODUÇÃO DA EQUIPE",null,null,1,"CUSTO ",null,375.43]
[20,"TOTAL",{"$nulls":5},375.43]
[20,"BDI                %",{"$nulls":5},1.2149000000000001]
[20,"TOTAL DO SERVIÇO - R$",{"$nulls":5},456.11]
[20]
[21,"CODEVASF",null,null," COMPOSIÇÃO DE PREÇO UNITÁRIO"]
[{"$f":"A327","v":21},"OBRA:  "," PAVIMENTAÇÃO ASFÁLTICA EM CBUQ - ESTRADA DE ACESSO AOS TÚNIES (SERRA DA SAUDADE / MG) - ITEM 2",null,null,null,"DATA: "," SETEMBRO / 2023   "]
[21,"SERVIÇO:  ","PINTURA DE EIXO VIÁRIO SOBRE ASFALTO COM TINTA RETRORREFLETIVA A BASE DE RESINA ACRÍLICA COM MICROESFERAS DE VIDRO, APLICAÇÃO MECÂNICA COM DEMARCADORA AUTOPROPELIDA",null,"SINAPI",102512,"UNIDADE: ","M2"]
[21]
[21,"TIPO ITEM","CODIGO ITEM","DESCRIÇÃO ITEM","UNIDADE ITEM","COEFICIENTE","PRECO UNITARIO","CUSTO TOTAL"]
[21,"INSUMO","5318","DILUENTE AGUARRAS","L","0,0020000","25,91",0.05,{"$f":"VLOOKUP(A332,ORÇAMENTO!A$10:F$40,6)","v":9200},{"$f":"H332*I332","v":460},"M"]
[21,"INSUMO","7343","TINTA ACRILICA A BASE DE SOLVENTE, PARA SINALIZACAO HORIZONTAL VIARIA (NBR 11862)","L","0,0430000","17,82",0.76,{"$f":"VLOOKUP(A333,ORÇAMENTO!A$10:F$40,6)","v":9200},6992,"M"]
[21,"INSUMO","44477","MICROESFERAS DE VIDRO PARA SINALIZACAO HORIZONTAL VIARIA, TIPO II-A (DROP-ON)","KG","0,0250000","10,74",0.26,{"$f":"VLOOKUP(A334,ORÇAMENTO!A$10:F$40,6)","v":9200},2392,"M"]
[21,"INSUMO","44478","MICROESFERAS DE VIDRO PARA SINALIZACAO HORIZONTAL VIARIA, TIPO I-B (PREMIX)","KG","0,0110000","10,74",0.11,{"$f":"VLOOKUP(A335,ORÇAMENTO!A$10:F$40,6)","v":9200},1012,"M"]
[21,"COMPOSICAO","88310","PINTOR COM ENCARGOS COMPLEMENTARES","H","0,0340000","28,66",0.97,{"$f":"VLOOKUP(A336,ORÇAMENTO!A$10:F$40,6)","v":9200},8924,"P"]
[21,"COMPOSICAO","88316","SERVENTE COM ENCARGOS COMPLEMENTARES","H","0,0140000","19,76",0.27,{"$f":"VLOOKUP(A337,ORÇAMENTO!A$10:F$40,6)","v":9200},2484,"P"]
[21,"COMPOSICAO","95133","MÁQUINA DEMARCADORA DE FAIXA DE TRÁFEGO À FRIO, AUTOPROPELIDA, POTÊNCIA 38 HP","CHP","0,0003000","186,11",0.05,{"$f":"VLOOKUP(A338,ORÇAMENTO!A$10:F$40,6)","v":9200},460,"E"]
[21,"COMPOSICAO","96159","MÁQUINA DEMARCADORA DE FAIXA DE TRÁFEGO À FRIO, AUTOPROPELIDA, POTÊNCIA 38 HP","CHI","0,0334000","100,90",3.37,{"$f":"VLOOKUP(A339,ORÇAMENTO!A$10:F$40,6)","v":9200},31004,"E"]
[21,"PRODUÇÃO DA EQUIPE",null,null,1,"CUSTO ",null,5.84]
[21,"TOTAL",{"$nulls":5},5.84]
[21,"BDI                %",{"$nulls":5},1.2149000000000001]
[21,"TOTAL DO SERVIÇO - R$",{"$nulls":5},7.1]
[21]
[25,"CODEVASF",null,null," COMPOSIÇÃO DE PREÇO UNITÁRIO"]
[null,"OBRA:  "," PAVIMENTAÇÃO ASFÁLTICA EM CBUQ - ESTRADA DE ACESSO AOS TÚNIES (SERRA DA SAUDADE / MG) - ITEM 2",null,null,null,"DATA: "," SETEMBRO / 2023   "]
[null,"SERVIÇO:  ","AQUISIÇÃO DE EMULSÃO ASFÁLTICA PARA IMPRIMAÇÃO (EAI) - EXCLUSIVE TRANSPORTE",null,"SEINFRA","CPU.7","UNIDADE: ","T"]
[]
[null,"TIPO ITEM","CODIGO ITEM","DESCRIÇÃO ITEM","UNIDADE ITEM","COEFICIENTE","PRECO UNITARIO","CUSTO TOTAL"]
[null,"INSUMO","ANP","EMULSÃO ASFÁLTICA PARA SERVIÇO DE IMPRIMAÇÃO (CUSTO ANP, INCLUINDO ICMS 18%)","T",1,2689.7683034420002,2689.76]
[null,"PRODUÇÃO DA EQUIPE",null,null,1,"CUSTO ",null,2689.76]
[null,"TOTAL",{"$nulls":5},2689.76]
[null,"BDI                %",{"$nulls":5},1.1499999999999999]
[null,"TOTAL DO SERVIÇO - R$",{"$nulls":5},3093.22]
[]
[26,"CODEVASF",null,null," COMPOSIÇÃO DE PREÇO UNITÁRIO"]
[null,"OBRA:  "," PAVIMENTAÇÃO ASFÁLTICA EM CBUQ - ESTRADA DE ACESSO AOS TÚNIES (SERRA DA SAUDADE / MG) - ITEM 2",null,null,null,"DATA: "," SETEMBRO / 2023   "]
[null,"SERVIÇO:  ","AQUISIÇÃO DE EMULSAO ASFALTICA CATIONICA RR-1C - EXCLUSIVE TRANSPORTE",null,"SINAPI","CPU.8","UNIDADE: ","T"]
[]
[null,"TIPO ITEM","CODIGO ITEM","DESCRIÇÃO ITEM","UNIDADE ITEM","COEFICIENTE","PRECO UNITARIO","CUSTO TOTAL"]
[null,"INSUMO","ANP","EMULSÃO ASFÁLTICA CATIÔNICA RR-1C(CUSTO ANP, INCLUINDO ICMS 18%)","T",1,2706.7073279000001,2706.7]
[null,"PRODUÇÃO DA EQUIPE",null,null,1,"CUSTO ",null,2706.7]
[null,"TOTAL",{"$nulls":5},2706.7]
[null,"BDI                %",{"$nulls":5},1.1499999999999999]
[null,"TOTAL DO SERVIÇO - R$",{"$nulls":5},3112.71]
[]
[27,"CODEVASF",null,null," COMPOSIÇÃO DE PREÇO UNITÁRIO"]
[null,"OBRA:  "," PAVIMENTAÇÃO ASFÁLTICA EM CBUQ - ESTRADA DE ACESSO AOS TÚNIES (SERRA DA SAUDADE / MG) - ITEM 2",null,null,null,"DATA: "," SETEMBRO / 2023   "]
[null,"SERVIÇO:  ","AQUISIÇÃO DE CONCRETO BETUMINOSO USINADO A QUENTE (CBUQ) PARA PAVIMENTACAO ASFALTICA, PADRAO DNIT, FAIXA C, COM CAP 50/70 - EXCLUSIVE TRANSPORTE",null,"SINAPI","CPU.9","UNIDADE: ","T"]
[]
[null,"TIPO ITEM","CODIGO ITEM","DESCRIÇÃO ITEM","UNIDADE ITEM","COEFICIENTE","PRECO UNITARIO","CUSTO TOTAL",{"$nulls":4},"MBL ASFALTOS (C.CAJURU=185KM)","MINASFALTO (CONTAGEM=240KM)","PAESAN \n(PATOS=154KM)"]
[null,"INSUMO",1518,"CONCRETO BETUMINOSO USINADO A QUENTE (CBUQ) PARA PAVIMENTACAO ASFALTICA, PADRAO DNIT, FAIXA C, COM CAP 50/70 - AQUISICAO POSTO USINA","T",1,580,580,{"$nulls":4},535,560,620]
[null,"PRODUÇÃO DA EQUIPE",null,null,1,"CUSTO ",null,580,{"$nulls":4},{"$f":"M372+185*$H$244","v":631.20000000000005},{"$f":"N372+240*$H$244","v":684.8},{"$f":"O372+154*$H$244","v":700.08}]
[null,"TOTAL",{"$nulls":5},580]
[null,"BDI                %",{"$nulls":5},1.1499999999999999]
[null,"TOTAL DO SERVIÇO - R$",{"$nulls":5},667]