{"text_format":"2","workbook":"xlsx","n_sheets":5,"sheets":["ORÇAMENTO","CPU","BDI SERV","BDI FORN","CRONOGRAMA"],"not_rendered":{"charts":0,"images":4,"macros":0,"external_links":0,"defined_names":5,"comments":1,"pivot_tables":0},"unopened":[],"bounds":{"document_bytes":16777216,"sheet_cells":100000,"run_cost":"one","rows_first":2000,"rows_last":500,"rows_between":2000,"halvings":0,"cell_chars":16384,"cell_head_chars":4096},"cells_cut":0,"cells_raw":0,"read":"whole","date_system":"1900"}

{"sheet":"ORÇAMENTO","index":0,"n_rows":37,"n_cols":13,"rows_kept":37,"cut":false,"hidden":false,"merged":[[6,6,6,7],[36,1,36,2],[0,0,7,0],[0,2,0,8],[1,2,1,8],[2,2,2,8],[4,2,4,8],[5,6,5,7],[6,1,6,2]]}
["<---- NUMERAR SERVIÇOS PARA CPU",null,"Ministério da Integração e do Desenvolvimento Regional - MIDR"]
[null,null,"Companhia de Desenvolvimento dos Vales do São Francisco e do Parnaíba"]
[null,null,"1ª Superintendência Regional"]
[]
[null,"OBRA: "," PAVIMENTAÇÃO ASFÁLTICA EM PMF - DISTRITO DE SÃO PEDRO DO PASSA TRÊS (BURITIS-MG)"]
[null,"DATA:"," SETEMBRO DE 2023",null,null,null,"BDI Serviços:",null,{"$f":"'BDI SERV'!D31/100","v":0.2238}]
[null,"PRAZO DE EXECUÇÃO:     150 DIAS",{"$nulls":4},"BDI Serviços:",null,{"$f":"'BDI FORN'!D31/100","v":0.15},null,null,null,"."]
[null,"ITEM","DISCRIMINAÇÃO","REFER.","UNID.","QUANT.","P. UNITÁRIO","P.UNIT.C/ BDI","P. TOTAL"]
["A",1,"SERVIÇOS PRELIMINARES ",{"$nulls":5},{"$f":"SUM(I10:I14)","v":171375.41}]
[1,"1.1","MOBILIZAÇÃO E DESMOBILIZAÇÃO","CPU.1","GL",1,{"$f":"VLOOKUP(A10,CPU!$A$1:$N$4665,9)","v":17725.32},{"$f":"VLOOKUP(A10,CPU!$A$1:$N$4665,10)","v":21692.246616},{"$f":"ROUND(F10*H10,2)","v":21692.25}]
[2,"1.2","ADMINISTRAÇÃO LOCAL","CPU.2","GL",1,{"$f":"VLOOKUP(A11,CPU!$A$1:$N$4665,9)","v":104340.89999999998},{"$f":"VLOOKUP(A11,CPU!$A$1:$N$4665,10)","v":127692.39341999998},{"$f":"ROUND(F11*H11,2)","v":127692.39}]
[3,"1.3","CANTEIRO DE OBRAS","CPU.3","GL",1,{"$f":"VLOOKUP(A12,CPU!$A$1:$N$4665,9)","v":11337.75},{"$f":"VLOOKUP(A12,CPU!$A$1:$N$4665,10)","v":13875.13845},{"$f":"ROUND(F12*H12,2)","v":13875.14}]
[4,"1.4","PLACA DE OBRA EM CHAPA DE AÇO GALVANIZADO","74209/001","M2",3,{"$f":"VLOOKUP(A13,CPU!$A$1:$N$4665,9)","v":340.5},{"$f":"VLOOKUP(A13,CPU!$A$1:$N$4665,10)","v":416.70389999999998},{"$f":"ROUND(F13*H13,2)","v":1250.1099999999999}]
[5,"1.5","SERVIÇOS TOPOGRÁFICOS PARA PAVIMENTAÇÃO, INCLUSIVE NOTA DE SERVIÇO, ACOMPANHAMENTO E GREIDE",99064,"M2",17000,{"$f":"VLOOKUP(A14,CPU!$A$1:$N$4665,9)","v":0.32999999999999996},{"$f":"VLOOKUP(A14,CPU!$A$1:$N$4665,10)","v":0.40385399999999994},{"$f":"ROUND(F14*H14,2)","v":6865.52}]
["B",2,"PAVIMENTAÇÃO",{"$nulls":5},{"$f":"SUM(I16:I22)","v":480251.79}]
[6,"2.1","ESCAVAÇÃO HORIZONTAL EM SOLO DE 1A CATEGORIA",101116,"M3",5100,{"$f":"VLOOKUP(A16,CPU!$A$1:$N$4665,9)","v":2.2000000000000002},{"$f":"VLOOKUP(A16,CPU!$A$1:$N$4665,10)","v":2.6923600000000003},{"$f":"ROUND(F16*H16,2)","v":13731.04}]
[7,"2.2","CARGA, MANOBRA E DESCARGA DE SOLOS E MATERIAIS GRANULARES EM CAMINHÃO BASCULANTE - DESCARGA LIVRE",100976,"M3",5100,{"$f":"VLOOKUP(A17,CPU!$A$1:$N$4665,9)","v":5.22},{"$f":"VLOOKUP(A17,CPU!$A$1:$N$4665,10)","v":6.388236},{"$f":"ROUND(F17*H17,2)","v":32580}]
[8,"2.3","REGULARIZAÇÃO E COMPACTAÇÃO DE SUBLEITO",100576,"M2",17000,{"$f":"VLOOKUP(A18,CPU!$A$1:$N$4665,9)","v":2.57},{"$f":"VLOOKUP(A18,CPU!$A$1:$N$4665,10)","v":3.1451659999999997},53467.82]
[9,"2.4","EXECUÇÃO E COMPACTAÇÃO DE BASE E OU SUB BASE PARA PAVIMENTAÇÃO DE SOLOS DE COMPORTAMENTO LATERÍTICO - EXCLUSIVE SOLO, ESCAVAÇÃO, CARGA E TRANSPORTE",96388,"M3",2550,{"$f":"VLOOKUP(A19,CPU!$A$1:$N$4665,9)","v":12.469999999999999},{"$f":"VLOOKUP(A19,CPU!$A$1:$N$4665,10)","v":15.260785999999998},38915]
[10,"2.5","IMPRIMAÇÃO COM EMULSÃO ASFÁLTICA (EAI)",96401,"M2",17000,{"$f":"VLOOKUP(A20,CPU!$A$1:$N$4665,9)","v":1.23},{"$f":"VLOOKUP(A20,CPU!$A$1:$N$4665,10)","v":1.505274},25589.66]
[11,"2.6","PINTURA DE LIGAÇÃO COM EMULSÃO ASFÁLTICA RR-1C",96402,"M2",16400,{"$f":"VLOOKUP(A21,CPU!$A$1:$N$4665,9)","v":1.01},{"$f":"VLOOKUP(A21,CPU!$A$1:$N$4665,10)","v":1.236038},20271.02]
[12,"2.7","EXECUÇÃO DE PAVIMENTO COM APLICAÇÃO DE PRÉ-MISTURADO A FRIO, CAMADA DE ROLAMENTO - EXCLUSIVE TRANSPORTE",100624,"M3",580,{"$f":"VLOOKUP(A22,CPU!$A$1:$N$4665,9)","v":416.59},{"$f":"VLOOKUP(A22,CPU!$A$1:$N$4665,10)","v":509.82284199999998},295697.25]
["C",3,"TRANSPORTE DE MATERIAIS",{"$nulls":5},{"$f":"SUM(I24:I25)","v":124215.7}]
[13,"3.1","TRANSPORTE COM CAMINHÃO BASCULANTE, EM VIA URBANA EM REVESTIMENTO PRIMÁRIO",95426,"M3XKM",31999.996319999998,{"$f":"VLOOKUP(A24,CPU!$A$1:$N$4665,9,0)","v":1.94},{"$f":"VLOOKUP(A24,CPU!$A$1:$N$4665,10)","v":2.3741719999999997},{"$f":"ROUND(F24*H24,2)","v":75973.5}]
[14,"3.2","TRANSPORTE COM CAMINHÃO BASCULANTE, EM VIA URBANA PAVIMENTADA",95427,"M3XKM",54000.001712000005,{"$f":"VLOOKUP(A25,CPU!$A$1:$N$4665,9,0)","v":0.73},{"$f":"VLOOKUP(A25,CPU!$A$1:$N$4665,10,0)","v":0.893374},{"$f":"ROUND(F25*H25,2)","v":48242.2}]
["E",4,"OBRAS COMPLEMENTARES",{"$nulls":5},{"$f":"SUM(I27:I29)","v":343772.73}]
[15,"4.1","GUIA (MEIO-FIO) E SARJETA CONJUGADOS DE CONCRETO, MOLDADA  IN LOCO  EM TRECHO RETO COM EXTRUSORA, 45 CM BASE (15 CM BASE DA GUIA + SARJETA (30 X 0,07))X 22 CM ALTURA",94267,"M",4100,{"$f":"VLOOKUP(A27,CPU!$A$1:$N$4665,9,0)","v":57.319999999999986},{"$f":"VLOOKUP(A27,CPU!$A$1:$N$4665,10,0)","v":70.148215999999977},{"$f":"ROUND(F27*H27,2)","v":287607.69}]
[16,"4.2","PLACA DE REGULAMENTAÇÃO EM AÇO, PELÍCULA RETRORREFLETIVA TIPO I+SI, INCLUSIVE SUPORTE METÁLICO - FORNECIMENTO E IMPLANTAÇÃO","CPU.4","UNID",27,{"$f":"VLOOKUP(A28,CPU!$A$1:$N$4665,9,0)","v":444.73},{"$f":"VLOOKUP(A28,CPU!$A$1:$N$4665,10,0)","v":544.26057400000002},{"$f":"ROUND(F28*H28,2)","v":14695.04}]
[17,"4.3","PINTURA DE EIXO VIÁRIO SOBRE ASFALTO COM TINTA RETRORREFLETIVA A BASE DE RESINA ACRÍLICA COM MICROESFERAS DE VIDRO, APLICAÇÃO MECÂNICA COM DEMARCADORA AUTOPROPELIDA - ESPESSURA DE 0,10 MM",102512,"M",5800,{"$f":"VLOOKUP(A29,CPU!$A$1:$N$4665,9,0)","v":5.84},{"$f":"VLOOKUP(A29,CPU!$A$1:$N$4665,10,0)","v":7.15},{"$f":"ROUND(F29*H29,2)","v":41470}]
["F",5,"TRANSPORTE DE MATERIAL ASFÁLTICO (BDI DIFERENCIADO)",{"$nulls":5},{"$f":"SUM(I31:I32)","v":71116}]
[18,"5.1","TRANSPORTE COM CAMINHÃO TANQUE DE TRANSPORTE DE MATERIAL ASFÁLTICO DE 30000 L, EM VIA URBANA PAVIMENTADA",102331,"TXKM",112000.00000000001,{"$f":"VLOOKUP(A31,CPU!$A$1:$N$4665,9,0)","v":0.52},{"$f":"VLOOKUP(A31,CPU!$A$1:$N$4665,10,0)","v":0.59799999999999998},{"$f":"ROUND(F31*H31,2)","v":66976}]
[19,"5.2","TRANSPORTE COM CAMINHÃO BASCULANTE, EM VIA URBANA PAVIMENTADA - MASSA ASFÁLTICA (PMF)",95430,"TXKM",8000,{"$f":"VLOOKUP(A32,CPU!$A$1:$N$4665,9,0)","v":0.44999999999999996},{"$f":"VLOOKUP(A32,CPU!$A$1:$N$4665,10,0)","v":0.51749999999999996},{"$f":"ROUND(F32*H32,2)","v":4140}]
["G",6,"FORNECIMENTOS - MATERIAL ASFÁLTICO (BDI DIFERENCIADO)",{"$nulls":5},{"$f":"SUM(I34:I36)","v":504892.48}]
[20,"6.1","AQUISIÇÃO DE EMULSÃO ASFÁLTICA PARA IMPRIMAÇÃO (EAI) - EXCLUSIVE TRANSPORTE","CPU.5","T",24,{"$f":"VLOOKUP(A34,CPU!$A$1:$N$4665,9,0)","v":2812.65},{"$f":"VLOOKUP(A34,CPU!$A$1:$N$4665,10,0)","v":3234.5474999999997},{"$f":"ROUND(F34*H34,2)","v":77629.14}]
[21,"6.2","AQUISIÇÃO DE EMULSAO ASFALTICA CATIONICA RR-1C - EXCLUSIVE TRANSPORTE","CPU.6","T",8,{"$f":"VLOOKUP(A35,CPU!$A$1:$N$4665,9,0)","v":2736.39},{"$f":"VLOOKUP(A35,CPU!$A$1:$N$4665,10,0)","v":3146.8484999999996},{"$f":"ROUND(F35*H35,2)","v":25174.79}]
[22,"6.3","AQUISIÇÃO DE EMULSAO ASFALTICA CATIONICA RL-1C  - EXCLUSIVE TRANSPORTE","CPU.7","T",110.004,{"$f":"VLOOKUP(A36,CPU!$A$1:$N$4665,9,0)","v":3178.45},{"$f":"VLOOKUP(A36,CPU!$A$1:$N$4665,10,0)","v":3655.2174999999993},{"$f":"ROUND(F36*H36,2)","v":402088.55}]
[null,"TOTAL GERAL DA OBRA COM BDI ",{"$nulls":6},{"$f":"SUM(I9,I15,I23,I26,I30,I33)","v":1695624.1099999999}]

{"sheet":"CPU","index":1,"n_rows":362,"n_cols":13,"rows_kept":362,"cut":false,"hidden":false,"merged":[[289,2,289,5],[290,2,290,3],[291,1,291,7],[301,1,301,3],[301,5,301,6],[302,1,302,6],[303,1,303,6],[271,0,287,0],[288,0,305,0],[348,1,348,6],[349,1,349,6],[350,1,350,6],[330,1,330,3],[330,4,330,7],[331,2,331,5],[332,2,332,3],[333,1,333,7],[336,1,336,3],[336,5,336,6],[337,1,337,6],[338,1,338,6],[339,1,339,6],[306,0,316,0],[318,0,328,0],[318,1,318,3],[318,4,318,7],[319,2,319,5],[320,2,320,3],[321,1,321,7],[325,1,325,3],[288,1,288,3],[330,0,339,0],[341,0,350,0],[341,1,341,3],[341,4,341,7],[342,2,342,5],[343,2,343,3],[344,1,344,7],[347,1,347,3],[347,5,347,6],[352,0,361,0],[352,1,352,3],[352,4,352,7],[353,2,353,5],[354,2,354,3],[355,1,355,7],[358,1,358,3],[358,5,358,6],[359,1,359,6],[360,1,360,6],[361,1,361,6],[49,2,49,3],[253,0,269,0],[255,2,255,3],[256,1,256,7],[266,1,266,3],[266,5,266,6],[267,1,267,6],[268,1,268,6],[254,2,254,5],[228,1,228,3],[228,4,228,7],[241,0,251,0],[241,1,241,3],[241,4,241,7],[242,2,242,5],[243,2,243,3],[244,1,244,7],[251,1,251,6],[238,1,238,6],[228,0,239,0],[0,0,13,0],[14,0,32,0],[33,0,46,0],[47,0,63,0],[64,0,79,0],[80,0,92,0],[107,0,124,0],[145,0,163,0],[164,0,182,0],[93,0,105,0],[125,0,143,0],[167,1,167,7],[201,1,201,6],[183,1,183,3],[109,2,109,3],[110,1,110,7],[120,1,120,3],[120,5,120,6],[183,0,203,0],[184,2,184,5],[185,2,185,3],[186,1,186,7],[178,1,178,3],[178,5,178,6],[179,1,179,6],[180,1,180,6],[181,1,181,6],[166,2,166,3],[126,2,126,5],[127,2,127,3],[128,1,128,7],[140,1,140,3],[140,5,140,6],[141,1,141,6],[142,1,142,6],[165,2,165,5],[164,10,164,11],[121,1,121,6],[122,1,122,6],[123,1,123,6],[145,1,145,3],[145,4,145,7],[145,10,145,11],[146,2,146,5],[147,2,147,3],[148,1,148,7],[159,1,159,3],[159,5,159,6],[160,1,160,6],[161,1,161,6],[162,1,162,6],[164,1,164,3],[164,4,164,7],[143,1,143,6],[125,1,125,3],[125,4,125,7],[107,10,107,11],[108,2,108,5],[107,1,107,3],[107,4,107,7],[66,2,66,3],[67,1,67,7],[75,1,75,3],[75,5,75,6],[76,1,76,6],[77,1,77,6],[78,1,78,6],[80,10,80,11],[81,2,81,5],[80,1,80,3],[80,4,80,7],[82,2,82,3],[83,1,83,7],[88,1,88,3],[88,5,88,6],[89,1,89,6],[90,1,90,6],[91,1,91,6],[50,1,50,7],[59,1,59,3],[59,5,59,6],[60,1,60,6],[61,1,61,6],[62,1,62,6],[64,10,64,11],[65,2,65,5],[64,1,64,3],[64,4,64,7],[0,1,0,3],[0,4,0,7],[0,10,0,11],[1,2,1,5],[2,2,2,3],[3,1,3,7],[9,1,9,3],[9,5,9,6],[10,1,10,6],[1,10,1,11],[11,1,11,6],[12,1,12,6],[14,1,14,3],[14,4,14,7],[14,10,14,11],[15,2,15,5],[16,2,16,3],[17,1,17,7],[28,1,28,3],[28,5,28,6],[15,8,16,9],[33,10,33,11],[34,2,34,5],[35,2,35,3],[36,1,36,7],[34,8,35,9],[42,1,42,3],[42,5,42,6],[43,1,43,6],[44,1,44,6],[47,10,47,11],[48,2,48,5],[248,1,248,3],[248,5,248,6],[249,1,249,6],[250,1,250,6],[29,1,29,6],[30,1,30,6],[31,1,31,6],[105,1,105,6],[93,1,93,3],[93,4,93,7],[94,2,94,5],[95,2,95,3],[96,1,96,7],[102,1,102,3],[102,5,102,6],[103,1,103,6],[104,1,104,6],[33,1,33,3],[33,4,33,7],[45,1,45,6],[47,1,47,3],[47,4,47,7],[325,5,325,6],[326,1,326,6],[327,1,327,6],[328,1,328,6],[306,1,306,3],[307,2,307,5],[308,2,308,3],[309,1,309,7],[313,1,313,3],[313,5,313,6],[306,4,306,7],[315,1,315,6],[316,1,316,6],[314,1,314,6],[253,10,253,11],[253,1,253,3],[253,4,253,7],[269,1,269,6],[239,1,239,6],[202,1,202,6],[203,1,203,6],[236,1,236,3],[236,5,236,6],[237,1,237,6],[286,1,286,6],[271,1,271,3],[225,1,225,3],[271,4,271,7],[272,2,272,5],[205,1,205,3],[205,4,205,7],[206,2,206,5],[207,2,207,3],[208,1,208,7],[304,1,304,6],[288,4,288,7],[273,2,273,3],[274,1,274,7],[283,1,283,3],[283,5,283,6],[284,1,284,6],[285,1,285,6],[183,10,183,11],[225,5,225,6],[226,1,226,6],[200,1,200,3],[200,5,200,6],[183,4,183,7],[188,8,188,9],[228,10,228,11],[229,2,229,5],[230,2,230,3],[231,1,231,7]]}
[1,"CODEVASF",null,null," COMPOSIÇÃO DE PREÇO UNITÁRIO",null,null,null,{"$f":"H11","v":17725.32},{"$f":"H13","v":21692.246616},"BDI CALCULADO:",null,{"$f":"ORÇAMENTO!I6","v":0.2238}]
[null,"OBRA:  ",{"$f":"ORÇAMENTO!C5","v":" PAVIMENTAÇÃO ASFÁLTICA EM PMF - DISTRITO DE SÃO PEDRO DO PASSA TRÊS (BURITIS-MG)"},null,null,null,"DATA: ",{"$f":"ORÇAMENTO!C6","v":" SETEMBRO DE 2023"},null,null,"BDI DIFERENCIADO:",null,{"$f":"'BDI FORN'!D31/100","v":0.15}]
[null,"SERVIÇO:  ",{"$f":"VLOOKUP(A1,ORÇAMENTO!A10:I27,3)","v":"MOBILIZAÇÃO E DESMOBILIZAÇÃO"},null,"Referência:",{"$f":"VLOOKUP(A1,ORÇAMENTO!A10:I27,4)","v":"CPU.1"},"UNIDADE: ",{"$f":"VLOOKUP(A1,ORÇAMENTO!A10:I27,5)","v":"GL"}]
[]
[null,"TIPO ITEM","CODIGO ITEM","DESCRIÇÃO ITEM","UNIDADE ITEM","COEFICIENTE","PRECO UNITARIO","CUSTO TOTAL"]
[null,"COMPOSICAO",89876,"CAMINHÃO BASCULANTE 14 M3, COM CAVALO MECÂNICO DE CAPACIDADE MÁXIMA DE TRAÇÃO COMBINADO DE 36000 KG, POTÊNCIA 286 CV, INCLUSIVE SEMIREBOQUE COM CAÇAMBA METÁLICA","CHP DIURNO.",16,316.13,{"$f":"ROUNDDOWN(F6*G6,2)","v":5058.08}]
[null,"COMPOSICAO",89877,"CAMINHÃO BASCULANTE 14 M3, COM CAVALO MECÂNICO DE CAPACIDADE MÁXIMA DE TRAÇÃO COMBINADO DE 36000 KG, POTÊNCIA 286 CV, INCLUSIVE SEMIREBOQUE COM CAÇAMBA METÁLICA","CHI DIURNO.",16,89.75,{"$f":"ROUNDDOWN(F7*G7,2)","v":1436}]
[null,"COMPOSICAO",5914640,"TRANSPORTE COM CAVALO MECÂNICO COM SEMIRREBOQUE COM CAPACIDADE DE 30 T - RODOVIA PAVIMENTADA","T.KM",18274,0.57999999999999996,{"$f":"ROUNDDOWN(F8*G8,2)","v":10598.92}]
[null,"COMPOSIÇÃO",88316,"SERVENTE COM ENCARGOS COMPLEMENTARES","H",32,19.760000000000002,{"$f":"ROUNDDOWN(F9*G9,2)","v":632.32000000000005}]
[null,"PRODUÇÃO DA EQUIPE",null,null,1,"CUSTO ",null,{"$f":"SUM(H6:H9)","v":17725.32}]
[null,"TOTAL",{"$nulls":5},{"$f":"H10/E10","v":17725.32}]
[null,"BDI                %",{"$nulls":5},{"$f":"1+$M$1","v":1.2238}]
[null,"TOTAL DO SERVIÇO - R$",{"$nulls":5},{"$f":"H11*H12","v":21692.246616}]
[]
[{"$f":"A1+1","v":2},"CODEVASF",null,null," COMPOSIÇÃO DE PREÇO UNITÁRIO",null,null,null,{"$f":"H30","v":104340.89999999998},{"$f":"H32","v":127692.39341999998}]
[null,"OBRA:  ",{"$f":"$C$2","v":" PAVIMENTAÇÃO ASFÁLTICA EM PMF - DISTRITO DE SÃO PEDRO DO PASSA TRÊS (BURITIS-MG)"},null,null,null,"DATA: ",{"$f":"$H$2","v":" SETEMBRO DE 2023"}]
[null,"SERVIÇO:  ",{"$f":"VLOOKUP(A15,ORÇAMENTO!$A$10:$I$27,3)","v":"ADMINISTRAÇÃO LOCAL"},null,"SINAPI","CPU","UNIDADE: ",{"$f":"VLOOKUP(A15,ORÇAMENTO!$A$10:$I$27,5)","v":"GL"}]
[]
[null,"TIPO ITEM","CODIGO ITEM","DESCRIÇÃO ITEM","UNIDADE ITEM","COEFICIENTE","PRECO UNITARIO","CUSTO TOTAL"]
[null,"INSUMO",14250,"ENERGIA ELÉTRICA","kwh",60,0.94,{"$f":"ROUNDDOWN(F20*G20,2)","v":56.4}]
[null,"INSUMO",44480,"TARIFA \"A\" - ÁGUA/ESGOTO ","m³",6,17.78,106.68]
[null,"COTAÇÃO","MERC.","TELEFONE (PLANO CONTROLE)","UNID",2,59.9,119.8]
[null,"INSUMO","ED-50155 SEINFRA","BANHEIRO QUÍMICO 110 X 120 X 230 CM COM MANUTENÇÃO (CONSIDERANDO OBRAS SIMULTÂNEAS)","MÊS",2,820,1640]
[null,"COMPOSICAO",90777,"Engenheiro Civil Júnior com encargos complementares","H",55,114.12,6276.6]
[null,"COMPOSICAO",90776,"Encarregado Geral com encargos complementares","H",110,57.73,6350.3]
[null,"COMPOSICAO",88321,"Tecnico de Laboratório com encargos complementares","H",55,45.45,2499.75]
[null,"COMPOSICAO",100309,"Tecnico em Segurança do Trabalho com encargos complementares","H",55,45.71,2514.0500000000002]
[null,"COMPOSICAO",90772,"Auxiliar de escritório com encargos complementares","H",55,23.72,1304.5999999999999]
[null,"PRODUÇÃO DA EQUIPE",null,null,0.2,"CUSTO ",null,{"$f":"SUM(H20:H28)","v":20868.179999999997}]
[null,"TOTAL",{"$nulls":5},{"$f":"H29/E29","v":104340.89999999998}]
[null,"BDI                %",{"$nulls":5},{"$f":"1+$M$1","v":1.2238}]
[null,"TOTAL DO SERVIÇO - R$",{"$nulls":5},{"$f":"H30*H31","v":127692.39341999998}]
[]
[{"$f":"A15+1","v":3},"CODEVASF",null,null," COMPOSIÇÃO DE PREÇO UNITÁRIO",null,null,null,{"$f":"H44","v":11337.75},{"$f":"H46","v":13875.13845}]
[null,"OBRA:  ",{"$f":"$C$2","v":" PAVIMENTAÇÃO ASFÁLTICA EM PMF - DISTRITO DE SÃO PEDRO DO PASSA TRÊS (BURITIS-MG)"},null,null,null,"DATA: ",{"$f":"$H$2","v":" SETEMBRO DE 2023"}]
[null,"SERVIÇO:  ",{"$f":"VLOOKUP(A34,ORÇAMENTO!$A$10:$I$27,3)","v":"CANTEIRO DE OBRAS"},null,"SINAPI",{"$f":"VLOOKUP(A34,ORÇAMENTO!$A$10:$I$27,4)","v":"CPU.3"},"UNIDADE: ",{"$f":"VLOOKUP(A34,ORÇAMENTO!$A$10:$I$27,5)","v":"GL"}]
[]
[null,"TIPO ITEM","CODIGO ITEM","DESCRIÇÃO ITEM","UNIDADE ITEM","COEFICIENTE","PRECO UNITARIO","CUSTO TOTAL"]
[null,"INSUMO",10775,"ALUGUEL DE IMÓVEL OU CONTEINER QUE ATENDA AOS REQUISITOS MÍNIMOS PARA INSTALAÇÃO DO CANTEIRO DE OBRAS","MÊS",5,975,{"$f":"ROUNDDOWN(F39*G39,2)","v":4875}]
[null,"INSUMO",10779,"LOCACAO DE CONTAINER 2,30 X 4,30 M, ALT. 2,50 M, P/ SANITARIO, C/ 5 BACIAS, 1 LAVATORIO E 4 MICTORIOS","MÊS",5,1218.75,{"$f":"ROUNDDOWN(F40*G40,2)","v":6093.75}]
[null,"INSUMO","37525","TELA PLASTICA TECIDA LISTRADA BRANCA E LARANJA, TIPO GUARDA CORPO, EM POLIETILENO MONOFILADO, ROLO 1,20 X 50 M (L X C)","M",100,3.69,{"$f":"ROUNDDOWN(F41*G41,2)","v":369}]
[{"$nulls":7},{"$f":"ROUNDDOWN(F42*G42,2)","v":0}]
[null,"PRODUÇÃO DA EQUIPE",null,null,1,"CUSTO ",null,{"$f":"SUM(H39:H42)","v":11337.75}]
[null,"TOTAL",{"$nulls":5},{"$f":"H43/E43","v":11337.75}]
[null,"BDI                %",{"$nulls":5},{"$f":"1+$M$1","v":1.2238}]
[null,"TOTAL DO SERVIÇO - R$",{"$nulls":5},{"$f":"H44*H45","v":13875.13845}]
[]
[{"$f":"A34+1","v":4},"CODEVASF",null,null," COMPOSIÇÃO DE PREÇO UNITÁRIO",null,null,null,{"$f":"H61","v":340.5},{"$f":"H63","v":416.70389999999998}]
[null,"OBRA:  ",{"$f":"$C$2","v":" PAVIMENTAÇÃO ASFÁLTICA EM PMF - DISTRITO DE SÃO PEDRO DO PASSA TRÊS (BURITIS-MG)"},null,null,null,"DATA: ",{"$f":"$H$2","v":" SETEMBRO DE 2023"}]
[null,"SERVIÇO:  ",{"$f":"VLOOKUP(A48,ORÇAMENTO!$A$10:$I$27,3)","v":"PLACA DE OBRA EM CHAPA DE AÇO GALVANIZADO"},null,"SINAPI",{"$f":"VLOOKUP(A48,ORÇAMENTO!$A$10:$I$27,4)","v":"74209/001"},"UNIDADE: ",{"$f":"VLOOKUP(A48,ORÇAMENTO!$A$10:$I$27,5)","v":"M2"}]
[]
[null,"TIPO ITEM","CODIGO ITEM","DESCRIÇÃO ITEM","UNIDADE ITEM","COEFICIENTE","PRECO UNITARIO","CUSTO TOTAL"]
[null,"INSUMO","4509","SARRAFO *2,5 X 10* CM EM PINUS, MISTA OU EQUIVALENTE DA REGIAO - BRUTA","M","3,2083000","4,41",{"$f":"ROUNDDOWN(F53*G53,2)","v":14.14}]
[null,"INSUMO","4813","PLACA DE OBRA (PARA CONSTRUCAO CIVIL) EM CHAPA GALVANIZADA *N. 22*, ADESIVADA, DE *2,4 X 1,2* M (SEM POSTES PARA FIXACAO)","M2","1,0000000","250,00",250]
[null,"INSUMO","5065","PREGO DE ACO POLIDO COM CABECA 10 X 10 (7/8 X 17)","KG","0,0113000","36,57",0.41]
[null,"INSUMO","5069","PREGO DE ACO POLIDO COM CABECA 17 X 27 (2 1/2 X 11)","KG","0,0132000","19,59",0.25]
[null,"COMPOSICAO","88262","CARPINTEIRO DE FORMAS COM ENCARGOS COMPLEMENTARES","H","0,3729000","27,05",10.08]
[null,"COMPOSICAO","88316","SERVENTE COM ENCARGOS COMPLEMENTARES","H","1,1186000","19,76",22.1]
[null,"INSUMO",4115,"MADEIRA ROLICA TRATADA, D = 12 A 15 CM, H = 3,00 M, EM EUCALIPTO OU EQUIVALENTE","M",2,21.76,43.52]
[null,"PRODUÇÃO DA EQUIPE",null,null,1,"CUSTO ",null,{"$f":"SUM(H53:H59)","v":340.5}]
{"$rows_left_out":303}
{"sheet":"BDI SERV","index":2,"n_rows":37,"n_cols":5,"rows_kept":37,"cut":false,"hidden":false,"merged":[[36,0,36,5],[3,1,4,1],[3,2,4,2],[0,1,2,4],[32,0,34,5],[28,0,28,5],[30,1,30,2],[31,1,31,2]]}
[null,"DETALHAMENTO DO BDI - SERVIÇOS"]
[]
[]
[null,"Item","Descrição dos Serviços","%","%"]
[null,null,null,"PV","CD"]
[]
[null,1,"ADMINISTRAÇÃO CENTRAL"," ",4.01]
[null,"1.1","ESCRITÓRIO CENTRAL"," "," "]
[null,"1.2","VIAGENS"," "," "]
[null,"1.3","OUTROS"," "," "]
[null," "," "," "," "]
[null,2,"IMPOSTOS E TAXAS",{"$f":"SUM(D13:D16)","v":7.15},{"$f":"SUM(E13:E16)","v":8.94}]
[null,"2.1","ISS (*)",{"$f":"5*0.7","v":3.5},{"$f":"ROUND(D13*1.2515,2)","v":4.38}]
[null,"2.2","PIS",0.65,0.81]
[null,"2.3","Cofins",3,3.75]
[null,"2.4","CONTRIBUIÇÃO PREVIDENCIÁRIA SOBRE A RENDA BRUTA",0,0]
[]
[null,3,"TAXA DE RISCO"," ",{"$f":"SUM(E19:E22)","v":0.82000000000000006}]
[null,"3.1","SEGURO",null,0.16]
[null,"3.2","RISCO",null,0.5]
[null,"3.3","GARANTIA",null,0.16]
[]
[null,4,"DESPESAS FINANCEIRAS"," ",1.02]
[]
[null,5,"LUCRO",null,7.3]
[]
[null," ","BDI - CALCULADO"," ",{"$f":"ROUND((((1+(E7+E18)/100)*(1+E23/100)*(1+E25/100)/(1-D12/100)-1)*100),2)","v":22.38}]
[]
["BDI = ((1+((AC+S+R+G)/100))x(1+DF/100)x(1+L/100)/(1-I/100)-1)*100"]
[]
[null,"BDI (CALCULADO):",null,{"$f":"ROUND((((1+((E7+E18)/100))*(1+E23/100)*(1+E25/100))/(1-D12/100)-1)*100,2)","v":22.38},"%"]
[null," "]
["(*) ISS CONFORME LEI COMPLEMENTAR Nº 006/2003 E LEI COMPLEMENTAR Nº 59/2009 QUE ALTEROU A ALÍQUOTA PARA ITENS 7 A 7.05 (ART. 9º ) - QUANT. ESTIMADA DE MATERIAIS = 30%"]
[]
[]
[]
["BDI EM CONFORMIDADE COM OS ACÓRDÃOS Nº 2369/2011 e ACÓRDÃO Nº 2.622/2013 - TCU - PLENÁRIO"]

{"sheet":"BDI FORN","index":3,"n_rows":37,"n_cols":5,"rows_kept":37,"cut":false,"hidden":false,"merged":[[32,0,34,5],[36,0,36,5],[0,1,2,4],[3,1,4,1],[3,2,4,2],[28,0,28,5],[30,1,30,2],[31,1,31,2]]}
[null,"DETALHAMENTO DO BDI - FORNECIMENTO \n(MATERIAL ASFÁLTICO)"]
[]
[]
[null,"Item","Descrição dos Serviços","%","%"]
[null,null,null,"PV","CD"]
[]
[null,1,"ADMINISTRAÇÃO CENTRAL"," ",3.72]
[null,"1.1","ESCRITÓRIO CENTRAL"," "," "]
[null,"1.2","VIAGENS"," "," "]
[null,"1.3","OUTROS"," "," "]
[null," "," "," "," "]
[null,2,"IMPOSTOS E TAXAS",{"$f":"SUM(D13:D16)","v":3.65},{"$f":"SUM(E13:E16)","v":4.5600000000000005}]
[null,"2.1","ISS (*)",null,{"$f":"ROUND(D13*1.2515,2)","v":0}]
[null,"2.2","PIS",0.65,0.81]
[null,"2.3","Cofins",3,3.75]
[null,"2.4","CONTRIBUIÇÃO PREVIDENCIÁRIA SOBRE A RENDA BRUTA",0,0]
[]
[null,3,"TAXA DE RISCO"," ",{"$f":"SUM(E19:E22)","v":0.92}]
[null,"3.1","SEGURO",null,0.16]
[null,"3.2","RISCO",null,0.6]
[null,"3.3","GARANTIA",null,0.16]
[]
[null,4,"DESPESAS FINANCEIRAS"," ",0.85]
[]
[null,5,"LUCRO",null,5]
[]
[null," ","BDI - CALCULADO"," ",{"$f":"ROUND((((1+(E7+E18)/100)*(1+E23/100)*(1+E25/100)/(1-D12/100)-1)*100),2)","v":15}]
[]
["BDI = ((1+((AC+S+R+G)/100))x(1+DF/100)x(1+L/100)/(1-I/100)-1)*100"]
[]
[null,"BDI (CALCULADO):",null,{"$f":"ROUND((((1+((E7+E18)/100))*(1+E23/100)*(1+E25/100))/(1-D12/100)-1)*100,2)","v":15},"%"]
[null," "]
[]
[]
[]
[]
["BDI EM CONFORMIDADE COM OS ACÓRDÃOS Nº 2369/2011 e ACÓRDÃO Nº 2.622/2013 - TCU - PLENÁRIO"]

{"sheet":"CRONOGRAMA","index":4,"n_rows":21,"n_cols":11,"rows_kept":21,"cut":false,"hidden":false,"merged":[[15,0,16,0],[13,1,14,1],[13,0,14,0],[13,2,14,2],[17,1,18,2],[20,1,24,10],[9,1,10,1],[11,1,12,1],[15,1,16,1],[15,2,16,2],[7,0,8,0],[9,0,10,0],[11,0,12,0],[0,1,0,10],[1,6,1,10],[2,6,2,10],[3,1,3,6],[5,0,6,0],[5,2,6,2],[1,1,2,1],[5,1,6,1],[1,2,2,4],[7,2,8,2],[9,2,10,2],[11,2,12,2],[7,1,8,1]]}
[null,"CRONOGRAMA FÍSICO-FINANCEIRO"]
[null,"OBRA: ",{"$f":"ORÇAMENTO!C5","v":" PAVIMENTAÇÃO ASFÁLTICA EM PMF - DISTRITO DE SÃO PEDRO DO PASSA TRÊS (BURITIS-MG)"},null,null,"VALOR:",{"$f":"ORÇAMENTO!I37","v":1695624.1099999999}]
[{"$nulls":5},"PRAZO: ","150 DIAS "]
[]
[null,"ITEM","ETAPAS/DESCRIÇAO","FISICO/  FINANCEIRO","TOTAL    ETAPAS","MÊS 1","MÊS 2","MÊS 3","MÊS 4","MÊS 5","TOTAL"]
["A",{"$f":"VLOOKUP(A6,ORÇAMENTO!$A$9:$I$37,2)","v":1},{"$f":"VLOOKUP(A6,ORÇAMENTO!$A$9:$I$37,3)","v":"SERVIÇOS PRELIMINARES "},"FISICO ",{"$f":"ROUND(E7/$G$2,4)","v":0.1011},0.2,0.2,0.2,0.2,0.2,{"$f":"SUM(F6:J6)","v":1}]
[null,null,null,"FINANCEIRO",{"$f":"ORÇAMENTO!I9","v":171375.41},{"$f":"ROUND($E$7*F6,2)","v":34275.08},{"$f":"ROUND($E$7*G6,2)","v":34275.08},{"$f":"ROUND($E$7*H6,2)","v":34275.08},34275.08,34275.08,{"$f":"SUM(F7:J7)-0.01","v":171375.39}]
["B",{"$f":"VLOOKUP(A8,ORÇAMENTO!$A$9:$I$37,2)","v":2},{"$f":"VLOOKUP(A8,ORÇAMENTO!$A$9:$I$37,3)","v":"PAVIMENTAÇÃO"},"FISICO ",{"$f":"ROUND(E9/$G$2,4)","v":0.28320000000000001},0.25,0.25,0.25,0.25,0,{"$f":"SUM(F8:J8)","v":1}]
[null,null,null,"FINANCEIRO",{"$f":"ORÇAMENTO!I15","v":480251.79},{"$f":"ROUND($E$9*F8,2)","v":120062.95},{"$f":"ROUND($E$9*G8,2)","v":120062.95},{"$f":"ROUND($E$9*H8,2)","v":120062.95},120062.95,0,480251.8]
["C",{"$f":"VLOOKUP(A10,ORÇAMENTO!$A$9:$I$37,2)","v":3},{"$f":"VLOOKUP(A10,ORÇAMENTO!$A$9:$I$37,3)","v":"TRANSPORTE DE MATERIAIS"},"FISICO ",{"$f":"ROUND(E11/$G$2,4)","v":7.3300000000000004E-2},0.2,0.2,0.2,0.2,0.2,1]
[null,null,null,"FINANCEIRO",{"$f":"ORÇAMENTO!I23","v":124215.7},{"$f":"ROUND($E$11*F10,2)","v":24843.14},{"$f":"ROUND($E$11*G10,2)","v":24843.14},{"$f":"ROUND($E$11*H10,2)","v":24843.14},24843.14,24843.14,124215.7]
["E",{"$f":"VLOOKUP(A12,ORÇAMENTO!$A$9:$I$37,2)","v":4},{"$f":"VLOOKUP(A12,ORÇAMENTO!$A$9:$I$37,3)","v":"OBRAS COMPLEMENTARES"},"FISICO ",{"$f":"ROUND(E13/$G$2,4)","v":0.20269999999999999},null,0.25,0.25,0.25,0.25,1]
[null,null,null,"FINANCEIRO",{"$f":"ORÇAMENTO!I26","v":343772.73},{"$f":"ROUND($E$13*F12,2)","v":0},{"$f":"ROUND($E$13*G12,2)","v":85943.18},{"$f":"ROUND($E$13*H12,2)","v":85943.18},85943.18,85943.18,343772.72]
["F",{"$f":"VLOOKUP(A14,ORÇAMENTO!$A$9:$I$37,2)","v":5},{"$f":"VLOOKUP(A14,ORÇAMENTO!$A$9:$I$37,3)","v":"TRANSPORTE DE MATERIAL ASFÁLTICO (BDI DIFERENCIADO)"},"FISICO ",{"$f":"ROUND(E15/$G$2,4)","v":4.19E-2},0.25,0.25,0.25,0.25,0,1]
[null,null,null,"FINANCEIRO",{"$f":"ORÇAMENTO!I30","v":71116},{"$f":"ROUND($E$15*F14,2)","v":17779},{"$f":"ROUND($E$15*G14,2)","v":17779},{"$f":"ROUND($E$15*H14,2)","v":17779},17779,0,71116]
["G",{"$f":"VLOOKUP(A16,ORÇAMENTO!$A$9:$I$37,2)","v":6},{"$f":"VLOOKUP(A16,ORÇAMENTO!$A$9:$I$37,3)","v":"FORNECIMENTOS - MATERIAL ASFÁLTICO (BDI DIFERENCIADO)"},"FISICO ",{"$f":"ROUND(E17/$G$2,4)","v":0.29780000000000001},0.25,0.25,0.25,0.25,0,{"$f":"SUM(F16:J16)","v":1}]
[null,null,null,"FINANCEIRO",{"$f":"ORÇAMENTO!I33","v":504892.48},{"$f":"ROUND($E$17*F16,2)","v":126223.12},{"$f":"ROUND($E$17*G16,2)","v":126223.12},{"$f":"ROUND($E$17*H16,2)","v":126223.12},126223.12,0,504892.48]
[null,"TOTAL",null,"FISICO ",{"$f":"SUM(F18:J18)","v":0.99999997051233247},{"$f":"F19/E19","v":0.19059842809147129},{"$f":"G19/E19","v":0.24128370054846648},{"$f":"H19/E19","v":0.24128370054846648},{"$f":"I19/E19","v":0.24128370054846648},{"$f":"J19/E19","v":8.5550440775461728E-2},0.99999997051233247]
[null,null,null,"FINANCEIRO",{"$f":"E11+E9+E7+E13+E17+E15","v":1695624.1099999999},{"$f":"F11+F9+F7+F13+F17+F15","v":323183.28999999998},{"$f":"G11+G9+G7+G13+G17+G15-0.01","v":409126.45999999996},{"$f":"H11+H9+H7+H13+H17+H15-0.01","v":409126.45999999996},409126.45999999996,145061.38999999998,{"$f":"SUM(F19:J19)+0.05","v":1695624.1099999999}]
[]
[null,"OBSERVAÇÕES:"]