{"text_format":"2","workbook":"xlsx","n_sheets":5,"sheets":["ORÇAMENTO","CPU","BDI SERV","BDI FORN","CRONOGRAMA"],"not_rendered":{"charts":0,"images":2,"macros":0,"external_links":0,"defined_names":5,"comments":1,"pivot_tables":0},"unopened":[],"bounds":{"document_bytes":16777216,"sheet_cells":100000,"run_cost":"one","rows_first":2000,"rows_last":500,"rows_between":2000,"halvings":0,"cell_chars":16384,"cell_head_chars":4096},"cells_cut":0,"cells_raw":0,"read":"whole","date_system":"1900"}

{"sheet":"ORÇAMENTO","index":0,"n_rows":38,"n_cols":13,"rows_kept":38,"cut":false,"hidden":false,"merged":[[37,1,37,2],[0,0,7,0],[0,2,0,8],[1,2,1,8],[2,2,2,8],[4,2,4,8],[5,6,5,7],[6,1,6,2],[6,6,6,7]]}
["<---- NUMERAR SERVIÇOS PARA CPU",null,"Ministério do Desenvolvimento Regional"]
[null,null,"Companhia de Desenvolvimento dos Vales do São Francisco e do Parnaíba"]
[null,null,"1ª Superintendência Regional"]
[]
[null,"OBRA: "," PAVIMENTAÇÃO ASFÁLTICA EM CBUQ –  ESTRADA DE ACESSO À COMUNIDADE DE PARAGUASSU (NOVA PORTEIRINHA-MG)"]
[null,"DATA:","SETEMBRO/2023",null,null,null,"BDI Serviços:",null,{"$f":"'BDI SERV'!D31/100","v":0.2409},null,null,null,"."]
[null,"PRAZO DE EXECUÇÃO:   180 DIAS",{"$nulls":4},"BDI Serviços:",null,{"$f":"'BDI FORN'!D31/100","v":0.15}]
[null,"ITEM","DISCRIMINAÇÃO","REFER.","UNID.","QUANT.","P. UNITÁRIO","P.UNIT.C/ BDI","P. TOTAL",{"$f":"I38","v":3123817.71}]
["A",1,"SERVIÇOS PRELIMINARES ",{"$nulls":5},{"$f":"SUM(I10:I14)","v":167404.15000000002},{"$f":"I9/$I$38","v":5.3589602704442067E-2}]
[1,"1.1","MOBILIZAÇÃO E DESMOBILIZAÇÃO","CPU.1","GL",1,7407.12,{"$f":"VLOOKUP(A10,CPU!$A$1:$N$4661,10)","v":9191.5},{"$f":"ROUND(F10*H10,2)","v":9191.5},2.9423932038595171E-3]
[2,"1.2","ADMINISTRAÇÃO LOCAL","CPU.2","GL",1,104541.48,{"$f":"VLOOKUP(A11,CPU!$A$1:$N$4661,10)","v":129725.52},{"$f":"ROUND(F11*H11,2)","v":129725.52},4.1527877758270347E-2]
[3,"1.3","CANTEIRO DE OBRAS","CPU.3","GL",1,14140.5,{"$f":"VLOOKUP(A12,CPU!$A$1:$N$4661,10)","v":17546.95},{"$f":"ROUND(F12*H12,2)","v":17546.95},5.6171491517666055E-3]
[4,"1.4","PLACA DE OBRA EM CHAPA DE AÇO GALVANIZADO",103689,"M2",6,340.5,{"$f":"VLOOKUP(A13,CPU!$A$1:$N$4661,10)","v":422.53},{"$f":"ROUND(F13*H13,2)","v":2535.1799999999998},8.1156464152320844E-4]
[5,"1.5","SERVIÇOS TOPOGRÁFICOS PARA PAVIMENTAÇÃO, INCLUSIVE NOTA DE SERVIÇO, ACOMPANHAMENTO E GREIDE",78472,"M2",20500,0.32999999999999996,{"$f":"VLOOKUP(A14,CPU!$A$1:$N$4661,10)","v":0.41},{"$f":"ROUND(F14*H14,2)","v":8405},2.6906179490223839E-3]
["B",2,"PAVIMENTAÇÃO",{"$nulls":5},{"$f":"SUM(I16:I22)","v":809057.6},0.25899641884032981]
[6,"2.1","ESCAVAÇÃO HORIZONTAL EM SOLO DE 1A CATEGORIA ",101116,"M3",4100,2.2000000000000002,{"$f":"VLOOKUP(A16,CPU!$A$1:$N$4661,10)","v":2.73},{"$f":"ROUND(F16*H16,2)","v":11193},3.5831156101615164E-3]
[7,"2.2","CARGA, MANOBRA E DESCARGA DE SOLOS E MATERIAIS GRANULARES EM CAMINHÃO BASCULANTE",100976,"M3",4100,8.7100000000000009,{"$f":"VLOOKUP(A17,CPU!$A$1:$N$4661,10)","v":10.81},44321,1.4188087818991205E-2]
[8,"2.3","REGULARIZAÇÃO E COMPACTAÇÃO DO SUBLEITO ",100576,"M2",20500,2.57,{"$f":"VLOOKUP(A18,CPU!$A$1:$N$4661,10)","v":3.19},65395,2.0934320139954644E-2]
[9,"2.4","EXECUÇÃO E COMPACTAÇÃO DE BASE E OU SUB BASE PARA PAVIMENTAÇÃO DE BICA CORRIDA - EXCLUSIVE TRANSPORTE",96396,"M3",3500,118.95,{"$f":"VLOOKUP(A19,CPU!$A$1:$N$4661,10)","v":147.61000000000001},516635,0.16538577086177028]
[10,"2.5","IMPRIMAÇÃO COM EMULSÃO ASFÁLTICA (EAI)",96401,"M2",20500,1.23,{"$f":"VLOOKUP(A20,CPU!$A$1:$N$4661,10)","v":1.53},31365,1.0040598687815238E-2]
[11,"2.6","PINTURA DE LIGAÇÃO COM EMULSÃO ASFÁLTICA RR-1C",96402,"M2",18200,1.01,{"$f":"VLOOKUP(A21,CPU!$A$1:$N$4661,10)","v":1.25},22750,7.2827553052063334E-3]
[12,"2.7","EXECUÇÃO DE PAVIMENTO COM APLICAÇÃO DE CONCRETO ASFÁLTICO USINADO A QUENTE (CBUQ), CAMADA DE ROLAMENTO - EXCLUSIVE TRANSPORTE",95995,"M3",730,129.6,{"$f":"VLOOKUP(A22,CPU!$A$1:$N$4661,10)","v":160.82},117398.6,3.7581770416430606E-2]
["C",3,"TRANSPORTE DE MATERIAIS",{"$nulls":5},{"$f":"SUM(I24:I26)","v":119375},3.8214457782813453E-2]
[13,"3.2","TRANSPORTE COM CAMINHÃO BASCULANTE, EM VIA URBANA PAVIMENTADA",95427,"M3XKM",101999.9952,0.73,{"$f":"VLOOKUP(A24,CPU!$A$1:$N$4661,10)","v":0.91},{"$f":"ROUND(F24*H24,2)","v":92820},2.9713641645241842E-2]
[14,"3.1","TRANSPORTE COM CAMINHÃO BASCULANTE, EM VIA URBANA EM REVESTIMENTO PRIMÁRIO",95426,"M3XKM",17000,1.07,{"$f":"VLOOKUP(A25,CPU!$A$1:$N$4661,10)","v":1.33},{"$f":"ROUND(F25*H25,2)","v":22610},7.2379383494819869E-3]
[14.5,"3.3","TRANSPORTE COM CAMINHÃO CARROCERIA 9T, EM VIA URBANA PAVIMENTADA",100947,"TXKM",1500.0001196800004,2.12,{"$f":"VLOOKUP(A26,CPU!$A$1:$N$4661,10)","v":2.63},{"$f":"ROUND(F26*H26,2)","v":3945},1.2628777880896258E-3]
["D",4,"TRANSPORTE DE MATERIAL ASFÁLTICO (BDI DIFERENCIADO)",{"$nulls":5},{"$f":"SUM(I28:I29)","v":149800},4.7954142625050933E-2]
[15,"4.1","TRANSPORTE DE MASSA ASFÁLTICA COM CAMINHÃO BASCULANTE, EM VIA URBANA PAVIMENTADA (BDI DIFERENCIADO)",95430,"TXKM",265000,0.44999999999999996,{"$f":"VLOOKUP(A28,CPU!$A$1:$N$4661,10)","v":0.52},{"$f":"ROUND(F28*H28,2)","v":137800},4.4112689277249789E-2]
[16,"4.2","TRANSPORTE COM CAMINHÃO TANQUE DE TRANSPORTE DE MATERIAL ASFÁLTICO DE 30000 L, EM VIA URBANA PAVIMENTADA (BDI DIFERENCIADO)",102331,"TXKM",20000,0.52,{"$f":"VLOOKUP(A29,CPU!$A$1:$N$4661,10)","v":0.6},{"$f":"ROUND(F29*H29,2)","v":12000},3.8414533478011432E-3]
["E",5,"OBRAS COMPLEMENTARES",{"$nulls":5},{"$f":"SUM(I31:I33)","v":463954.5},0.14852163060436713]
[17,"5.1","GUIA (MEIO-FIO) E SARJETA CONJUGADOS DE CONCRETO, MOLDADA  IN LOCO  EM TRECHO RETO COM EXTRUSORA, 45 CM BASE (15 CM BASE DA GUIA + SARJETA (30 X 0,07))X 22 CM ALTURA","94267a","M",5160,57.559999999999995,{"$f":"VLOOKUP(A31,CPU!$A$1:$N$4661,10)","v":71.430000000000007},{"$f":"ROUND(F31*H31,2)","v":368578.8},0.11798985543237732]
[18,"5.3","PLACA DE REGULAMENTAÇÃO EM AÇO, PELÍCULA RETRORREFLETIVA TIPO I+SI, INCLUSIVE SUPORTE METÁLICO - FORNECIMENTO E IMPLANTAÇÃO                            ","5213440+\n5213863","UN.",30,552.16999999999996,{"$f":"VLOOKUP(A32,CPU!$A$1:$N$4661,10)","v":685.19},20555.7,6.5803135484496632E-3]
[19,"5.3","PINTURA DE EIXO VIÁRIO SOBRE ASFALTO COM TINTA RETRORREFLETIVA A BASE DE RESINA ACRÍLICA COM MICROESFERAS DE VIDRO, APLICAÇÃO MECÂNICA COM DEMARCADORA AUTOPROPELIDA - ESPESSURA DE 0,10 MM",102512,"M",10320,5.84,{"$f":"VLOOKUP(A33,CPU!$A$1:$N$4661,10)","v":7.25},74820,2.3951461623540126E-2]
["F",6,"FORNECIMENTOS - MATERIAL ASFÁLTICO (BDI DIFERENCIADO)",{"$nulls":5},{"$f":"SUM(I35:I37)","v":1414226.46},0.45272374744299659]
[20,"6.1","AQUISIÇÃO DE EMULSÃO ASFÁLTICA PARA IMPRIMAÇÃO (EAI) - EXCLUSIVE TRANSPORTE","CPU.7","T",30.000000000000004,2689.76,{"$f":"VLOOKUP(A35,CPU!$A$1:$N$4661,10)","v":3093.22},{"$f":"ROUND(F35*H35,2)","v":92796.6},2.9706150811213632E-2]
[21,"6.2","AQUISIÇÃO DE EMULSAO ASFALTICA CATIONICA RR-1C - EXCLUSIVE TRANSPORTE","CPU.8","T",10,2706.7,{"$f":"VLOOKUP(A36,CPU!$A$1:$N$4661,10)","v":3112.71},{"$f":"ROUND(F36*H36,2)","v":31127.1},9.9644418751950788E-3]
[22,"6.3","AQUISIÇÃO DE CONCRETO BETUMINOSO USINADO A QUENTE (CBUQ) PARA PAVIMENTACAO ASFALTICA, PADRAO DNIT, FAIXA C, COM CAP 50/70 - EXCLUSIVE TRANSPORTE","CPU.9","T",1870.0040000000001,600,{"$f":"VLOOKUP(A37,CPU!$A$1:$N$4661,10)","v":690},{"$f":"ROUND(F37*H37,2)","v":1290302.76},0.41305315475658788]
[null,"TOTAL GERAL DA OBRA COM BDI ",{"$nulls":6},{"$f":"SUM(I9,I15,I23,I30,I34,I27)","v":3123817.71},{"$f":"I38/F20","v":152.38135170731707},"/m²"]

{"sheet":"CPU","index":1,"n_rows":358,"n_cols":13,"rows_kept":358,"cut":false,"hidden":false,"merged":[[352,13,352,15],[289,0,306,0],[289,1,289,3],[289,4,289,7],[290,2,290,5],[291,2,291,3],[292,1,292,7],[303,1,303,3],[303,5,303,6],[304,1,304,6],[305,1,305,6],[306,1,306,6],[348,0,357,0],[348,1,348,3],[348,4,348,7],[349,2,349,5],[350,2,350,3],[351,1,351,7],[354,1,354,3],[354,5,354,6],[355,1,355,6],[356,1,356,6],[357,1,357,6],[337,0,346,0],[346,1,346,6],[326,0,335,0],[326,1,326,3],[326,4,326,7],[327,2,327,5],[328,2,328,3],[329,1,329,7],[332,1,332,3],[332,5,332,6],[333,1,333,6],[334,1,334,6],[335,1,335,6],[337,1,337,3],[337,4,337,7],[338,2,338,5],[339,2,339,3],[340,1,340,7],[343,1,343,3],[343,5,343,6],[344,1,344,6],[345,1,345,6],[308,0,324,0],[308,1,308,3],[308,4,308,7],[309,2,309,5],[310,2,310,3],[311,1,311,7],[321,1,321,3],[321,5,321,6],[322,1,322,6],[323,1,323,6],[324,1,324,6],[270,0,287,0],[270,1,270,3],[270,4,270,7],[270,10,270,11],[271,2,271,5],[272,2,272,3],[273,1,273,7],[275,12,283,15],[284,1,284,3],[284,5,284,6],[285,1,285,6],[286,1,286,6],[287,1,287,6],[258,0,269,0],[258,1,258,3],[258,4,258,7],[258,10,258,11],[259,2,259,5],[260,2,260,3],[261,1,261,7],[265,1,265,3],[265,5,265,6],[266,1,266,6],[267,1,267,6],[268,1,268,6],[245,0,256,0],[245,1,245,3],[245,4,245,7],[246,2,246,5],[247,2,247,3],[248,1,248,7],[253,1,253,3],[253,5,253,6],[254,1,254,6],[255,1,255,6],[256,1,256,6],[219,0,230,0],[219,1,219,3],[219,4,219,7],[220,2,220,5],[221,2,221,3],[222,1,222,7],[227,1,227,3],[227,5,227,6],[228,1,228,6],[229,1,229,6],[230,1,230,6],[206,0,217,0],[206,1,206,3],[206,4,206,7],[206,10,206,11],[207,2,207,5],[208,2,208,3],[209,1,209,7],[214,1,214,3],[214,5,214,6],[215,1,215,6],[216,1,216,6],[217,1,217,6],[184,0,205,0],[184,1,184,3],[184,4,184,7],[184,10,184,11],[185,2,185,5],[186,2,186,3],[187,1,187,7],[201,1,201,3],[201,5,201,6],[202,1,202,6],[203,1,203,6],[204,1,204,6],[165,0,183,0],[165,1,165,3],[165,4,165,7],[165,10,165,11],[166,2,166,5],[167,2,167,3],[168,1,168,7],[179,1,179,3],[179,5,179,6],[180,1,180,6],[181,1,181,6],[182,1,182,6],[146,0,164,0],[146,1,146,3],[146,4,146,7],[146,10,146,11],[147,2,147,5],[148,2,148,3],[149,1,149,7],[160,1,160,3],[160,5,160,6],[161,1,161,6],[162,1,162,6],[163,1,163,6],[126,0,144,0],[126,1,126,3],[126,4,126,7],[127,2,127,5],[128,2,128,3],[129,1,129,7],[141,1,141,3],[141,5,141,6],[142,1,142,6],[143,1,143,6],[144,1,144,6],[108,0,125,0],[108,1,108,3],[108,4,108,7],[108,10,108,11],[109,2,109,5],[110,2,110,3],[111,1,111,7],[121,1,121,3],[121,5,121,6],[122,1,122,6],[123,1,123,6],[124,1,124,6],[94,0,106,0],[94,1,94,3],[94,4,94,7],[95,2,95,5],[96,2,96,3],[97,1,97,7],[103,1,103,3],[103,5,103,6],[104,1,104,6],[105,1,105,6],[106,1,106,6],[81,0,93,0],[81,1,81,3],[81,4,81,7],[81,10,81,11],[82,2,82,5],[83,2,83,3],[84,1,84,7],[89,1,89,3],[89,5,89,6],[90,1,90,6],[91,1,91,6],[92,1,92,6],[65,0,80,0],[65,1,65,3],[65,4,65,7],[65,10,65,11],[66,2,66,5],[67,2,67,3],[68,1,68,7],[76,1,76,3],[76,5,76,6],[77,1,77,6],[78,1,78,6],[79,1,79,6],[47,0,64,0],[47,1,47,3],[47,4,47,7],[47,10,47,11],[48,2,48,5],[49,2,49,3],[50,1,50,7],[60,1,60,3],[60,5,60,6],[61,1,61,6],[62,1,62,6],[63,1,63,6],[33,0,46,0],[33,1,33,3],[33,4,33,7],[33,10,33,11],[34,2,34,5],[34,8,35,9],[35,2,35,3],[36,1,36,7],[42,1,42,3],[42,5,42,6],[43,1,43,6],[44,1,44,6],[45,1,45,6],[14,0,32,0],[14,1,14,3],[14,4,14,7],[14,10,14,11],[15,2,15,5],[15,8,16,9],[16,2,16,3],[17,1,17,7],[28,1,28,3],[28,5,28,6],[29,1,29,6],[30,1,30,6],[31,1,31,6],[0,0,13,0],[0,1,0,3],[0,4,0,7],[0,10,0,11],[1,2,1,5],[1,10,1,11],[2,2,2,3],[3,1,3,7],[9,1,9,3],[9,5,9,6],[10,1,10,6],[11,1,11,6],[12,1,12,6],[232,0,244,0],[232,1,232,3],[232,4,232,7],[233,2,233,5],[234,2,234,3],[235,1,235,7],[240,1,240,3],[240,5,240,6],[241,1,241,6],[242,1,242,6],[243,1,243,6]]}
[1,"CODEVASF",null,null," COMPOSIÇÃO DE PREÇO UNITÁRIO",null,null,null,{"$f":"H11","v":7407.12},{"$f":"H13","v":9191.5},"BDI CALCULADO:",null,{"$f":"ORÇAMENTO!I6","v":0.2409}]
[null,"OBRA:  ",{"$f":"ORÇAMENTO!C5","v":" PAVIMENTAÇÃO ASFÁLTICA EM CBUQ –  ESTRADA DE ACESSO À COMUNIDADE DE PARAGUASSU (NOVA PORTEIRINHA-MG)"},null,null,null,"DATA: ",{"$f":"ORÇAMENTO!C6","v":"SETEMBRO/2023"},null,null,"BDI DIFERENCIADO:",null,{"$f":"'BDI FORN'!D31/100","v":0.15}]
[null,"SERVIÇO:  ",{"$f":"VLOOKUP(A1,ORÇAMENTO!A10:I31,3)","v":"MOBILIZAÇÃO E DESMOBILIZAÇÃO"},null,"Referência:",{"$f":"VLOOKUP(A1,ORÇAMENTO!$A$10:$I$31,4)","v":"CPU.1"},"UNIDADE: ",{"$f":"VLOOKUP(A1,ORÇAMENTO!A10:I31,5)","v":"GL"}]
[]
[null,"TIPO ITEM","CODIGO ITEM","DESCRIÇÃO ITEM","UNIDADE ITEM","COEFICIENTE","PRECO UNITARIO","CUSTO TOTAL"]
[null,"COMPOSICAO",89876,"CAMINHÃO BASCULANTE 14 M3, COM CAVALO MECÂNICO DE CAPACIDADE MÁXIMA DE TRAÇÃO COMBINADO DE 36000 KG, POTÊNCIA 286 CV, INCLUSIVE SEMIREBOQUE COM CAÇAMBA METÁLICA","CHP DIURNO.",16,316.13,{"$f":"ROUNDDOWN(F6*G6,2)","v":5058.08}]
[null,"COMPOSICAO",89877,"CAMINHÃO BASCULANTE 14 M3, COM CAVALO MECÂNICO DE CAPACIDADE MÁXIMA DE TRAÇÃO COMBINADO DE 36000 KG, POTÊNCIA 286 CV, INCLUSIVE SEMIREBOQUE COM CAÇAMBA METÁLICA","CHI DIURNO.",16,89.75,{"$f":"ROUNDDOWN(F7*G7,2)","v":1436}]
[null,"COMPOSICAO",5914640,"TRANSPORTE COM CAVALO MECÂNICO COM SEMIRREBOQUE COM CAPACIDADE DE 30 T - RODOVIA PAVIMENTADA","T.KM",484,0.57999999999999996,{"$f":"ROUNDDOWN(F8*G8,2)","v":280.72000000000003}]
[null,"COMPOSIÇÃO",88316,"SERVENTE COM ENCARGOS COMPLEMENTARES","H",32,19.760000000000002,{"$f":"ROUNDDOWN(F9*G9,2)","v":632.32000000000005}]
[null,"PRODUÇÃO DA EQUIPE",null,null,1,"CUSTO ",null,{"$f":"SUM(H6:H9)","v":7407.12}]
[null,"TOTAL",{"$nulls":5},{"$f":"H10/E10","v":7407.12},"OK"]
[null,"BDI                %",{"$nulls":5},{"$f":"1+$M$1","v":1.2408999999999999}]
[null,"TOTAL DO SERVIÇO - R$",{"$nulls":5},{"$f":"ROUND(H11*H12,2)","v":9191.5}]
[]
[2,"CODEVASF",null,null," COMPOSIÇÃO DE PREÇO UNITÁRIO",null,null,null,{"$f":"H30","v":104541.48},{"$f":"H32","v":129725.52}]
[null,"OBRA:  ",{"$f":"$C$2","v":" PAVIMENTAÇÃO ASFÁLTICA EM CBUQ –  ESTRADA DE ACESSO À COMUNIDADE DE PARAGUASSU (NOVA PORTEIRINHA-MG)"},null,null,null,"DATA: ",{"$f":"$H$2","v":"SETEMBRO/2023"}]
[null,"SERVIÇO:  ",{"$f":"VLOOKUP(A15,ORÇAMENTO!$A$10:$I$31,3)","v":"ADMINISTRAÇÃO LOCAL"},null,"SINAPI",{"$f":"VLOOKUP(A15,ORÇAMENTO!$A$10:$I$31,4)","v":"CPU.2"},"UNIDADE: ",{"$f":"VLOOKUP(A15,ORÇAMENTO!$A$10:$I$31,5)","v":"GL"}]
[]
[null,"TIPO ITEM","CODIGO ITEM","DESCRIÇÃO ITEM","UNIDADE ITEM","COEFICIENTE","PRECO UNITARIO","CUSTO TOTAL"]
[null,"INSUMO",14250,"ENERGIA ELÉTRICA","kwh",60,0.94,{"$f":"ROUNDDOWN(F20*G20,2)","v":56.4}]
[null,"INSUMO",44480,"TARIFA \"A\" - ÁGUA/ESGOTO ","m³",6,17.78,106.68]
[null,"COTAÇÃO","MERC.","TELEFONE (PLANO CONTROLE)","UNID",2,59.9,119.8]
[null,"INSUMO","ED-50155 SEINFRA","BANHEIRO QUÍMICO 110 X 120 X 230 CM COM MANUTENÇÃO (CONSIDERANDO OBRAS SIMULTÂNEAS)","MÊS",2,820,1640]
[null,"COMPOSICAO",90777,"Engenheiro Civil Júnior com encargos complementares","H",45,114.12,5135.3999999999996]
[null,"COMPOSICAO",90776,"Encarregado Geral com encargos complementares","H",90,57.73,5195.7]
[null,"COMPOSICAO",88321,"Tecnico de Laboratório com encargos complementares","H",45,45.45,2045.25]
[null,"COMPOSICAO",100309,"Tecnico em Segurança do Trabalho com encargos complementares","H",45,45.71,{"$f":"ROUNDDOWN(F27*G27,2)","v":2056.9499999999998}]
[null,"COMPOSICAO",90772,"Auxiliar de escritório com encargos complementares","H",45,23.72,1067.4000000000001]
[null,"PRODUÇÃO DA EQUIPE",null,null,{"$f":"1/6","v":0.16666666666666666},"CUSTO ",null,{"$f":"SUM(H20:H28)","v":17423.580000000002}]
[null,"TOTAL",{"$nulls":5},{"$f":"ROUND(H29/E29,2)","v":104541.48},"OK"]
[null,"BDI                %",{"$nulls":5},{"$f":"1+$M$1","v":1.2408999999999999}]
[null,"TOTAL DO SERVIÇO - R$",{"$nulls":5},{"$f":"ROUND(H30*H31,2)","v":129725.52}]
[]
[{"$f":"A15+1","v":3},"CODEVASF",null,null," COMPOSIÇÃO DE PREÇO UNITÁRIO",null,null,null,{"$f":"H44","v":14140.5},{"$f":"H46","v":17546.95}]
[null,"OBRA:  ",{"$f":"$C$2","v":" PAVIMENTAÇÃO ASFÁLTICA EM CBUQ –  ESTRADA DE ACESSO À COMUNIDADE DE PARAGUASSU (NOVA PORTEIRINHA-MG)"},null,null,null,"DATA: ",{"$f":"$H$2","v":"SETEMBRO/2023"}]
[null,"SERVIÇO:  ",{"$f":"VLOOKUP(A34,ORÇAMENTO!$A$10:$I$31,3)","v":"CANTEIRO DE OBRAS"},null,"SINAPI",{"$f":"VLOOKUP(A34,ORÇAMENTO!$A$10:$I$31,4)","v":"CPU.3"},"UNIDADE: ",{"$f":"VLOOKUP(A34,ORÇAMENTO!$A$10:$I$31,5)","v":"GL"}]
[]
[null,"TIPO ITEM","CODIGO ITEM","DESCRIÇÃO ITEM","UNIDADE ITEM","COEFICIENTE","PRECO UNITARIO","CUSTO TOTAL"]
[null,"INSUMO",10775,"ALUGUEL DE IMÓVEL OU CONTEINER QUE ATENDA AOS REQUISITOS MÍNIMOS PARA INSTALAÇÃO DO CANTEIRO DE OBRAS","MÊS",6,975,{"$f":"ROUNDDOWN(F39*G39,2)","v":5850}]
[null,"INSUMO",10779,"LOCACAO DE CONTAINER 2,30 X 4,30 M, ALT. 2,50 M, P/ SANITARIO, C/ 5 BACIAS, 1 LAVATORIO E 4 MICTORIOS","MÊS",6,1218.75,{"$f":"ROUNDDOWN(F40*G40,2)","v":7312.5}]
[null,"INSUMO","37525","TELA PLASTICA TECIDA LISTRADA BRANCA E LARANJA, TIPO GUARDA CORPO, EM POLIETILENO MONOFILADO, ROLO 1,20 X 50 M (L X C)","M",200,3.69,{"$f":"ROUNDDOWN(F41*G41,2)","v":738}]
[null,"COMPOSICAO"," - ","PLACA DE SINALIZAÇÃO - \"PERIGO - OBRAS A FRENTE\" - FORNECIMENTO E MOVIMENTAÇÃO","UNID.",12,20,{"$f":"ROUNDDOWN(F42*G42,2)","v":240}]
[null,"PRODUÇÃO DA EQUIPE",null,null,1,"CUSTO ",null,{"$f":"SUM(H39:H42)","v":14140.5}]
[null,"TOTAL",{"$nulls":5},{"$f":"H43/E43","v":14140.5},"OK"]
[null,"BDI                %",{"$nulls":5},{"$f":"1+$M$1","v":1.2408999999999999}]
[null,"TOTAL DO SERVIÇO - R$",{"$nulls":5},{"$f":"ROUND(H44*H45,2)","v":17546.95}]
[]
[{"$f":"A34+1","v":4},"CODEVASF",null,null," COMPOSIÇÃO DE PREÇO UNITÁRIO",null,null,null,{"$f":"H62","v":340.5},{"$f":"H64","v":422.53}]
[null,"OBRA:  ",{"$f":"$C$2","v":" PAVIMENTAÇÃO ASFÁLTICA EM CBUQ –  ESTRADA DE ACESSO À COMUNIDADE DE PARAGUASSU (NOVA PORTEIRINHA-MG)"},null,null,null,"DATA: ",{"$f":"$H$2","v":"SETEMBRO/2023"}]
[null,"SERVIÇO:  ",{"$f":"VLOOKUP(A48,ORÇAMENTO!$A$10:$I$31,3)","v":"PLACA DE OBRA EM CHAPA DE AÇO GALVANIZADO"},null,"SINAPI",{"$f":"VLOOKUP(A48,ORÇAMENTO!$A$10:$I$31,4)","v":103689},"UNIDADE: ",{"$f":"VLOOKUP(A48,ORÇAMENTO!$A$10:$I$31,5)","v":"M2"}]
[]
[null,"TIPO ITEM","CODIGO ITEM","DESCRIÇÃO ITEM","UNIDADE ITEM","COEFICIENTE","PRECO UNITARIO","CUSTO TOTAL"]
[null,"INSUMO","4509","SARRAFO *2,5 X 10* CM EM PINUS, MISTA OU EQUIVALENTE DA REGIAO - BRUTA","M","3,2083000","4,41",{"$f":"ROUNDDOWN(F53*G53,2)","v":14.14}]
[null,"INSUMO","4813","PLACA DE OBRA (PARA CONSTRUCAO CIVIL) EM CHAPA GALVANIZADA *N. 22*, ADESIVADA, DE *2,4 X 1,2* M ","M2","1,0000000","250,00",250]
[null,"INSUMO",4115,"MADEIRA ROLICA TRATADA, D = 12 A 15 CM, EM EUCALIPTO OU EQUIVALENTE DA REGIAO","M",2,21.76,43.52]
[null,"INSUMO","5065","PREGO DE ACO POLIDO COM CABECA 10 X 10 (7/8 X 17)","KG","0,0113000","36,57",0.41]
[null,"INSUMO","5069","PREGO DE ACO POLIDO COM CABECA 17 X 27 (2 1/2 X 11)","KG","0,0132000","19,59",0.25]
[null,"COMPOSICAO","88262","CARPINTEIRO DE FORMAS COM ENCARGOS COMPLEMENTARES","H","0,3729000","27,05",10.08]
[null,"COMPOSICAO","88316","SERVENTE COM ENCARGOS COMPLEMENTARES","H","1,1186000","19,76",22.1]
[{"$nulls":7},0]
{"$rows_left_out":299}
{"sheet":"BDI SERV","index":2,"n_rows":37,"n_cols":20,"rows_kept":37,"cut":false,"hidden":false,"merged":[[31,1,31,2],[32,0,34,5],[36,0,36,5],[0,1,2,4],[3,1,4,1],[3,2,4,2],[28,0,28,5],[30,1,30,2]]}
[null,"DETALHAMENTO DO BDI - SERVIÇOS"]
[]
[]
[null,"Item","Descrição dos Serviços","%","%"]
[null,null,null,"PV","CD"]
[]
[null,1,"ADMINISTRAÇÃO CENTRAL"," ",4.01]
[null,"1.1","ESCRITÓRIO CENTRAL"," "," "]
[null,"1.2","VIAGENS"," "," "]
[null,"1.3","OUTROS"," "," "]
[null," "," "," "," "]
[null,2,"IMPOSTOS E TAXAS",{"$f":"SUM(D13:D16)","v":8.65},{"$f":"SUM(E13:E16)","v":10.82}]
[null,"2.1","ISS (*)",5,{"$f":"ROUND(D13*1.2515,2)","v":6.26}]
[null,"2.2","PIS",0.65,{"$f":"ROUND(D14*1.2515,2)","v":0.81}]
[null,"2.3","Cofins",3,{"$f":"ROUND(D15*1.2515,2)","v":3.75}]
[null,"2.4","CONTRIBUIÇÃO PREVIDENCIÁRIA SOBRE A RENDA BRUTA",0,{"$f":"ROUND(D16*1.2515,2)","v":0}]
[]
[null,3,"TAXA DE RISCO"," ",{"$f":"SUM(E19:E22)","v":0.96}]
[null,"3.1","SEGURO",null,0.2]
[null,"3.2","RISCO",null,0.56000000000000005]
[null,"3.3","GARANTIA",null,0.2]
[{"$nulls":19},{"$f":"1/0.82","v":1.2195121951219512}]
[null,4,"DESPESAS FINANCEIRAS"," ",1.1100000000000001]
[]
[null,5,"LUCRO",null,6.8]
[]
[null," ","BDI - CALCULADO"," ",{"$f":"ROUND((((1+(E7+E18)/100)*(1+E23/100)*(1+E25/100)/(1-D12/100)-1)*100),2)","v":24.09}]
[]
["BDI = ((1+((AC+S+R+G)/100))x(1+DF/100)x(1+L/100)/(1-I/100)-1)*100"]
[]
[null,"BDI (CALCULADO):",null,{"$f":"ROUND((((1+((E7+E18)/100))*(1+E23/100)*(1+E25/100))/(1-D12/100)-1)*100,2)","v":24.09},"%"]
[null," "]
["(*) ISS CONFORME LEI 2.226/2017 e LEI COMPLEMENTAR Nº 116/2003 - \nConsiderando as deduções previstas no Art. 106 - § 5º (Alíquota sobre 50% do valor dos serviços)"]
[]
[]
[]
["BDI EM CONFORMIDADE COM OS ACÓRDÃOS Nº 2369/2011 e ACÓRDÃO Nº 2.622/2013 - TCU - PLENÁRIO"]

{"sheet":"BDI FORN","index":3,"n_rows":37,"n_cols":5,"rows_kept":37,"cut":false,"hidden":false,"merged":[[31,1,31,2],[32,0,34,5],[36,0,36,5],[0,1,2,4],[3,1,4,1],[3,2,4,2],[28,0,28,5],[30,1,30,2]]}
[null,"DETALHAMENTO DO BDI - FORNECIMENTO \n(MATERIAL ASFÁLTICO)"]
[]
[]
[null,"Item","Descrição dos Serviços","%","%"]
[null,null,null,"PV","CD"]
[]
[null,1,"ADMINISTRAÇÃO CENTRAL"," ",3.72]
[null,"1.1","ESCRITÓRIO CENTRAL"," "," "]
[null,"1.2","VIAGENS"," "," "]
[null,"1.3","OUTROS"," "," "]
[null," "," "," "," "]
[null,2,"IMPOSTOS E TAXAS",{"$f":"SUM(D13:D16)","v":3.65},{"$f":"SUM(E13:E16)","v":4.5600000000000005}]
[null,"2.1","ISS (*)",null,{"$f":"ROUND(D13*1.2515,2)","v":0}]
[null,"2.2","PIS",0.65,{"$f":"ROUND(D14*1.2515,2)","v":0.81}]
[null,"2.3","Cofins",3,{"$f":"ROUND(D15*1.2515,2)","v":3.75}]
[null,"2.4","CONTRIBUIÇÃO PREVIDENCIÁRIA SOBRE A RENDA BRUTA",0,{"$f":"ROUND(D16*1.2515,2)","v":0}]
[]
[null,3,"TAXA DE RISCO"," ",{"$f":"SUM(E19:E22)","v":0.82000000000000006}]
[null,"3.1","SEGURO",null,0.16]
[null,"3.2","RISCO",null,0.5]
[null,"3.3","GARANTIA",null,0.16]
[]
[null,4,"DESPESAS FINANCEIRAS"," ",0.94]
[]
[null,5,"LUCRO",null,5]
[]
[null," ","BDI - CALCULADO"," ",{"$f":"ROUND((((1+(E7+E18)/100)*(1+E23/100)*(1+E25/100)/(1-D12/100)-1)*100),2)","v":15}]
[]
["BDI = ((1+((AC+S+R+G)/100))x(1+DF/100)x(1+L/100)/(1-I/100)-1)*100"]
[]
[null,"BDI (CALCULADO):",null,{"$f":"ROUND((((1+((E7+E18)/100))*(1+E23/100)*(1+E25/100))/(1-D12/100)-1)*100,2)","v":15},"%"]
[null," "]
[]
[]
[]
[]
["BDI EM CONFORMIDADE COM OS ACÓRDÃOS Nº 2369/2011 e ACÓRDÃO Nº 2.622/2013 - TCU - PLENÁRIO"]

{"sheet":"CRONOGRAMA","index":4,"n_rows":21,"n_cols":12,"rows_kept":21,"cut":false,"hidden":false,"merged":[[17,1,18,2],[20,1,24,11],[13,0,14,0],[13,1,14,1],[13,2,14,2],[15,0,16,0],[15,1,16,1],[15,2,16,2],[9,0,10,0],[9,1,10,1],[9,2,10,2],[11,0,12,0],[11,1,12,1],[11,2,12,2],[3,1,3,9],[5,0,6,0],[5,1,6,1],[5,2,6,2],[7,0,8,0],[7,1,8,1],[7,2,8,2],[0,1,0,11],[1,1,2,1],[1,2,2,4],[1,6,1,11],[2,6,2,11]]}
[null,"CRONOGRAMA FÍSICO-FINANCEIRO"]
[null,"OBRA: ",{"$f":"ORÇAMENTO!C5","v":" PAVIMENTAÇÃO ASFÁLTICA EM CBUQ –  ESTRADA DE ACESSO À COMUNIDADE DE PARAGUASSU (NOVA PORTEIRINHA-MG)"},null,null,"VALOR:",{"$f":"ORÇAMENTO!I38","v":3123817.71}]
[{"$nulls":5},"PRAZO: ","180 DIAS "]
[]
[null,"ITEM","ETAPAS/DESCRIÇAO","FISICO/  FINANCEIRO","TOTAL    ETAPAS","MÊS 1","MÊS 2","MÊS 3","MÊS 4","MÊS 5","MÊS 6","TOTAL"]
["A",{"$f":"VLOOKUP(A6,ORÇAMENTO!$A$9:$I$38,2)","v":1},{"$f":"VLOOKUP(A6,ORÇAMENTO!$A$9:$I$38,3)","v":"SERVIÇOS PRELIMINARES "},"FISICO ",{"$f":"ROUND(E7/$G$2,4)","v":5.3600000000000002E-2},0.25,0.15,0.15,0.15,0.15,0.15,{"$f":"SUM(F6:K6)","v":1}]
[null,null,null,"FINANCEIRO",{"$f":"ORÇAMENTO!I9","v":167404.15000000002},{"$f":"ROUND($E$7*F6,2)","v":41851.040000000001},25110.62,25110.62,25110.62,25110.62,25110.62,{"$f":"SUM(F7:K7)","v":167404.13999999998}]
["B",{"$f":"VLOOKUP(A8,ORÇAMENTO!$A$9:$I$38,2)","v":2},{"$f":"VLOOKUP(A8,ORÇAMENTO!$A$9:$I$38,3)","v":"PAVIMENTAÇÃO"},"FISICO ",{"$f":"ROUND(E9/$G$2,4)","v":0.25900000000000001},0.1,0.2,0.2,0.2,0.2,0.1,{"$f":"SUM(F8:K8)","v":0.99999999999999989}]
[null,null,null,"FINANCEIRO",{"$f":"ORÇAMENTO!I15","v":809057.6},{"$f":"ROUND($E$9*F8,2)","v":80905.759999999995},161811.51999999999,161811.51999999999,161811.51999999999,161811.51999999999,80905.759999999995,{"$f":"SUM(F9:K9)","v":809057.6}]
["C",{"$f":"VLOOKUP(A10,ORÇAMENTO!$A$9:$I$38,2)","v":3},{"$f":"VLOOKUP(A10,ORÇAMENTO!$A$9:$I$38,3)","v":"TRANSPORTE DE MATERIAIS"},"FISICO ",{"$f":"ROUND(E11/$G$2,4)","v":3.8199999999999998E-2},0.1,0.2,0.2,0.2,0.2,0.1,{"$f":"SUM(F10:K10)","v":0.99999999999999989}]
[null,null,null,"FINANCEIRO",{"$f":"ORÇAMENTO!I23","v":119375},{"$f":"ROUND($E$11*F10,2)","v":11937.5},23875,23875,23875,23875,11937.5,{"$f":"SUM(F11:K11)-0.04","v":119374.96}]
["D",{"$f":"VLOOKUP(A12,ORÇAMENTO!$A$9:$I$38,2)","v":4},{"$f":"VLOOKUP(A12,ORÇAMENTO!$A$9:$I$38,3)","v":"TRANSPORTE DE MATERIAL ASFÁLTICO (BDI DIFERENCIADO)"},"FISICO ",{"$f":"ROUND(E13/$G$2,4)","v":4.8000000000000001E-2},0.1,0.2,0.2,0.2,0.2,0.1,{"$f":"SUM(F12:K12)","v":0.99999999999999989}]
[null,null,null,"FINANCEIRO",{"$f":"ORÇAMENTO!I27","v":149800},{"$f":"ROUND($E$13*F12,2)","v":14980},29960,29960,29960,29960,14980,{"$f":"SUM(F13:K13)-0.02","v":149799.98000000001}]
["E",{"$f":"VLOOKUP(A14,ORÇAMENTO!$A$9:$I$38,2)","v":5},{"$f":"VLOOKUP(A14,ORÇAMENTO!$A$9:$I$38,3)","v":"OBRAS COMPLEMENTARES"},"FISICO ",{"$f":"ROUND(E15/$G$2,4)","v":0.14849999999999999},0,0.2,0.2,0.2,0.2,0.2,{"$f":"SUM(F14:K14)","v":1}]
[null,null,null,"FINANCEIRO",{"$f":"ORÇAMENTO!I30","v":463954.5},{"$f":"ROUND($E$15*F14,2)","v":0},92790.9,92790.9,92790.9,92790.9,92790.9,{"$f":"SUM(F15:K15)-0.02","v":463954.48}]
["F",{"$f":"VLOOKUP(A16,ORÇAMENTO!$A$9:$I$38,2)","v":6},{"$f":"VLOOKUP(A16,ORÇAMENTO!$A$9:$I$38,3)","v":"FORNECIMENTOS - MATERIAL ASFÁLTICO (BDI DIFERENCIADO)"},"FISICO ",{"$f":"ROUND(E17/$G$2,4)","v":0.45269999999999999},0.1,0.2,0.2,0.2,0.2,0.1,{"$f":"SUM(F16:K16)","v":0.99999999999999989}]
[null,null,null,"FINANCEIRO",{"$f":"ORÇAMENTO!I34","v":1414226.46},{"$f":"ROUND($E$17*F16,2)","v":141422.65},282845.28999999998,282845.28999999998,282845.28999999998,282845.28999999998,141422.65,{"$f":"SUM(F17:K17)-0.02","v":1414226.44}]
[null,"TOTAL",null,"FISICO ",{"$f":"SUM(F18:K18)","v":0.9999999967987887},{"$f":"F19/$E$19","v":9.3186279426016816E-2},0.19732051842423287,0.19732051842423287,0.19732051842423287,0.19732051842423287,0.1175316436758405,{"$f":"SUM(F18:K18)","v":0.9999999967987887}]
[null,null,null,"FINANCEIRO",{"$f":"E11+E9+E7+E13+E17+E15","v":3123817.71},291096.94999999995,616393.32999999996,616393.32999999996,616393.32999999996,616393.32999999996,367147.43000000005,{"$f":"SUM(F19:K19)+0.01","v":3123817.71}]
[]
[null,"OBSERVAÇÕES:"]