{"text_format":"2","workbook":"xlsx","n_sheets":5,"sheets":["ORÇAMENTO","CPU","BDI SERV","BDI FORN","CRONOGRAMA"],"not_rendered":{"charts":0,"images":3,"macros":0,"external_links":0,"defined_names":5,"comments":1,"pivot_tables":0},"unopened":[],"bounds":{"document_bytes":16777216,"sheet_cells":100000,"run_cost":"one","rows_first":2000,"rows_last":500,"rows_between":2000,"halvings":0,"cell_chars":16384,"cell_head_chars":4096},"cells_cut":0,"cells_raw":0,"read":"whole","date_system":"1900"}

{"sheet":"ORÇAMENTO","index":0,"n_rows":36,"n_cols":9,"rows_kept":36,"cut":false,"hidden":false,"merged":[[35,1,35,2],[0,0,7,0],[0,2,0,8],[1,2,1,8],[2,2,2,8],[4,2,4,8],[5,6,5,7],[6,1,6,2],[6,6,6,7]]}
["<---- NUMERAR SERVIÇOS PARA CPU",null,"Ministério do Desenvolvimento Regional"]
[null,null,"Companhia de Desenvolvimento dos Vales do São Francisco e do Parnaíba"]
[null,null,"1ª Superintendência Regional"]
[]
[null,"OBRA: ","ENGENHEIRO NAVARRO - PAVIMENTAÇÃO ASFÁLTICA EM CBUQ - VIAS DIVERSAS - ITEM 1"]
[null,"DATA:"," OUTUBRO / 2023   ",null,null,null,"BDI Serviços:",null,{"$f":"'BDI SERV'!D31/100","v":0.2412}]
[null," PRAZO DE EXECUÇÃO:     150 DIAS",{"$nulls":4},"BDI Fornecimentos:",null,{"$f":"'BDI FORN'!D31/100","v":0.15}]
[null,"ITEM","DESCRIÇÃO","REFER.","UNID.","QUANT.","P. UNITÁRIO","P.UNIT.C/ BDI","P. TOTAL"]
["A",1,"SERVIÇOS PRELIMINARES ",{"$nulls":5},{"$f":"SUM(I10:I14)","v":223171.68}]
[1,"1.1","MOBILIZAÇÃO E DESMOBILIZAÇÃO","CPU.1","GL",1,{"$f":"VLOOKUP(A10,CPU!$A$1:$N$4650,9)","v":12177.04},{"$f":"VLOOKUP(A10,CPU!$A$1:$N$4650,10)","v":15114.14},{"$f":"ROUND(F10*H10,2)","v":15114.14}]
[2,"1.2","ADMINISTRAÇÃO LOCAL","CPU.2","GL",1,{"$f":"VLOOKUP(A11,CPU!$A$1:$N$4650,9)","v":148591.15},{"$f":"VLOOKUP(A11,CPU!$A$1:$N$4650,10)","v":184431.34},{"$f":"ROUND(F11*H11,2)","v":184431.34}]
[3,"1.3","CANTEIRO DE OBRAS","CPU.3","GL",1,{"$f":"VLOOKUP(A12,CPU!$A$1:$N$4650,9)","v":11706.75},{"$f":"VLOOKUP(A12,CPU!$A$1:$N$4650,10)","v":14530.42},{"$f":"ROUND(F12*H12,2)","v":14530.42}]
[4,"1.4","PLACA DE OBRA EM CHAPA DE AÇO GALVANIZADO",103689,"M2",6,{"$f":"VLOOKUP(A13,CPU!$A$1:$N$4650,9)","v":340.5},{"$f":"VLOOKUP(A13,CPU!$A$1:$N$4650,10)","v":422.63},{"$f":"ROUND(F13*H13,2)","v":2535.7800000000002}]
[5,"1.5","SERVIÇOS TOPOGRÁFICOS PARA PAVIMENTAÇÃO, INCLUSIVE NOTA DE SERVIÇO, ACOMPANHAMENTO E GREIDE",78472,"M2",16000.0021,{"$f":"VLOOKUP(A14,CPU!$A$1:$N$4650,9)","v":0.32999999999999996},{"$f":"VLOOKUP(A14,CPU!$A$1:$N$4650,10)","v":0.41},{"$f":"ROUND(F14*H14,2)","v":6560}]
["B",2,"TERRAPLANAGEM E PAVIMENTAÇÃO",{"$nulls":5},{"$f":"SUM(I16:I22)","v":262475.2}]
[6,"2.1","ESCAVAÇÃO HORIZONTAL EM SOLO DE 1A CATEGORIA ",101116,"M3",4799.9999999999982,{"$f":"VLOOKUP(A16,CPU!$A$1:$N$4650,9)","v":2.2000000000000002},{"$f":"VLOOKUP(A16,CPU!$A$1:$N$4650,10)","v":2.73},{"$f":"ROUND(F16*H16,2)","v":13104}]
[7,"2.2","CARGA, MANOBRA E DESCARGA DE SOLOS E MATERIAIS GRANULARES EM CAMINHÃO BASCULANTE",100976,"M3",4799.9999999999982,{"$f":"VLOOKUP(A17,CPU!$A$1:$N$4650,9)","v":8.7100000000000009},{"$f":"VLOOKUP(A17,CPU!$A$1:$N$4650,10)","v":10.81},51888]
[8,"2.3","REGULARIZAÇÃO E COMPACTAÇÃO DO SUBLEITO ",100576,"M2",16000.000000000004,{"$f":"VLOOKUP(A18,CPU!$A$1:$N$4650,9)","v":2.57},{"$f":"VLOOKUP(A18,CPU!$A$1:$N$4650,10)","v":3.19},51040]
[9,"2.4","EXECUÇÃO E COMPACTAÇÃO DE BASE E OU SUB BASE PARA PAVIMENTAÇÃO DE SOLOS DE COMPORTAMENTO LATERÍTICO - EXCLUSIVE SOLO, ESCAVAÇÃO, CARGA E TRANSPORTE",96388,"M3",2400,{"$f":"VLOOKUP(A19,CPU!$A$1:$N$4650,9)","v":12.469999999999999},{"$f":"VLOOKUP(A19,CPU!$A$1:$N$4650,10)","v":15.48},37152]
[10,"2.5","IMPRIMAÇÃO COM EMULSÃO ASFÁLTICA (EAI)",96401,"M2",16000.000000000004,{"$f":"VLOOKUP(A20,CPU!$A$1:$N$4650,9)","v":1.23},{"$f":"VLOOKUP(A20,CPU!$A$1:$N$4650,10)","v":1.53},24480]
[11,"2.6","PINTURA DE LIGAÇÃO COM EMULSÃO ASFÁLTICA RR-1C",96402,"M2",13799.999999999998,{"$f":"VLOOKUP(A21,CPU!$A$1:$N$4650,9)","v":1.01},{"$f":"VLOOKUP(A21,CPU!$A$1:$N$4650,10)","v":1.25},17250]
[12,"2.7","EXECUÇÃO DE PAVIMENTO COM APLICAÇÃO DE CONCRETO ASFÁLTICO USINADO A QUENTE (CBUQ), CAMADA DE ROLAMENTO - EXCLUSIVE TRANSPORTE",95995,"M3",420.00000000000006,{"$f":"VLOOKUP(A22,CPU!$A$1:$N$4650,9)","v":129.6},{"$f":"VLOOKUP(A22,CPU!$A$1:$N$4650,10)","v":160.86000000000001},67561.2]
["C",3,"TRANSPORTE DE MATERIAIS",{"$nulls":5},{"$f":"SUM(I24:I27)","v":158779.99}]
[13,"3.1","TRANSPORTE COM CAMINHÃO BASCULANTE, EM VIA URBANA PAVIMENTADA",95427,"M3XKM",69999.994999999995,{"$f":"VLOOKUP(A24,CPU!$A$1:$N$4650,9)","v":0.73},{"$f":"VLOOKUP(A24,CPU!$A$1:$N$4650,10)","v":0.91},{"$f":"ROUND(F24*H24,2)","v":63700}]
[13.5,"3.2","TRANSPORTE COM CAMINHÃO BASCULANTE, EM VIA URBANA EM REVESTIMENTO PRIMÁRIO",95426,"M3XKM",65000,{"$f":"VLOOKUP(A25,CPU!$A$1:$N$4650,9)","v":1.07},{"$f":"VLOOKUP(A25,CPU!$A$1:$N$4650,10)","v":1.33},{"$f":"ROUND(F25*H25,2)","v":86450}]
[14,"3.3","TRANSPORTE COM CAMINHÃO CARROCERIA 9T, EM VIA URBANA PAVIMENTADA",100947,"TXKM",999.99684800000034,{"$f":"VLOOKUP(A26,CPU!$A$1:$N$4650,9)","v":2.12},{"$f":"VLOOKUP(A26,CPU!$A$1:$N$4650,10)","v":2.63},{"$f":"ROUND(F26*H26,2)","v":2629.99}]
[15,"3.4","TRANSPORTE COM CAMINHÃO TANQUE DE TRANSPORTE DE MATERIAL ASFÁLTICO DE 30000 L, EM VIA URBANA PAVIMENTADA (BDI DIFERENCIADO)",102331,"TXKM",10000,{"$f":"VLOOKUP(A27,CPU!$A$1:$N$4650,9)","v":0.52},{"$f":"VLOOKUP(A27,CPU!$A$1:$N$4650,10)","v":0.6},{"$f":"ROUND(F27*H27,2)","v":6000}]
["D",4,"OBRAS COMPLEMENTARES",{"$nulls":5},{"$f":"SUM(I29:I31)","v":419130.02}]
[16,"4.1","GUIA (MEIO-FIO) E SARJETA CONJUGADOS DE CONCRETO, MOLDADA IN LOCO COM EXTRUSORA, 45 CM BASE (15 CM BASE DA GUIA + 30 CM BASE DA SARJETA) X 22 CM ALTURA",94267,"M",5000,{"$f":"VLOOKUP(A29,CPU!$A$1:$N$4650,9)","v":57.319999999999986},{"$f":"VLOOKUP(A29,CPU!$A$1:$N$4650,10)","v":71.150000000000006},{"$f":"ROUND(F29*H29,2)","v":355750}]
[17,"4.2","FORNECIMENTO E INSTALAÇÃO DE PLACA DE SINALIZAÇÃO VIÁRIA - REGULAMENTAÇÃO OCTOGONAL (PARE) 0,60MX0,60M","CPU.4","UN.",15,{"$f":"VLOOKUP(A30,CPU!$A$1:$N$4650,9)","v":444.73},{"$f":"VLOOKUP(A30,CPU!$A$1:$N$4650,10)","v":552},{"$f":"ROUND(F30*H30,2)","v":8280}]
[19,"4.3","PINTURA DE EIXO VIÁRIO SOBRE ASFALTO COM TINTA RETRORREFLETIVA A BASE DE RESINA ACRÍLICA COM MICROESFERAS DE VIDRO, APLICAÇÃO MECÂNICA COM DEMARCADORA AUTOPROPELIDA",102512,"M",7600.0022033898304,{"$f":"VLOOKUP(A31,CPU!$A$1:$N$4650,9)","v":5.84},{"$f":"VLOOKUP(A31,CPU!$A$1:$N$4650,10)","v":7.25},{"$f":"ROUND(F31*H31,2)","v":55100.02}]
["E",5,"FORNECIMENTOS - MATERIAL ASFÁLTICO (BDI DIFERENCIADO)",{"$nulls":5},{"$f":"SUM(I33:I35)","v":851930.27}]
[20,"5.1","AQUISIÇÃO DE EMULSÃO ASFÁLTICA PARA IMPRIMAÇÃO (EAI) - EXCLUSIVE TRANSPORTE","CPU.6","T",23.000000000000007,{"$f":"VLOOKUP(A33,CPU!$A$1:$N$4650,9)","v":2689.76},{"$f":"VLOOKUP(A33,CPU!$A$1:$N$4650,10)","v":3093.22},{"$f":"ROUND(F33*H33,2)","v":71144.06}]
[21,"5.2","AQUISIÇÃO DE EMULSAO ASFALTICA CATIONICA RR-1C - EXCLUSIVE TRANSPORTE","CPU.7","T",6.9999999999999991,{"$f":"VLOOKUP(A34,CPU!$A$1:$N$4650,9)","v":2706.7},{"$f":"VLOOKUP(A34,CPU!$A$1:$N$4650,10)","v":3112.71},{"$f":"ROUND(F34*H34,2)","v":21788.97}]
[22,"5.3","AQUISIÇÃO DE CONCRETO BETUMINOSO USINADO A QUENTE (CBUQ) PARA PAVIMENTACAO ASFALTICA, PADRAO DNIT, FAIXA C, COM CAP 50/70 - EXCLUSIVE TRANSPORTE","CPU.8","T",1099.9960000000003,{"$f":"VLOOKUP(A35,CPU!$A$1:$N$4650,9)","v":600},{"$f":"VLOOKUP(A35,CPU!$A$1:$N$4650,10)","v":690},{"$f":"ROUND(F35*H35,2)","v":758997.24}]
[null,"TOTAL GERAL DA OBRA COM BDI ",{"$nulls":6},{"$f":"SUM(I9,I15,I23,I28,I32)","v":1915487.1600000001}]

{"sheet":"CPU","index":1,"n_rows":347,"n_cols":13,"rows_kept":347,"cut":false,"hidden":false,"merged":[[336,0,346,0],[336,1,336,3],[336,4,336,7],[337,2,337,5],[338,2,338,3],[339,1,339,7],[343,1,343,3],[343,5,343,6],[344,1,344,6],[345,1,345,6],[346,1,346,6],[324,0,334,0],[324,1,324,3],[324,4,324,7],[325,2,325,5],[326,2,326,3],[327,1,327,7],[331,1,331,3],[331,5,331,6],[332,1,332,6],[333,1,333,6],[334,1,334,6],[312,0,322,0],[312,1,312,3],[312,4,312,7],[313,2,313,5],[314,2,314,3],[315,1,315,7],[319,1,319,3],[319,5,319,6],[320,1,320,6],[321,1,321,6],[322,1,322,6],[294,0,310,0],[294,1,294,3],[294,4,294,7],[295,2,295,5],[296,2,296,3],[297,1,297,7],[307,1,307,3],[307,5,307,6],[308,1,308,6],[309,1,309,6],[310,1,310,6],[276,0,292,0],[276,1,276,3],[276,4,276,7],[277,2,277,5],[278,2,278,3],[279,1,279,7],[289,1,289,3],[289,5,289,6],[290,1,290,6],[291,1,291,6],[292,1,292,6],[257,0,274,0],[257,1,257,3],[257,4,257,7],[257,10,257,11],[258,2,258,5],[259,2,259,3],[260,1,260,7],[271,1,271,3],[271,5,271,6],[272,1,272,6],[273,1,273,6],[274,1,274,6],[245,0,256,0],[245,1,245,3],[245,4,245,7],[245,10,245,11],[246,2,246,5],[247,2,247,3],[248,1,248,7],[252,1,252,3],[252,5,252,6],[253,1,253,6],[254,1,254,6],[255,1,255,6],[232,0,243,0],[232,1,232,3],[232,4,232,7],[233,2,233,5],[234,2,234,3],[235,1,235,7],[240,1,240,3],[240,5,240,6],[241,1,241,6],[242,1,242,6],[243,1,243,6],[219,0,230,0],[219,1,219,3],[219,4,219,7],[219,10,219,11],[220,2,220,5],[221,2,221,3],[222,1,222,7],[227,1,227,3],[227,5,227,6],[228,1,228,6],[229,1,229,6],[230,1,230,6],[206,0,217,0],[206,1,206,3],[206,4,206,7],[206,10,206,11],[207,2,207,5],[208,2,208,3],[209,1,209,7],[214,1,214,3],[214,5,214,6],[215,1,215,6],[216,1,216,6],[217,1,217,6],[184,0,205,0],[184,1,184,3],[184,4,184,7],[184,10,184,11],[185,2,185,5],[186,2,186,3],[187,1,187,7],[189,8,189,9],[201,1,201,3],[201,5,201,6],[202,1,202,6],[203,1,203,6],[204,1,204,6],[165,0,183,0],[165,1,165,3],[165,4,165,7],[165,10,165,11],[166,2,166,5],[167,2,167,3],[168,1,168,7],[179,1,179,3],[179,5,179,6],[180,1,180,6],[181,1,181,6],[182,1,182,6],[146,0,164,0],[146,1,146,3],[146,4,146,7],[146,10,146,11],[147,2,147,5],[148,2,148,3],[149,1,149,7],[160,1,160,3],[160,5,160,6],[161,1,161,6],[162,1,162,6],[163,1,163,6],[126,0,144,0],[126,1,126,3],[126,4,126,7],[127,2,127,5],[128,2,128,3],[129,1,129,7],[141,1,141,3],[141,5,141,6],[142,1,142,6],[143,1,143,6],[144,1,144,6],[108,0,125,0],[108,1,108,3],[108,4,108,7],[108,10,108,11],[109,2,109,5],[110,2,110,3],[111,1,111,7],[121,1,121,3],[121,5,121,6],[122,1,122,6],[123,1,123,6],[124,1,124,6],[94,0,106,0],[94,1,94,3],[94,4,94,7],[95,2,95,5],[96,2,96,3],[97,1,97,7],[103,1,103,3],[103,5,103,6],[104,1,104,6],[105,1,105,6],[106,1,106,6],[81,0,93,0],[81,1,81,3],[81,4,81,7],[81,10,81,11],[82,2,82,5],[83,2,83,3],[84,1,84,7],[89,1,89,3],[89,5,89,6],[90,1,90,6],[91,1,91,6],[92,1,92,6],[65,0,80,0],[65,1,65,3],[65,4,65,7],[65,10,65,11],[66,2,66,5],[67,2,67,3],[68,1,68,7],[76,1,76,3],[76,5,76,6],[77,1,77,6],[78,1,78,6],[79,1,79,6],[47,0,64,0],[47,1,47,3],[47,4,47,7],[47,10,47,11],[48,2,48,5],[49,2,49,3],[50,1,50,7],[60,1,60,3],[60,5,60,6],[61,1,61,6],[62,1,62,6],[63,1,63,6],[33,0,46,0],[33,1,33,3],[33,4,33,7],[33,10,33,11],[34,2,34,5],[34,8,35,9],[35,2,35,3],[36,1,36,7],[42,1,42,3],[42,5,42,6],[43,1,43,6],[44,1,44,6],[45,1,45,6],[14,0,32,0],[14,1,14,3],[14,4,14,7],[14,10,14,11],[15,2,15,5],[15,8,16,9],[16,2,16,3],[17,1,17,7],[28,1,28,3],[28,5,28,6],[29,1,29,6],[30,1,30,6],[31,1,31,6],[0,0,13,0],[0,1,0,3],[0,4,0,7],[0,10,0,11],[1,2,1,5],[1,10,1,11],[2,2,2,3],[3,1,3,7],[9,1,9,3],[9,5,9,6],[10,1,10,6],[11,1,11,6],[12,1,12,6]]}
[1,"CODEVASF",null,null," COMPOSIÇÃO DE PREÇO UNITÁRIO",null,null,null,{"$f":"H11","v":12177.04},{"$f":"H13","v":15114.14},"BDI CALCULADO:",null,{"$f":"ORÇAMENTO!I6","v":0.2412}]
[null,"OBRA:  ",{"$f":"ORÇAMENTO!C5","v":"ENGENHEIRO NAVARRO - PAVIMENTAÇÃO ASFÁLTICA EM CBUQ - VIAS DIVERSAS - ITEM 1"},null,null,null,"DATA: ",{"$f":"ORÇAMENTO!C6","v":" OUTUBRO / 2023   "},null,null,"BDI DIFERENCIADO:",null,{"$f":"'BDI FORN'!D31/100","v":0.15}]
[null,"SERVIÇO:  ",{"$f":"VLOOKUP(A1,ORÇAMENTO!A10:I29,3)","v":"MOBILIZAÇÃO E DESMOBILIZAÇÃO"},null,"Referência:","CPU.1","UNIDADE: ",{"$f":"VLOOKUP(A1,ORÇAMENTO!A10:I29,5)","v":"GL"}]
[]
[null,"TIPO ITEM","CODIGO ITEM","DESCRIÇÃO ITEM","UNIDADE ITEM","COEFICIENTE","PRECO UNITARIO","CUSTO TOTAL"]
[null,"COMPOSICAO",89876,"CAMINHÃO BASCULANTE 14 M3, COM CAVALO MECÂNICO DE CAPACIDADE MÁXIMA DE TRAÇÃO COMBINADO DE 36000 KG, POTÊNCIA 286 CV, INCLUSIVE SEMIREBOQUE COM CAÇAMBA METÁLICA ","CHP DIURNO.",8,316.13,{"$f":"ROUNDDOWN(F6*G6,2)","v":2529.04}]
[null,"COMPOSICAO",89877,"CAMINHÃO BASCULANTE 14 M3, COM CAVALO MECÂNICO DE CAPACIDADE MÁXIMA DE TRAÇÃO COMBINADO DE 36000 KG, POTÊNCIA 286 CV, INCLUSIVE SEMIREBOQUE TRAÇÃO ","CHI DIURNO.",8,89.75,{"$f":"ROUNDDOWN(F7*G7,2)","v":718}]
[null,"COMPOSICAO",5914640,"TRANSPORTE COM CAVALO MECÂNICO COM SEMIRREBOQUE COM CAPACIDADE DE 30 T - RODOVIA PAVIMENTADA","T.KM",4354,0.57999999999999996,{"$f":"ROUNDDOWN(F8*G8,2)","v":2525.3200000000002}]
[null,"COMPOSIÇÃO",88316,"SERVENTE COM ENCARGOS COMPLEMENTARES","H",16,19.760000000000002,{"$f":"ROUNDDOWN(F9*G9,2)","v":316.16000000000003}]
[null,"PRODUÇÃO DA EQUIPE",null,null,0.5,"CUSTO ",null,{"$f":"SUM(H6:H9)","v":6088.52}]
[null,"TOTAL",{"$nulls":5},{"$f":"H10/E10","v":12177.04},"OK"]
[null,"BDI                %",{"$nulls":5},{"$f":"1+$M$1","v":1.2412000000000001}]
[null,"TOTAL DO SERVIÇO - R$",{"$nulls":5},{"$f":"ROUND(H11*H12,2)","v":15114.14}]
[]
[{"$f":"A1+1","v":2},"CODEVASF",null,null," COMPOSIÇÃO DE PREÇO UNITÁRIO",null,null,null,{"$f":"H30","v":148591.15},{"$f":"H32","v":184431.34}]
[null,"OBRA:  ",{"$f":"$C$2","v":"ENGENHEIRO NAVARRO - PAVIMENTAÇÃO ASFÁLTICA EM CBUQ - VIAS DIVERSAS - ITEM 1"},null,null,null,"DATA: ",{"$f":"$H$2","v":" OUTUBRO / 2023   "}]
[null,"SERVIÇO:  ",{"$f":"VLOOKUP(A15,ORÇAMENTO!$A$10:$I$29,3)","v":"ADMINISTRAÇÃO LOCAL"},null,"SINAPI","CPU.2","UNIDADE: ",{"$f":"VLOOKUP(A15,ORÇAMENTO!$A$10:$I$29,5)","v":"GL"}]
[]
[null,"TIPO ITEM","CODIGO ITEM","DESCRIÇÃO ITEM","UNIDADE ITEM","COEFICIENTE","PRECO UNITARIO","CUSTO TOTAL"]
[null,"INSUMO",14250,"ENERGIA ELÉTRICA","kwh",60,0.94,{"$f":"ROUNDDOWN(F20*G20,2)","v":56.4}]
[null,"INSUMO",44480,"TARIFA FORNECIMENTO DE ÁGUA/ESGOTO ","M3",6,17.78,106.68]
[null,"COTAÇÃO","MERC.","TELEFONE (PLANO CONTROLE)","UNID",2,59.9,119.8]
[null,"INSUMO","ED-50155 SEINFRA","BANHEIRO QUÍMICO 110 X 120 X 230 CM COM MANUTENÇÃO (CONSIDERANDO OBRAS SIMULTÂNEAS)","MÊS",2,820,1640]
[null,"COMPOSICAO",90777,"Engenheiro Civil Júnior com encargos complementares","H",55,114.12,6276.6]
[null,"COMPOSICAO",90776,"Encarregado Geral com encargos complementares","H",220,57.73,12700.6]
[null,"COMPOSICAO",88321,"Tecnico de Laboratório com encargos complementares","H",110,45.45,4999.5]
[null,"COMPOSICAO",100309,"Tecnico em Segurança do Trabalho com encargos complementares","H",55,45.71,2514.0500000000002]
[null,"COMPOSICAO",90772,"Auxiliar de escritório com encargos complementares","H",55,23.72,1304.5999999999999]
[null,"PRODUÇÃO DA EQUIPE",null,null,0.2,"CUSTO ",null,{"$f":"SUM(H20:H28)","v":29718.23}]
[null,"TOTAL",{"$nulls":5},{"$f":"ROUND(H29/E29,2)","v":148591.15},"OK"]
[null,"BDI                %",{"$nulls":5},{"$f":"1+$M$1","v":1.2412000000000001}]
[null,"TOTAL DO SERVIÇO - R$",{"$nulls":5},{"$f":"ROUND(H30*H31,2)","v":184431.34}]
[]
[{"$f":"A15+1","v":3},"CODEVASF",null,null," COMPOSIÇÃO DE PREÇO UNITÁRIO",null,null,null,{"$f":"H44","v":11706.75},{"$f":"H46","v":14530.42}]
[null,"OBRA:  ",{"$f":"$C$2","v":"ENGENHEIRO NAVARRO - PAVIMENTAÇÃO ASFÁLTICA EM CBUQ - VIAS DIVERSAS - ITEM 1"},null,null,null,"DATA: ",{"$f":"$H$2","v":" OUTUBRO / 2023   "}]
[null,"SERVIÇO:  ",{"$f":"VLOOKUP(A34,ORÇAMENTO!$A$10:$I$29,3)","v":"CANTEIRO DE OBRAS"},null,"SINAPI",{"$f":"VLOOKUP(A34,ORÇAMENTO!$A$10:$I$29,4)","v":"CPU.3"},"UNIDADE: ",{"$f":"VLOOKUP(A34,ORÇAMENTO!$A$10:$I$29,5)","v":"GL"}]
[]
[null,"TIPO ITEM","CODIGO ITEM","DESCRIÇÃO ITEM","UNIDADE ITEM","COEFICIENTE","PRECO UNITARIO","CUSTO TOTAL"]
[null,"INSUMO",10775,"LOCACAO DE CONTAINER COM 1 SANITARIO, PARA ESCRITORIO,COMPLETO, SEM DIVISORIAS INTERNAS","MÊS",5,975,{"$f":"ROUNDDOWN(F39*G39,2)","v":4875}]
[null,"INSUMO",10779,"LOCACAO DE CONTAINER P/ SANITARIO, C/ 5 BACIAS, 1 LAVATORIO E 4 MICTORIOS","MÊS",5,1218.75,6093.75]
[null,"INSUMO","37525","TELA PLASTICA TECIDA LISTRADA BRANCA E LARANJA, TIPO GUARDA CORPO, EM POLIETILENO MONOFILADO, ROLO 1,20 X 50 M (L X C)","M",200,3.69,738]
[{"$nulls":7},0]
[null,"PRODUÇÃO DA EQUIPE",null,null,1,"CUSTO ",null,{"$f":"SUM(H39:H42)","v":11706.75}]
[null,"TOTAL",{"$nulls":5},{"$f":"H43/E43","v":11706.75},"OK"]
[null,"BDI                %",{"$nulls":5},{"$f":"1+$M$1","v":1.2412000000000001}]
[null,"TOTAL DO SERVIÇO - R$",{"$nulls":5},{"$f":"ROUND(H44*H45,2)","v":14530.42}]
[]
[{"$f":"A34+1","v":4},"CODEVASF",null,null," COMPOSIÇÃO DE PREÇO UNITÁRIO",null,null,null,{"$f":"H62","v":340.5},{"$f":"H64","v":422.63}]
[null,"OBRA:  ",{"$f":"$C$2","v":"ENGENHEIRO NAVARRO - PAVIMENTAÇÃO ASFÁLTICA EM CBUQ - VIAS DIVERSAS - ITEM 1"},null,null,null,"DATA: ",{"$f":"$H$2","v":" OUTUBRO / 2023   "}]
[null,"SERVIÇO:  ",{"$f":"VLOOKUP(A48,ORÇAMENTO!$A$10:$I$29,3)","v":"PLACA DE OBRA EM CHAPA DE AÇO GALVANIZADO"},null,"SINAPI",{"$f":"VLOOKUP(A48,ORÇAMENTO!$A$10:$I$29,4)","v":103689},"UNIDADE: ",{"$f":"VLOOKUP(A48,ORÇAMENTO!$A$10:$I$29,5)","v":"M2"}]
[]
[null,"TIPO ITEM","CODIGO ITEM","DESCRIÇÃO ITEM","UNIDADE ITEM","COEFICIENTE","PRECO UNITARIO","CUSTO TOTAL"]
[null,"INSUMO","4509","SARRAFO *2,5 X 10* CM EM PINUS, MISTA OU EQUIVALENTE DA REGIAO - BRUTA","M","3,2083000","4,41",{"$f":"ROUNDDOWN(F53*G53,2)","v":14.14}]
[null,"INSUMO","4813","PLACA DE OBRA (PARA CONSTRUCAO CIVIL) EM CHAPA GALVANIZADA *N. 22*, ADESIVADA, DE *2,4 X 1,2* M (SEM POSTES PARA FIXACAO)","M2","1,0000000","250,00",250]
[null,"INSUMO","5065","PREGO DE ACO POLIDO COM CABECA 10 X 10 ","KG","0,0113000","36,57",0.41]
[null,"INSUMO","5069","PREGO DE ACO POLIDO COM CABECA 17 X 27 ","KG","0,0132000","19,59",0.25]
[null,"COMPOSICAO","88262","CARPINTEIRO DE FORMAS COM ENCARGOS COMPLEMENTARES","H","0,3729000","27,05",10.08]
[null,"COMPOSICAO","88316","SERVENTE COM ENCARGOS COMPLEMENTARES","H","1,1186000","19,76",22.1]
[null,"COMPOSICAO",4115,"MADEIRA ROLICA TRATADA, D = 12 A 15 CM, H = 3,00 M, EM EUCALIPTO OU EQUIVALENTE","M",2,21.76,43.52]
[{"$nulls":7},0]
{"$rows_left_out":288}
{"sheet":"BDI SERV","index":2,"n_rows":37,"n_cols":5,"rows_kept":37,"cut":false,"hidden":false,"merged":[[31,1,31,2],[32,0,34,5],[32,6,35,8],[36,0,36,5],[0,1,2,4],[3,1,4,1],[3,2,4,2],[28,0,28,5],[30,1,30,2]]}
[null,"DETALHAMENTO DO BDI - SERVIÇOS"]
[]
[]
[null,"Item","Descrição dos Serviços","%","%"]
[null,null,null,"PV","CD"]
[]
[null,1,"ADMINISTRAÇÃO CENTRAL"," ",4.01]
[null,"1.1","ESCRITÓRIO CENTRAL"," "," "]
[null,"1.2","VIAGENS"," "," "]
[null,"1.3","OUTROS"," "," "]
[null," "," "," "," "]
[null,2,"IMPOSTOS E TAXAS",{"$f":"SUM(D13:D16)","v":7.65},{"$f":"SUM(E13:E16)","v":9.57}]
[null,"2.1","ISS (*)",{"$f":"5*0.8","v":4},{"$f":"ROUND(D13*1.2515,2)","v":5.01}]
[null,"2.2","PIS",0.65,{"$f":"ROUND(D14*1.2515,2)","v":0.81}]
[null,"2.3","Cofins",3,{"$f":"ROUND(D15*1.2515,2)","v":3.75}]
[null,"2.4","CONTRIBUIÇÃO PREVIDENCIÁRIA SOBRE A RENDA BRUTA",0,{"$f":"ROUND(D16*1.2515,2)","v":0}]
[]
[null,3,"TAXA DE RISCO"," ",{"$f":"SUM(E19:E22)","v":0.96}]
[null,"3.1","SEGURO",null,0.2]
[null,"3.2","RISCO",null,0.56000000000000005]
[null,"3.3","GARANTIA",null,0.2]
[]
[null,4,"DESPESAS FINANCEIRAS"," ",1.1100000000000001]
[]
[null,5,"LUCRO",null,8]
[]
[null," ","BDI - CALCULADO"," ",{"$f":"ROUND((((1+(E7+E18)/100)*(1+E23/100)*(1+E25/100)/(1-D12/100)-1)*100),2)","v":24.12}]
[]
["BDI = ((1+((AC+S+R+G)/100))x(1+DF/100)x(1+L/100)/(1-I/100)-1)*100"]
[]
[null,"BDI (CALCULADO):",null,{"$f":"ROUND((((1+((E7+E18)/100))*(1+E23/100)*(1+E25/100))/(1-D12/100)-1)*100,2)","v":24.12},"%"]
[null," "]
["(*) ISS CONFORME LEI MUNICIPAL - Considerando as deduções previstas no Art. 4º - PARÁGRAFO ÚNICO\n(Quantidade Estimada de Materiais: 20% - Materiais Asfálticos com BDI DIferenciado )"]
[]
[]
[]
["BDI EM CONFORMIDADE COM OS ACÓRDÃOS Nº 2369/2011 e ACÓRDÃO Nº 2.622/2013 - TCU - PLENÁRIO"]

{"sheet":"BDI FORN","index":3,"n_rows":37,"n_cols":5,"rows_kept":37,"cut":false,"hidden":false,"merged":[[31,1,31,2],[32,0,34,5],[36,0,36,5],[0,1,2,4],[3,1,4,1],[3,2,4,2],[28,0,28,5],[30,1,30,2]]}
[null,"DETALHAMENTO DO BDI - FORNECIMENTO \n(MATERIAL ASFÁLTICO)"]
[]
[]
[null,"Item","Descrição dos Serviços","%","%"]
[null,null,null,"PV","CD"]
[]
[null,1,"ADMINISTRAÇÃO CENTRAL"," ",3.72]
[null,"1.1","ESCRITÓRIO CENTRAL"," "," "]
[null,"1.2","VIAGENS"," "," "]
[null,"1.3","OUTROS"," "," "]
[null," "," "," "," "]
[null,2,"IMPOSTOS E TAXAS",{"$f":"SUM(D13:D16)","v":3.65},{"$f":"SUM(E13:E16)","v":4.5600000000000005}]
[null,"2.1","ISS (*)",null,{"$f":"ROUND(D13*1.2515,2)","v":0}]
[null,"2.2","PIS",0.65,{"$f":"ROUND(D14*1.2515,2)","v":0.81}]
[null,"2.3","Cofins",3,{"$f":"ROUND(D15*1.2515,2)","v":3.75}]
[null,"2.4","CONTRIBUIÇÃO PREVIDENCIÁRIA SOBRE A RENDA BRUTA",0,{"$f":"ROUND(D16*1.2515,2)","v":0}]
[]
[null,3,"TAXA DE RISCO"," ",{"$f":"SUM(E19:E22)","v":0.82000000000000006}]
[null,"3.1","SEGURO",null,0.16]
[null,"3.2","RISCO",null,0.5]
[null,"3.3","GARANTIA",null,0.16]
[]
[null,4,"DESPESAS FINANCEIRAS"," ",0.94]
[]
[null,5,"LUCRO",null,5]
[]
[null," ","BDI - CALCULADO"," ",{"$f":"ROUND((((1+(E7+E18)/100)*(1+E23/100)*(1+E25/100)/(1-D12/100)-1)*100),2)","v":15}]
[]
["BDI = ((1+((AC+S+R+G)/100))x(1+DF/100)x(1+L/100)/(1-I/100)-1)*100"]
[]
[null,"BDI (CALCULADO):",null,{"$f":"ROUND((((1+((E7+E18)/100))*(1+E23/100)*(1+E25/100))/(1-D12/100)-1)*100,2)","v":15},"%"]
[null," "]
[]
[]
[]
[]
["BDI EM CONFORMIDADE COM OS ACÓRDÃOS Nº 2369/2011 e ACÓRDÃO Nº 2.622/2013 - TCU - PLENÁRIO"]

{"sheet":"CRONOGRAMA","index":4,"n_rows":19,"n_cols":11,"rows_kept":19,"cut":false,"hidden":false,"merged":[[13,0,14,0],[13,1,14,1],[13,2,14,2],[15,1,16,2],[18,1,22,10],[9,0,10,0],[9,1,10,1],[9,2,10,2],[11,0,12,0],[11,1,12,1],[11,2,12,2],[3,1,3,9],[5,0,6,0],[5,1,6,1],[5,2,6,2],[7,0,8,0],[7,1,8,1],[7,2,8,2],[0,1,0,10],[1,1,2,1],[1,2,2,4],[1,6,1,10],[2,6,2,10]]}
[null,"CRONOGRAMA FÍSICO-FINANCEIRO"]
[null,"OBRA: ",{"$f":"ORÇAMENTO!C5","v":"ENGENHEIRO NAVARRO - PAVIMENTAÇÃO ASFÁLTICA EM CBUQ - VIAS DIVERSAS - ITEM 1"},null,null,"VALOR:",{"$f":"ORÇAMENTO!I36","v":1915487.1600000001}]
[{"$nulls":5},"PRAZO: ","150 DIAS "]
[]
[null,"ITEM","ETAPAS/DESCRIÇAO","FISICO/  FINANCEIRO","TOTAL    ETAPAS","MÊS 1","MÊS 2","MÊS 3","MÊS 4","MÊS 5","TOTAL"]
["A",{"$f":"VLOOKUP(A6,ORÇAMENTO!$A$9:$I$36,2)","v":1},{"$f":"VLOOKUP(A6,ORÇAMENTO!$A$9:$I$36,3)","v":"SERVIÇOS PRELIMINARES "},"FISICO ",{"$f":"ROUND(E7/$G$2,4)","v":0.11650000000000001},0.2,0.2,0.2,0.2,0.2,{"$f":"SUM(F6:J6)","v":1}]
[null,null,null,"FINANCEIRO",{"$f":"ORÇAMENTO!I9","v":223171.68},{"$f":"ROUND($E$7*F6,2)","v":44634.34},44634.34,44634.34,44634.34,44634.34,{"$f":"SUM(F7:J7)","v":223171.69999999998}]
["B",{"$f":"VLOOKUP(A8,ORÇAMENTO!$A$9:$I$36,2)","v":2},{"$f":"VLOOKUP(A8,ORÇAMENTO!$A$9:$I$36,3)","v":"TERRAPLANAGEM E PAVIMENTAÇÃO"},"FISICO ",{"$f":"ROUND(E9/$G$2,4)","v":0.13700000000000001},0.2,0.2,0.2,0.2,0.2,{"$f":"SUM(F8:J8)","v":1}]
[null,null,null,"FINANCEIRO",{"$f":"ORÇAMENTO!I15","v":262475.2},{"$f":"ROUND($E$9*F8,2)","v":52495.040000000001},52495.040000000001,52495.040000000001,52495.040000000001,52495.040000000001,{"$f":"SUM(F9:J9)","v":262475.2}]
["C",{"$f":"VLOOKUP(A10,ORÇAMENTO!$A$9:$I$36,2)","v":3},{"$f":"VLOOKUP(A10,ORÇAMENTO!$A$9:$I$36,3)","v":"TRANSPORTE DE MATERIAIS"},"FISICO ",{"$f":"ROUND(E11/$G$2,4)","v":8.2900000000000001E-2},0.2,0.2,0.2,0.2,0.2,{"$f":"SUM(F10:J10)","v":1}]
[null,null,null,"FINANCEIRO",{"$f":"ORÇAMENTO!I23","v":158779.99},{"$f":"ROUND($E$11*F10,2)","v":31756},31756,31756,31756,31756,{"$f":"SUM(F11:J11)-0.04","v":158779.96}]
["D",{"$f":"VLOOKUP(A12,ORÇAMENTO!$A$9:$I$36,2)","v":4},{"$f":"VLOOKUP(A12,ORÇAMENTO!$A$9:$I$36,3)","v":"OBRAS COMPLEMENTARES"},"FISICO ",{"$f":"ROUND(E13/$G$2,4)","v":0.21879999999999999},0,0.25,0.25,0.25,0.25,{"$f":"SUM(F12:J12)","v":1}]
[null,null,null,"FINANCEIRO",{"$f":"ORÇAMENTO!I28","v":419130.02},{"$f":"ROUND($E$13*F12,2)","v":0},104782.51,104782.51,104782.51,104782.51,{"$f":"SUM(F13:J13)-0.02","v":419130.01999999996}]
["E",{"$f":"VLOOKUP(A14,ORÇAMENTO!$A$9:$I$36,2)","v":5},{"$f":"VLOOKUP(A14,ORÇAMENTO!$A$9:$I$36,3)","v":"FORNECIMENTOS - MATERIAL ASFÁLTICO (BDI DIFERENCIADO)"},"FISICO ",{"$f":"ROUND(E15/$G$2,4)","v":0.44479999999999997},0.2,0.2,0.2,0.2,0.2,{"$f":"SUM(F14:J14)","v":1}]
[null,null,null,"FINANCEIRO",{"$f":"ORÇAMENTO!I32","v":851930.27},{"$f":"ROUND($E$15*F14,2)","v":170386.05},170386.05,170386.05,170386.05,170386.05,{"$f":"SUM(F15:J15)-0.02","v":851930.23}]
[null,"TOTAL",null,"FISICO ",{"$f":"SUM(F16:J16)","v":1.0000000156618121},{"$f":"F17/$E$17","v":0.15623776355671315},0.21094056302627473,0.21094056302627473,0.21094056302627473,0.21094056302627473,{"$f":"SUM(F16:J16)","v":1.0000000156618121}]
[null,null,null,"FINANCEIRO",{"$f":"E11+E9+E7+E13+E15","v":1915487.1600000001},299271.43,404053.94,404053.94,404053.94,404053.94,{"$f":"SUM(F17:J17)-0.03","v":1915487.16}]
[]
[null,"OBSERVAÇÕES:"]