{"text_format":"2","workbook":"xlsx","n_sheets":5,"sheets":["ORÇAMENTO","CPU","BDI SERV","BDI FORN","CRONOGRAMA"],"not_rendered":{"charts":0,"images":3,"macros":0,"external_links":0,"defined_names":5,"comments":1,"pivot_tables":0},"unopened":[],"bounds":{"document_bytes":16777216,"sheet_cells":100000,"run_cost":"one","rows_first":2000,"rows_last":500,"rows_between":2000,"halvings":0,"cell_chars":16384,"cell_head_chars":4096},"cells_cut":0,"cells_raw":0,"read":"whole","date_system":"1900"}

{"sheet":"ORÇAMENTO","index":0,"n_rows":40,"n_cols":9,"rows_kept":40,"cut":false,"hidden":false,"merged":[[39,1,39,2],[0,0,7,0],[0,2,0,8],[1,2,1,8],[2,2,2,8],[4,2,4,8],[5,6,5,7],[6,1,6,2],[6,6,6,7]]}
["<---- NUMERAR SERVIÇOS PARA CPU",null,"Ministério do Desenvolvimento Regional"]
[null,null,"Companhia de Desenvolvimento dos Vales do São Francisco e do Parnaíba"]
[null,null,"1ª Superintendência Regional"]
[]
[null,"OBRA: ","PAVIMENTAÇÃO ASFÁLTICA EM CBUQ - ESTRADA VICINAL DE LIGAÇÃO AO DISTRITO DE SERRA DO MUNHO (TIROS / MG)"]
[null,"DATA:"," SETEMBRO / 2023   ",null,null,null,"BDI Serviços:",null,{"$f":"'BDI SERV'!D31/100","v":0.22010000000000002}]
[null,"PRAZO DE EXECUÇÃO:     180 DIAS",{"$nulls":4},"BDI Fornecimentos:",null,{"$f":"'BDI FORN'!D31/100","v":0.15}]
[null,"ITEM","DISCRIMINAÇÃO","REFER.","UNID.","QUANT.","P. UNITÁRIO","P.UNIT.C/ BDI","P. TOTAL"]
["A",1,"SERVIÇOS PRELIMINARES ",{"$nulls":5},{"$f":"SUM(I10:I14)","v":297578.78000000003}]
[1,"1.1","MOBILIZAÇÃO E DESMOBILIZAÇÃO (INCLUSIVE ENTRE TRECHOS)","CPU.1","GL",1,{"$f":"VLOOKUP(A10,CPU!$A$1:$N$4688,9)","v":20144.439999999999},{"$f":"VLOOKUP(A10,CPU!$A$1:$N$4688,10)","v":24578.23},{"$f":"ROUND(F10*H10,2)","v":24578.23}]
[2,"1.2","ADMINISTRAÇÃO LOCAL","CPU.2","GL",1,{"$f":"VLOOKUP(A11,CPU!$A$1:$N$4688,9)","v":193753.08},{"$f":"VLOOKUP(A11,CPU!$A$1:$N$4688,10)","v":236398.13},{"$f":"ROUND(F11*H11,2)","v":236398.13}]
[3,"1.3","CANTEIRO DE OBRAS ","CPU.3","GL",1,{"$f":"VLOOKUP(A12,CPU!$A$1:$N$4688,9)","v":13531.5},{"$f":"VLOOKUP(A12,CPU!$A$1:$N$4688,10)","v":16509.78},{"$f":"ROUND(F12*H12,2)","v":16509.78}]
[4,"1.4","PLACA DE OBRA EM CHAPA DE AÇO GALVANIZADO",103689,"M2",6,{"$f":"VLOOKUP(A13,CPU!$A$1:$N$4688,9)","v":340.5},{"$f":"VLOOKUP(A13,CPU!$A$1:$N$4688,10)","v":415.44},{"$f":"ROUND(F13*H13,2)","v":2492.64}]
[5,"1.5","SERVIÇOS TOPOGRÁFICOS PARA PAVIMENTAÇÃO, INCLUSIVE NOTA DE SERVIÇO, ACOMPANHAMENTO E GREIDE",78472,"M2",44000,{"$f":"VLOOKUP(A14,CPU!$A$1:$N$4688,9)","v":0.32999999999999996},{"$f":"VLOOKUP(A14,CPU!$A$1:$N$4688,10)","v":0.4},{"$f":"ROUND(F14*H14,2)","v":17600}]
["B",2,"TERRAPLANAGEM E PAVIMENTAÇÃO",{"$nulls":5},{"$f":"SUM(I16:I22)","v":728062.2}]
[6,"2.1","ESCAVAÇÃO HORIZONTAL EM SOLO DE 1A CATEGORIA ",101116,"M3",17600,{"$f":"VLOOKUP(A16,CPU!$A$1:$N$4688,9)","v":2.2000000000000002},{"$f":"VLOOKUP(A16,CPU!$A$1:$N$4688,10)","v":2.68},{"$f":"ROUND(F16*H16,2)","v":47168}]
[7,"2.2","CARGA, MANOBRA E DESCARGA DE SOLOS E MATERIAIS GRANULARES EM CAMINHÃO BASCULANTE",100976,"M3",17600,{"$f":"VLOOKUP(A17,CPU!$A$1:$N$4688,9)","v":5.22},{"$f":"VLOOKUP(A17,CPU!$A$1:$N$4688,10)","v":6.37},112112]
[8,"2.3","REGULARIZAÇÃO E COMPACTAÇÃO DO SUBLEITO ",100576,"M2",44000,{"$f":"VLOOKUP(A18,CPU!$A$1:$N$4688,9)","v":2.57},{"$f":"VLOOKUP(A18,CPU!$A$1:$N$4688,10)","v":3.14},138160]
[9,"2.4","EXECUÇÃO E COMPACTAÇÃO DE BASE E OU SUB BASE PARA PAVIMENTAÇÃO DE SOLOS DE COMPORTAMENTO LATERÍTICO (ARENOSO) - EXCLUSIVE SOLO, ESCAVAÇÃO, CARGA E TRANSPORTE",96388,"M3",8800,{"$f":"VLOOKUP(A19,CPU!$A$1:$N$4688,9)","v":12.469999999999999},{"$f":"VLOOKUP(A19,CPU!$A$1:$N$4688,10)","v":15.21},133848]
[10,"2.5","IMPRIMAÇÃO COM EMULSÃO ASFÁLTICA (EAI)",96401,"M2",44000,{"$f":"VLOOKUP(A20,CPU!$A$1:$N$4688,9)","v":1.23},{"$f":"VLOOKUP(A20,CPU!$A$1:$N$4688,10)","v":1.5},66000]
[11,"2.6","PINTURA DE LIGAÇÃO COM EMULSÃO ASFÁLTICA RR-1C",96402,"M2",38500,{"$f":"VLOOKUP(A21,CPU!$A$1:$N$4688,9)","v":1.01},{"$f":"VLOOKUP(A21,CPU!$A$1:$N$4688,10)","v":1.23},47355]
[12,"2.7","EXECUÇÃO DE PAVIMENTO COM APLICAÇÃO DE CONCRETO ASFÁLTICO USINADO A QUENTE (CBUQ), CAMADA DE ROLAMENTO - EXCLUSIVE TRANSPORTE",95995,"M3",1160,{"$f":"VLOOKUP(A22,CPU!$A$1:$N$4688,9)","v":129.6},{"$f":"VLOOKUP(A22,CPU!$A$1:$N$4688,10)","v":158.12},183419.2]
["C",3,"TRANSPORTE DE MATERIAIS",{"$nulls":5},{"$f":"SUM(I24:I25)","v":182410}]
[13,"3.1","TRANSPORTE COM CAMINHÃO BASCULANTE, EM VIA URBANA PAVIMENTADA",95427,"M3XKM",199999.995,{"$f":"VLOOKUP(A24,CPU!$A$1:$N$4688,9)","v":0.73},{"$f":"VLOOKUP(A24,CPU!$A$1:$N$4688,10)","v":0.89},{"$f":"ROUND(F24*H24,2)","v":178000}]
[14,"3.2","TRANSPORTE COM CAMINHÃO CARROCERIA 9T, EM VIA URBANA PAVIMENTADA",100947,"TXKM",3500.0020960000002,{"$f":"VLOOKUP(A25,CPU!$A$1:$N$4688,9)","v":1.03},{"$f":"VLOOKUP(A25,CPU!$A$1:$N$4688,10)","v":1.26},{"$f":"ROUND(F25*H25,2)","v":4410}]
["D",4,"TRANSPORTE DE MATERIAL ASFÁLTICO (BDI DIFERENCIADO)",{"$nulls":5},{"$f":"SUM(I27:I28)","v":182600}]
[15,"4.1","TRANSPORTE DE MASSA ASFÁLTICA COM CAMINHÃO BASCULANTE, EM VIA URBANA PAVIMENTADA (BDI DIFERENCIADO)",95430,"TXKM",320000,{"$f":"VLOOKUP(A27,CPU!$A$1:$N$4688,9)","v":0.44999999999999996},{"$f":"VLOOKUP(A27,CPU!$A$1:$N$4688,10)","v":0.52},{"$f":"ROUND(F27*H27,2)","v":166400}]
[16,"4.2","TRANSPORTE COM CAMINHÃO TANQUE DE TRANSPORTE DE MATERIAL ASFÁLTICO DE 30000 L, EM VIA URBANA PAVIMENTADA (BDI DIFERENCIADO)",102331,"TXKM",27000,{"$f":"VLOOKUP(A28,CPU!$A$1:$N$4688,9)","v":0.52},{"$f":"VLOOKUP(A28,CPU!$A$1:$N$4688,10)","v":0.6},{"$f":"ROUND(F28*H28,2)","v":16200}]
["E",5,"DRENAGEM E OBRAS COMPLEMENTARES",{"$nulls":5},{"$f":"SUM(I30:I35)","v":1235922}]
[17,"5.1","GUIA (MEIO-FIO) E SARJETA CONJUGADOS DE CONCRETO, MOLDADA IN LOCO EM COM EXTRUSORA, 65 CM BASE (15 CM BASE DA GUIA + 50 CM BASE DA SARJETA) X 22 CM ALTURA ",94271,"M",11000,{"$f":"VLOOKUP(A30,CPU!$A$1:$N$4688,9)","v":62.759999999999991},{"$f":"VLOOKUP(A30,CPU!$A$1:$N$4688,10)","v":76.569999999999993},{"$f":"ROUND(F30*H30,2)","v":842270}]
[18,"5.2","DESCIDA D’ÁGUA DE ATERROS EM DEGRAUS - DAD 04 - AREIA E BRITA COMERCIAIS",2003411,"M",75,{"$f":"VLOOKUP(A31,CPU!$A$1:$N$4688,9)","v":603.86},{"$f":"VLOOKUP(A31,CPU!$A$1:$N$4688,10)","v":736.77},{"$f":"ROUND(F31*H31,2)","v":55257.75}]
[19,"5.2","BACIA DE DISSIPAÇÃO, TIPO BACIA EM PEDRA DE MÃO FIXADA COM CONCRETO (DEB 01, 02), COM PREPARO MANUAL, FCK = 20 MPA, LANÇADO MANUALMENTE, INCLUINDO MATERIAIS E FÔRMAS",103930,"M3",15,{"$f":"VLOOKUP(A32,CPU!$A$1:$N$4688,9)","v":781.01},{"$f":"VLOOKUP(A32,CPU!$A$1:$N$4688,10)","v":952.91},14293.65]
[20,"5.3","FORNECIMENTO E INSTALAÇÃO DE PLACA DE SINALIZAÇÃO VIÁRIA - REGULAMENTAÇÃO CIRCULAR OU QUADRADA","CPU.4","UN.",40,{"$f":"VLOOKUP(A33,CPU!$A$1:$N$4688,9)","v":264.27},{"$f":"VLOOKUP(A33,CPU!$A$1:$N$4688,10)","v":322.44},12897.6]
[21,"5.4","FORNECIMENTO E COLOCAÇÃO DE TACHA REFLETIVA EM PLÁSTICO INJETADO, BIDIRECIONAL, TIPO 1 (VERMELHA, AMARELA OU BRANCA)","CPU.5","UN.",2900,{"$f":"VLOOKUP(A34,CPU!$A$1:$N$4688,9)","v":31.53},{"$f":"VLOOKUP(A34,CPU!$A$1:$N$4688,10)","v":38.47},111563]
[22,"5.5","PINTURA DE EIXO VIÁRIO SOBRE ASFALTO COM TINTA RETRORREFLETIVA A BASE DE RESINA ACRÍLICA COM MICROESFERAS DE VIDRO, APLICAÇÃO MECÂNICA COM DEMARCADORA AUTOPROPELIDA",102512,"M",28000,{"$f":"VLOOKUP(A35,CPU!$A$1:$N$4688,9)","v":5.84},{"$f":"VLOOKUP(A35,CPU!$A$1:$N$4688,10)","v":7.13},{"$f":"ROUND(F35*H35,2)","v":199640}]
["F",6,"FORNECIMENTOS - MATERIAL ASFÁLTICO (BDI DIFERENCIADO)",{"$nulls":5},{"$f":"SUM(I37:I39)","v":2251699.2399999998}]
[25,"6.1","AQUISIÇÃO DE EMULSÃO ASFÁLTICA PARA IMPRIMAÇÃO (EAI) - EXCLUSIVE TRANSPORTE","CPU.7","T",60,{"$f":"VLOOKUP(A37,CPU!$A$1:$N$4688,9)","v":2812.65},{"$f":"VLOOKUP(A37,CPU!$A$1:$N$4688,10)","v":3234.55},{"$f":"ROUND(F37*H37,2)","v":194073}]
[26,"6.2","AQUISIÇÃO DE EMULSAO ASFALTICA CATIONICA RR-1C - EXCLUSIVE TRANSPORTE","CPU.8","T",17.995000000000001,{"$f":"VLOOKUP(A38,CPU!$A$1:$N$4688,9)","v":2736.39},{"$f":"VLOOKUP(A38,CPU!$A$1:$N$4688,10)","v":3146.85},{"$f":"ROUND(F38*H38,2)","v":56627.57}]
[27,"6.3","AQUISIÇÃO DE CONCRETO BETUMINOSO USINADO A QUENTE (CBUQ) PARA PAVIMENTACAO ASFALTICA, PADRAO DNIT, FAIXA C, COM CAP 50/70 - EXCLUSIVE TRANSPORTE","CPU.9","T",2999.998,{"$f":"VLOOKUP(A39,CPU!$A$1:$N$4688,9)","v":580},{"$f":"VLOOKUP(A39,CPU!$A$1:$N$4688,10)","v":667},{"$f":"ROUND(F39*H39,2)","v":2000998.67}]
[null,"TOTAL GERAL DA OBRA COM BDI ",{"$nulls":6},{"$f":"SUM(I9,I15,I23,I29,I36,I26)","v":4878272.22}]

{"sheet":"CPU","index":1,"n_rows":385,"n_cols":18,"rows_kept":385,"cut":false,"hidden":false,"merged":[[273,0,287,0],[273,1,273,3],[273,4,273,7],[274,2,274,5],[275,2,275,3],[276,1,276,7],[284,1,284,3],[284,5,284,6],[285,1,285,6],[286,1,286,6],[287,1,287,6],[375,0,384,0],[375,1,375,3],[375,4,375,7],[376,2,376,5],[377,2,377,3],[378,1,378,7],[381,1,381,3],[381,5,381,6],[382,1,382,6],[383,1,383,6],[384,1,384,6],[364,0,373,0],[364,1,364,3],[364,4,364,7],[365,2,365,5],[366,2,366,3],[367,1,367,7],[370,1,370,3],[370,5,370,6],[371,1,371,6],[372,1,372,6],[373,1,373,6],[353,0,362,0],[353,1,353,3],[353,4,353,7],[354,2,354,5],[355,2,355,3],[356,1,356,7],[359,1,359,3],[359,5,359,6],[360,1,360,6],[361,1,361,6],[362,1,362,6],[335,0,351,0],[335,1,335,3],[335,4,335,7],[336,2,336,5],[337,2,337,3],[338,1,338,7],[348,1,348,3],[348,5,348,6],[349,1,349,6],[350,1,350,6],[351,1,351,6],[319,0,333,0],[319,1,319,3],[319,4,319,7],[320,2,320,5],[321,2,321,3],[322,1,322,7],[330,1,330,3],[330,5,330,6],[331,1,331,6],[332,1,332,6],[333,1,333,6],[302,0,317,0],[302,1,302,3],[302,4,302,7],[303,2,303,5],[304,2,304,3],[305,1,305,7],[314,1,314,3],[314,5,314,6],[315,1,315,6],[316,1,316,6],[317,1,317,6],[289,0,300,0],[289,1,289,3],[289,4,289,7],[290,2,290,5],[291,2,291,3],[292,1,292,7],[297,1,297,3],[297,5,297,6],[298,1,298,6],[299,1,299,6],[300,1,300,6],[255,0,271,0],[255,1,255,3],[255,4,255,7],[255,10,255,11],[256,2,256,5],[257,2,257,3],[258,1,258,7],[260,12,262,15],[268,1,268,3],[268,5,268,6],[269,1,269,6],[270,1,270,6],[271,1,271,6],[243,0,254,0],[243,1,243,3],[243,4,243,7],[243,10,243,11],[244,2,244,5],[245,2,245,3],[246,1,246,7],[250,1,250,3],[250,5,250,6],[251,1,251,6],[252,1,252,6],[253,1,253,6],[230,0,241,0],[230,1,230,3],[230,4,230,7],[231,2,231,5],[232,2,232,3],[233,1,233,7],[238,1,238,3],[238,5,238,6],[239,1,239,6],[240,1,240,6],[241,1,241,6],[217,0,228,0],[217,1,217,3],[217,4,217,7],[218,2,218,5],[219,2,219,3],[220,1,220,7],[225,1,225,3],[225,5,225,6],[226,1,226,6],[227,1,227,6],[228,1,228,6],[204,0,215,0],[204,1,204,3],[204,4,204,7],[204,10,204,11],[205,2,205,5],[206,2,206,3],[207,1,207,7],[212,1,212,3],[212,5,212,6],[213,1,213,6],[214,1,214,6],[215,1,215,6],[182,0,203,0],[182,1,182,3],[182,4,182,7],[182,10,182,11],[183,2,183,5],[184,2,184,3],[185,1,185,7],[187,8,187,9],[199,1,199,3],[199,5,199,6],[200,1,200,6],[201,1,201,6],[202,1,202,6],[163,0,181,0],[163,1,163,3],[163,4,163,7],[163,10,163,11],[164,2,164,5],[165,2,165,3],[166,1,166,7],[177,1,177,3],[177,5,177,6],[178,1,178,6],[179,1,179,6],[180,1,180,6],[144,0,162,0],[144,1,144,3],[144,4,144,7],[144,10,144,11],[145,2,145,5],[146,2,146,3],[147,1,147,7],[158,1,158,3],[158,5,158,6],[159,1,159,6],[160,1,160,6],[161,1,161,6],[107,0,124,0],[107,1,107,3],[107,4,107,7],[107,10,107,11],[108,2,108,5],[109,2,109,3],[110,1,110,7],[120,1,120,3],[120,5,120,6],[121,1,121,6],[122,1,122,6],[123,1,123,6],[93,0,105,0],[93,1,93,3],[93,4,93,7],[94,2,94,5],[95,2,95,3],[96,1,96,7],[102,1,102,3],[102,5,102,6],[103,1,103,6],[104,1,104,6],[105,1,105,6],[80,0,92,0],[80,1,80,3],[80,4,80,7],[80,10,80,11],[81,2,81,5],[82,2,82,3],[83,1,83,7],[88,1,88,3],[88,5,88,6],[89,1,89,6],[90,1,90,6],[91,1,91,6],[64,0,79,0],[64,1,64,3],[64,4,64,7],[64,10,64,11],[65,2,65,5],[66,2,66,3],[67,1,67,7],[75,1,75,3],[75,5,75,6],[76,1,76,6],[77,1,77,6],[78,1,78,6],[46,0,63,0],[46,1,46,3],[46,4,46,7],[46,10,46,11],[47,2,47,5],[48,2,48,3],[49,1,49,7],[59,1,59,3],[59,5,59,6],[60,1,60,6],[61,1,61,6],[62,1,62,6],[33,0,45,0],[33,1,33,3],[33,4,33,7],[33,10,33,11],[34,2,34,5],[34,8,35,9],[35,2,35,3],[36,1,36,7],[41,1,41,3],[41,5,41,6],[42,1,42,6],[43,1,43,6],[44,1,44,6],[38,8,39,9],[14,0,32,0],[14,1,14,3],[14,4,14,7],[14,10,14,11],[15,2,15,5],[15,8,16,9],[16,2,16,3],[17,1,17,7],[28,1,28,3],[28,5,28,6],[29,1,29,6],[30,1,30,6],[31,1,31,6],[0,0,13,0],[0,1,0,3],[0,4,0,7],[0,10,0,11],[1,2,1,5],[1,10,1,11],[2,2,2,3],[3,1,3,7],[9,1,9,3],[9,5,9,6],[10,1,10,6],[11,1,11,6],[12,1,12,6],[135,8,136,8],[135,9,136,9],[135,10,136,10],[135,11,136,11],[135,12,136,12],[125,0,142,0],[125,1,125,3],[125,4,125,7],[126,2,126,5],[127,2,127,3],[128,1,128,7],[139,1,139,3],[139,5,139,6],[140,1,140,6],[141,1,141,6],[142,1,142,6]]}
[1,"CODEVASF",null,null," COMPOSIÇÃO DE PREÇO UNITÁRIO",null,null,null,{"$f":"H11","v":20144.439999999999},{"$f":"H13","v":24578.23},"BDI CALCULADO:",null,{"$f":"ORÇAMENTO!I6","v":0.22010000000000002}]
[null,"OBRA:  ",{"$f":"ORÇAMENTO!C5","v":"PAVIMENTAÇÃO ASFÁLTICA EM CBUQ - ESTRADA VICINAL DE LIGAÇÃO AO DISTRITO DE SERRA DO MUNHO (TIROS / MG)"},null,null,null,"DATA: ",{"$f":"ORÇAMENTO!C6","v":" SETEMBRO / 2023   "},null,null,"BDI DIFERENCIADO:",null,{"$f":"'BDI FORN'!D31/100","v":0.15}]
[null,"SERVIÇO:  ",{"$f":"VLOOKUP(A1,ORÇAMENTO!A10:I30,3)","v":"MOBILIZAÇÃO E DESMOBILIZAÇÃO (INCLUSIVE ENTRE TRECHOS)"},null,"Referência:",{"$f":"VLOOKUP(A1,ORÇAMENTO!$A$10:$I$30,4)","v":"CPU.1"},"UNIDADE: ",{"$f":"VLOOKUP(A1,ORÇAMENTO!A10:I30,5)","v":"GL"}]
[]
[null,"TIPO ITEM","CODIGO ITEM","DESCRIÇÃO ITEM","UNIDADE ITEM","COEFICIENTE","PRECO UNITARIO","CUSTO TOTAL"]
[null,"COMPOSICAO",89876,"CAMINHÃO BASCULANTE 14 M3, COM CAVALO MECÂNICO DE CAPACIDADE MÁXIMA DE TRAÇÃO COMBINADO DE 36000 KG, POTÊNCIA 286 CV, INCLUSIVE SEMIREBOQUE COM CAÇAMBA METÁLICA","CHP DIURNO.",16,316.13,{"$f":"ROUNDDOWN(F6*G6,2)","v":5058.08}]
[null,"COMPOSICAO",89877,"CAMINHÃO BASCULANTE 14 M3, COM CAVALO MECÂNICO DE CAPACIDADE MÁXIMA DE TRAÇÃO COMBINADO DE 36000 KG, POTÊNCIA 286 CV, INCLUSIVE SEMIREBOQUE COM CAÇAMBA METÁLICA","CHI DIURNO.",16,89.75,{"$f":"ROUNDDOWN(F7*G7,2)","v":1436}]
[null,"COMPOSICAO",5914640,"TRANSPORTE COM CAVALO MECÂNICO COM SEMIRREBOQUE COM CAPACIDADE DE 30 T - RODOVIA PAVIMENTADA","T.KM",5079,0.57999999999999996,{"$f":"ROUNDDOWN(F8*G8,2)","v":2945.82}]
[null,"COMPOSIÇÃO",88316,"SERVENTE COM ENCARGOS COMPLEMENTARES","H",32,19.760000000000002,{"$f":"ROUNDDOWN(F9*G9,2)","v":632.32000000000005}]
[null,"PRODUÇÃO DA EQUIPE",null,null,0.5,"CUSTO ",null,{"$f":"SUM(H6:H9)","v":10072.219999999999}]
[null,"TOTAL",{"$nulls":5},{"$f":"H10/E10","v":20144.439999999999},"OK"]
[null,"BDI                %",{"$nulls":5},{"$f":"1+$M$1","v":1.2201}]
[null,"TOTAL DO SERVIÇO - R$",{"$nulls":5},{"$f":"ROUND(H11*H12,2)","v":24578.23}]
[]
[{"$f":"A1+1","v":2},"CODEVASF",null,null," COMPOSIÇÃO DE PREÇO UNITÁRIO",null,null,null,{"$f":"H30","v":193753.08},{"$f":"H32","v":236398.13}]
[null,"OBRA:  ",{"$f":"$C$2","v":"PAVIMENTAÇÃO ASFÁLTICA EM CBUQ - ESTRADA VICINAL DE LIGAÇÃO AO DISTRITO DE SERRA DO MUNHO (TIROS / MG)"},null,null,null,"DATA: ",{"$f":"$H$2","v":" SETEMBRO / 2023   "}]
[null,"SERVIÇO:  ",{"$f":"VLOOKUP(A15,ORÇAMENTO!$A$10:$I$30,3)","v":"ADMINISTRAÇÃO LOCAL"},null,"SINAPI",{"$f":"VLOOKUP(A15,ORÇAMENTO!$A$10:$I$30,4)","v":"CPU.2"},"UNIDADE: ",{"$f":"VLOOKUP(A15,ORÇAMENTO!$A$10:$I$30,5)","v":"GL"}]
[]
[null,"TIPO ITEM","CODIGO ITEM","DESCRIÇÃO ITEM","UNIDADE ITEM","COEFICIENTE","PRECO UNITARIO","CUSTO TOTAL"]
[null,"INSUMO",14250,"ENERGIA ELÉTRICA","kwh",60,0.94,{"$f":"ROUNDDOWN(F20*G20,2)","v":56.4}]
[null,"INSUMO",44480,"TARIFA \"A\" - ÁGUA/ESGOTO ","m³",6,17.78,106.68]
[null,"COTAÇÃO","MERC.","TELEFONE (PLANO CONTROLE)","UNID",3,59.9,179.7]
[null,"INSUMO","ED-50155 SEINFRA","BANHEIRO QUÍMICO 110 X 120 X 230 CM COM MANUTENÇÃO (CONSIDERANDO OBRAS SIMULTÂNEAS)","MÊS",2,820,1640]
[null,"COMPOSICAO",90777,"Engenheiro Civil Júnior com encargos complementares","H",55,114.12,6276.6]
[null,"COMPOSICAO",90776,"Encarregado Geral com encargos complementares","H",220,57.73,12700.6]
[null,"COMPOSICAO",88321,"Tecnico de Laboratório com encargos complementares","H",110,45.45,4999.5]
[null,"COMPOSICAO",100309,"Tecnico em Segurança do Trabalho com encargos complementares","H",110,45.71,5028.1000000000004]
[null,"COMPOSICAO",90772,"Auxiliar de escritório com encargos complementares","H",55,23.72,1304.5999999999999]
[null,"PRODUÇÃO DA EQUIPE",null,null,{"$f":"1/F39","v":0.16666666666666666},"CUSTO ",null,{"$f":"SUM(H20:H28)","v":32292.18}]
[null,"TOTAL",{"$nulls":5},{"$f":"ROUND(H29/E29,2)","v":193753.08},"OK"]
[null,"BDI                %",{"$nulls":5},{"$f":"1+$M$1","v":1.2201}]
[null,"TOTAL DO SERVIÇO - R$",{"$nulls":5},{"$f":"ROUND(H30*H31,2)","v":236398.13}]
[]
[{"$f":"A15+1","v":3},"CODEVASF",null,null," COMPOSIÇÃO DE PREÇO UNITÁRIO",null,null,null,{"$f":"H43","v":13531.5},{"$f":"H45","v":16509.78}]
[null,"OBRA:  ",{"$f":"$C$2","v":"PAVIMENTAÇÃO ASFÁLTICA EM CBUQ - ESTRADA VICINAL DE LIGAÇÃO AO DISTRITO DE SERRA DO MUNHO (TIROS / MG)"},null,null,null,"DATA: ",{"$f":"$H$2","v":" SETEMBRO / 2023   "}]
[null,"SERVIÇO:  ",{"$f":"VLOOKUP(A34,ORÇAMENTO!$A$10:$I$30,3)","v":"CANTEIRO DE OBRAS "},null,"SINAPI",{"$f":"VLOOKUP(A34,ORÇAMENTO!$A$10:$I$30,4)","v":"CPU.3"},"UNIDADE: ",{"$f":"VLOOKUP(A34,ORÇAMENTO!$A$10:$I$30,5)","v":"GL"}]
[]
[null,"TIPO ITEM","CODIGO ITEM","DESCRIÇÃO ITEM","UNIDADE ITEM","COEFICIENTE","PRECO UNITARIO","CUSTO TOTAL"]
[null,"INSUMO",10775,"LOCACAO DE CONTAINER 2,30 X 6,00 M, ALT. 2,50 M, COM 1 SANITARIO, PARA ESCRITORIO, COMPLETO, SEM DIVISORIAS INTERNAS","MÊS",6,975,{"$f":"ROUNDDOWN(F39*G39,2)","v":5850}]
[null,"INSUMO",10779,"LOCACAO DE CONTAINER 2,30 X 4,30 M, ALT. 2,50 M, P/ SANITARIO, C/ 5 BACIAS, 1 LAVATORIO E 4 MICTORIOS","MÊS",{"$f":"F39","v":6},1218.75,{"$f":"ROUNDDOWN(F40*G40,2)","v":7312.5}]
[null,"INSUMO","37525","TELA PLASTICA TECIDA LISTRADA BRANCA E LARANJA, TIPO GUARDA CORPO, EM POLIETILENO MONOFILADO, ROLO 1,20 X 50 M (L X C)","M",100,3.69,{"$f":"ROUNDDOWN(F41*G41,2)","v":369}]
[null,"PRODUÇÃO DA EQUIPE",null,null,1,"CUSTO ",null,{"$f":"SUM(H39:H41)","v":13531.5}]
[null,"TOTAL",{"$nulls":5},{"$f":"H42/E42","v":13531.5},"OK"]
[null,"BDI                %",{"$nulls":5},{"$f":"1+$M$1","v":1.2201}]
[null,"TOTAL DO SERVIÇO - R$",{"$nulls":5},{"$f":"ROUND(H43*H44,2)","v":16509.78}]
[]
[{"$f":"A34+1","v":4},"CODEVASF",null,null," COMPOSIÇÃO DE PREÇO UNITÁRIO",null,null,null,{"$f":"H61","v":340.5},{"$f":"H63","v":415.44}]
[null,"OBRA:  ",{"$f":"$C$2","v":"PAVIMENTAÇÃO ASFÁLTICA EM CBUQ - ESTRADA VICINAL DE LIGAÇÃO AO DISTRITO DE SERRA DO MUNHO (TIROS / MG)"},null,null,null,"DATA: ",{"$f":"$H$2","v":" SETEMBRO / 2023   "}]
[null,"SERVIÇO:  ",{"$f":"VLOOKUP(A47,ORÇAMENTO!$A$10:$I$30,3)","v":"PLACA DE OBRA EM CHAPA DE AÇO GALVANIZADO"},null,"SINAPI",{"$f":"VLOOKUP(A47,ORÇAMENTO!$A$10:$I$30,4)","v":103689},"UNIDADE: ",{"$f":"VLOOKUP(A47,ORÇAMENTO!$A$10:$I$30,5)","v":"M2"}]
[]
[null,"TIPO ITEM","CODIGO ITEM","DESCRIÇÃO ITEM","UNIDADE ITEM","COEFICIENTE","PRECO UNITARIO","CUSTO TOTAL"]
[null,"INSUMO","4509","SARRAFO *2,5 X 10* CM EM PINUS, MISTA OU EQUIVALENTE DA REGIAO - BRUTA","M","3,2083000","4,41",{"$f":"ROUNDDOWN(F52*G52,2)","v":14.14}]
[null,"INSUMO","4813","PLACA DE OBRA (PARA CONSTRUCAO CIVIL) EM CHAPA GALVANIZADA *N. 22*, ADESIVADA, DE *2,4 X 1,2* M (SEM POSTES PARA FIXACAO)","M2","1,0000000","250,00",250]
[null,"INSUMO","5065","PREGO DE ACO POLIDO COM CABECA 10 X 10 (7/8 X 17)","KG","0,0113000","36,57",0.41]
[null,"INSUMO","5069","PREGO DE ACO POLIDO COM CABECA 17 X 27 (2 1/2 X 11)","KG","0,0132000","19,59",0.25]
[null,"COMPOSICAO","88262","CARPINTEIRO DE FORMAS COM ENCARGOS COMPLEMENTARES","H","0,3729000","27,05",10.08]
[null,"COMPOSICAO","88316","SERVENTE COM ENCARGOS COMPLEMENTARES","H","1,1186000","19,76",22.1]
[null,"INSUMO",4115,"MADEIRA ROLICA TRATADA, D = 12 A 15 CM, H = 3,00 M, EM EUCALIPTO OU EQUIVALENTE","M",2,21.76,43.52]
[{"$nulls":7},0]
[null,"PRODUÇÃO DA EQUIPE",null,null,1,"CUSTO ",null,{"$f":"SUM(H52:H59)","v":340.5}]
[null,"TOTAL",{"$nulls":5},{"$f":"H60/E60","v":340.5},"OK"]
[null,"BDI                %",{"$nulls":5},{"$f":"1+$M$1","v":1.2201}]
[null,"TOTAL DO SERVIÇO - R$",{"$nulls":5},{"$f":"ROUND(H61*H62,2)","v":415.44}]
[]
[{"$f":"A47+1","v":5},"CODEVASF",null,null," COMPOSIÇÃO DE PREÇO UNITÁRIO",null,null,null,{"$f":"H77","v":0.32999999999999996},{"$f":"H79","v":0.4}]
[null,"OBRA:  ",{"$f":"$C$2","v":"PAVIMENTAÇÃO ASFÁLTICA EM CBUQ - ESTRADA VICINAL DE LIGAÇÃO AO DISTRITO DE SERRA DO MUNHO (TIROS / MG)"},null,null,null,"DATA: ",{"$f":"$H$2","v":" SETEMBRO / 2023   "}]
[null,"SERVIÇO:  ",{"$f":"VLOOKUP(A65,ORÇAMENTO!$A$10:$I$30,3)","v":"SERVIÇOS TOPOGRÁFICOS PARA PAVIMENTAÇÃO, INCLUSIVE NOTA DE SERVIÇO, ACOMPANHAMENTO E GREIDE"},null,"SINAPI",{"$f":"VLOOKUP(A65,ORÇAMENTO!$A$10:$I$30,4)","v":78472},"UNIDADE: ",{"$f":"VLOOKUP(A65,ORÇAMENTO!$A$10:$I$30,5)","v":"M2"}]
[]
[null,"TIPO ITEM","CODIGO ITEM","DESCRIÇÃO ITEM","UNIDADE ITEM","COEFICIENTE","PRECO UNITARIO","CUSTO TOTAL"]
[null,"COMPOSICAO",88253,"AUXILIAR DE TOPÓGRAFO COM ENCARGOS COMPLEMENTARES","H",2.5000000000000001E-3,21.57,{"$f":"ROUNDDOWN(F70*G70,2)","v":0.05}]
[null,"COMPOSICAO",88288,"NIVELADOR COM ENCARGOS COMPLEMENTARES","H",2.5000000000000001E-3,26.99,0.06]
[null,"COMPOSICAO",88316,"SERVENTE COM ENCARGOS COMPLEMENTARES","H",7.4999999999999997E-3,19.760000000000002,0.14000000000000001]
[null,"COMPOSICAO",88597,"DESENHISTA DETALHISTA COM ENCARGOS COMPLEMENTARES ","H",2E-3,29.72,0.05]
[null,"COMPOSICAO",92145,"CAMINHONETE CABINE SIMPLES COM MOTOR 1.6 FLEX, CÂMBIO MANUAL, POTÊNCIA 101/104 CV, 2 PORTAS","CHP",5.0000000000000001E-4,74.75,0.03]
[{"$nulls":7},0]
[null,"PRODUÇÃO DA EQUIPE",null,null,1,"CUSTO ",null,{"$f":"SUM(H70:H75)","v":0.32999999999999996}]
[null,"TOTAL",{"$nulls":5},{"$f":"H76/E76","v":0.32999999999999996},"OK"]
[null,"BDI                %",{"$nulls":5},{"$f":"1+$M$1","v":1.2201}]
[null,"TOTAL DO SERVIÇO - R$",{"$nulls":5},{"$f":"ROUND(H77*H78,2)","v":0.4}]
[]
[{"$f":"A65+1","v":6},"CODEVASF",null,null," COMPOSIÇÃO DE PREÇO UNITÁRIO",null,null,null,{"$f":"H90","v":2.2000000000000002},{"$f":"H92","v":2.68}]
[null,"OBRA:  ",{"$f":"$C$2","v":"PAVIMENTAÇÃO ASFÁLTICA EM CBUQ - ESTRADA VICINAL DE LIGAÇÃO AO DISTRITO DE SERRA DO MUNHO (TIROS / MG)"},null,null,null,"DATA: ",{"$f":"$H$2","v":" SETEMBRO / 2023   "}]
[null,"SERVIÇO:  ",{"$f":"VLOOKUP(A81,ORÇAMENTO!$A$10:$I$30,3)","v":"ESCAVAÇÃO HORIZONTAL EM SOLO DE 1A CATEGORIA "},null,"SINAPI",{"$f":"VLOOKUP(A81,ORÇAMENTO!$A$10:$I$30,4)","v":101116},"UNIDADE: ",{"$f":"VLOOKUP(A81,ORÇAMENTO!$A$10:$I$30,5)","v":"M3"}]
[]
[null,"TIPO ITEM","CODIGO ITEM","DESCRIÇÃO ITEM","UNIDADE ITEM","COEFICIENTE","PRECO UNITARIO","CUSTO TOTAL"]
[null,"COMPOSICAO","5847","TRATOR DE ESTEIRAS, POTÊNCIA 170 HP, PESO OPERACIONAL 19 T, CAÇAMBA 5,2 M3","CHP","0,0048000","253,93",{"$f":"ROUNDDOWN(F86*G86,2)","v":1.21}]
[null,"COMPOSICAO","5849","TRATOR DE ESTEIRAS, POTÊNCIA 170 HP, PESO OPERACIONAL 19 T, CAÇAMBA 5,2 M3","CHI","0,0082000","90,40",{"$f":"ROUNDDOWN(F87*G87,2)","v":0.74}]
[null,"COMPOSICAO","88316","SERVENTE COM ENCARGOS COMPLEMENTARES","H","0,0131000","19,76",{"$f":"ROUNDDOWN(F88*G88,2)","v":0.25}]
[null,"PRODUÇÃO DA EQUIPE",null,null,1,"CUSTO ",null,{"$f":"SUM(H86:H88)","v":2.2000000000000002}]
[null,"TOTAL",{"$nulls":5},{"$f":"H89/E89","v":2.2000000000000002},"OK"]
[null,"BDI                %",{"$nulls":5},{"$f":"1+$M$1","v":1.2201}]
[null,"TOTAL DO SERVIÇO - R$",{"$nulls":5},{"$f":"ROUND(H90*H91,2)","v":2.68}]
[]
[7,"CODEVASF",null,null," COMPOSIÇÃO DE PREÇO UNITÁRIO",null,null,null,{"$f":"H104","v":5.22},{"$f":"H106","v":6.37}]
[null,"OBRA:  ",{"$f":"$C$2","v":"PAVIMENTAÇÃO ASFÁLTICA EM CBUQ - ESTRADA VICINAL DE LIGAÇÃO AO DISTRITO DE SERRA DO MUNHO (TIROS / MG)"},null,null,null,"DATA: ",{"$f":"$H$2","v":" SETEMBRO / 2023   "}]
[null,"SERVIÇO:  ",{"$f":"VLOOKUP(A94,ORÇAMENTO!$A$10:$I$30,3)","v":"CARGA, MANOBRA E DESCARGA DE SOLOS E MATERIAIS GRANULARES EM CAMINHÃO BASCULANTE"},null,"SINAPI",{"$f":"VLOOKUP(A94,ORÇAMENTO!$A$10:$I$30,4)","v":100976},"UNIDADE: ",{"$f":"VLOOKUP(A94,ORÇAMENTO!$A$10:$I$30,5)","v":"M3"}]
[]
[null,"TIPO ITEM","CODIGO ITEM","DESCRIÇÃO ITEM","UNIDADE ITEM","COEFICIENTE","PRECO UNITARIO","CUSTO TOTAL"]
[null,"COMPOSICAO","5940","PÁ CARREGADEIRA SOBRE RODAS, POTÊNCIA LÍQUIDA 128 HP, CAPACIDADE DA CAÇAMBA 1,7 A 2,8 M3, PESO OPERACIONAL 11632 KG","CHP","0,0083000","217,72",{"$f":"ROUNDDOWN(F99*G99,2)","v":1.8}]
[null,"COMPOSICAO","5942","PÁ CARREGADEIRA SOBRE RODAS, POTÊNCIA LÍQUIDA 128 HP, CAPACIDADE DA CAÇAMBA 1,7 A 2,8 M3, PESO OPERACIONAL 11632 KG","CHI","0,0074000","95,85",{"$f":"ROUNDDOWN(F100*G100,2)","v":0.7}]
[null,"COMPOSICAO","89883","CAMINHÃO BASCULANTE 18 M3, COM CAVALO MECÂNICO DE CAPACIDADE MÁXIMA DE TRAÇÃO COMBINADO DE 45000 KG, POTÊNCIA 330 CV, INCLUSIVE SEMIREBOQUE COM CAÇAMBA METÁLICA","CHP",5.3E-3,"348,45",{"$f":"ROUNDDOWN(F101*G101,2)","v":1.84}]
[null,"COMPOSICAO","89884","CAMINHÃO BASCULANTE 18 M3, COM CAVALO MECÂNICO DE CAPACIDADE MÁXIMA DE TRAÇÃO COMBINADO DE 45000 KG, POTÊNCIA 330 CV, INCLUSIVE SEMIREBOQUE COM CAÇAMBA METÁLICA","CHI","0,0095000","93,65",{"$f":"ROUNDDOWN(F102*G102,2)","v":0.88}]
[null,"PRODUÇÃO DA EQUIPE",null,null,1,"CUSTO ",null,{"$f":"SUM(H99:H102)","v":5.22}]
[null,"TOTAL",{"$nulls":5},{"$f":"H103/E103","v":5.22},"OK"]
[null,"BDI                %",{"$nulls":5},{"$f":"1+$M$1","v":1.2201}]
[null,"TOTAL DO SERVIÇO - R$",{"$nulls":5},{"$f":"ROUND(H104*H105,2)","v":6.37}]
[]
[8,"CODEVASF",null,null," COMPOSIÇÃO DE PREÇO UNITÁRIO",null,null,null,{"$f":"H122","v":2.57},{"$f":"H124","v":3.14}]
[null,"OBRA:  ",{"$f":"$C$2","v":"PAVIMENTAÇÃO ASFÁLTICA EM CBUQ - ESTRADA VICINAL DE LIGAÇÃO AO DISTRITO DE SERRA DO MUNHO (TIROS / MG)"},null,null,null,"DATA: ",{"$f":"$H$2","v":" SETEMBRO / 2023   "}]
[null,"SERVIÇO:  ",{"$f":"VLOOKUP(A108,ORÇAMENTO!$A$10:$I$30,3)","v":"REGULARIZAÇÃO E COMPACTAÇÃO DO SUBLEITO "},null,"SICRO",{"$f":"VLOOKUP(A108,ORÇAMENTO!$A$10:$I$30,4)","v":100576},"UNIDADE: ","M2"]
[]
[null,"TIPO ITEM","CODIGO ITEM","DESCRIÇÃO ITEM","UNIDADE ITEM","COEFICIENTE","PRECO UNITARIO","CUSTO TOTAL"]
[null,"COMPOSICAO","5901","CAMINHÃO PIPA 10.000 L TRUCADO, PESO BRUTO TOTAL 23.000 KG, CARGA ÚTIL MÁXIMA 15.935 KG, DISTÂNCIA ENTRE EIXOS 4,8 M, POTÊNCIA 230 CV, INCLUSIVE TANQUE DE AÇO PARA TRANSPORTE DE ÁGUA","CHP","0,0010000","294,94",{"$f":"ROUNDDOWN(F113*G113,2)","v":0.28999999999999998}]
[null,"COMPOSICAO","5903","CAMINHÃO PIPA 10.000 L TRUCADO, PESO BRUTO TOTAL 23.000 KG, CARGA ÚTIL MÁXIMA 15.935 KG, DISTÂNCIA ENTRE EIXOS 4,8 M, POTÊNCIA 230 CV, INCLUSIVE TANQUE DE AÇO PARA TRANSPORTE DE ÁGUA","CHI","0,0070000","72,55",0.5]
[null,"COMPOSICAO","5932","MOTONIVELADORA POTÊNCIA BÁSICA LÍQUIDA (PRIMEIRA MARCHA) 125 HP, PESO BRUTO 13032 KG, LARGURA DA LÂMINA DE 3,7 M","CHP","0,0001000","262,71",0.02]
[null,"COMPOSICAO","5934","MOTONIVELADORA POTÊNCIA BÁSICA LÍQUIDA (PRIMEIRA MARCHA) 125 HP, PESO BRUTO 13032 KG, LARGURA DA LÂMINA DE 3,7 M","CHI","0,0080000","109,40",0.87]
[null,"COMPOSICAO","73436","ROLO COMPACTADOR VIBRATÓRIO PÉ DE CARNEIRO PARA SOLOS, POTÊNCIA 80 HP, PESO OPERACIONAL SEM/COM LASTRO 7,4 / 8,8 T, LARGURA DE TRABALHO 1,68 M","CHP","0,0020000","163,19",0.32]
[null,"COMPOSICAO","88316","SERVENTE COM ENCARGOS COMPLEMENTARES","H","0,0080000","19,76",0.15]
[null,"COMPOSICAO","93244","ROLO COMPACTADOR VIBRATÓRIO PÉ DE CARNEIRO PARA SOLOS, POTÊNCIA 80 HP, PESO OPERACIONAL SEM/COM LASTRO 7,4 / 8,8 T, LARGURA DE TRABALHO 1,68 M","CHI","0,0060000","71,18",0.42]
[]
[null,"PRODUÇÃO DA EQUIPE",null,null,1,"CUSTO ",null,{"$f":"SUM(H113:H120)","v":2.57}]
[null,"TOTAL",{"$nulls":5},{"$f":"H121/E121","v":2.57},"OK"]
[null,"BDI                %",{"$nulls":5},{"$f":"1+$M$1","v":1.2201}]
[null,"TOTAL DO SERVIÇO - R$",{"$nulls":5},{"$f":"ROUND(H122*H123,2)","v":3.14}]
[]
[9,"CODEVASF",null,null," COMPOSIÇÃO DE PREÇO UNITÁRIO",null,null,null,{"$f":"H141","v":12.469999999999999},{"$f":"H143","v":15.21}]
[null,"OBRA:  ",{"$f":"$C$2","v":"PAVIMENTAÇÃO ASFÁLTICA EM CBUQ - ESTRADA VICINAL DE LIGAÇÃO AO DISTRITO DE SERRA DO MUNHO (TIROS / MG)"},null,null,null,"DATA: ",{"$f":"$H$2","v":" SETEMBRO / 2023   "}]
[null,"SERVIÇO:  ",{"$f":"VLOOKUP(A126,ORÇAMENTO!$A$10:$I$30,3)","v":"EXECUÇÃO E COMPACTAÇÃO DE BASE E OU SUB BASE PARA PAVIMENTAÇÃO DE SOLOS DE COMPORTAMENTO LATERÍTICO (ARENOSO) - EXCLUSIVE SOLO, ESCAVAÇÃO, CARGA E TRANSPORTE"},null,"SINAPI",{"$f":"VLOOKUP(A126,ORÇAMENTO!$A$10:$I$30,4)","v":96388},"UNIDADE: ",{"$f":"VLOOKUP(A126,ORÇAMENTO!$A$10:$I$30,5)","v":"M3"}]
[]
[null,"TIPO ITEM","CODIGO ITEM","DESCRIÇÃO ITEM","UNIDADE ITEM","COEFICIENTE","PRECO UNITARIO","CUSTO TOTAL"]
[null,"COMPOSICAO","5684","ROLO COMPACTADOR VIBRATÓRIO DE UM CILINDRO AÇO LISO, POTÊNCIA 80 HP, PESO OPERACIONAL MÁXIMO 8,1 T, IMPACTO DINÂMICO 16,15 / 9,5 T, LARGURA DE TRABALHO 1,68 M","CHP","0,0030000","159,98",{"$f":"ROUNDDOWN(F131*G131,2)","v":0.47}]
[null,"COMPOSICAO","5685","ROLO COMPACTADOR VIBRATÓRIO DE UM CILINDRO AÇO LISO, POTÊNCIA 80 HP, PESO OPERACIONAL MÁXIMO 8,1 T, IMPACTO DINÂMICO 16,15 / 9,5 T, LARGURA DE TRABALHO 1,68 M","CHI","0,0230000","69,53",1.59]
[null,"COMPOSICAO","5901","CAMINHÃO PIPA 10.000 L TRUCADO, PESO BRUTO TOTAL 23.000 KG, CARGA ÚTIL MÁXIMA 15.935 KG, DISTÂNCIA ENTRE EIXOS 4,8 M, POTÊNCIA 230 CV, INCLUSIVE TANQUE DE AÇO PARA TRANSPORTE DE ÁGUA","CHP","0,0040000","294,94",1.17]
[null,"COMPOSICAO","5903","CAMINHÃO PIPA 10.000 L TRUCADO, PESO BRUTO TOTAL 23.000 KG, CARGA ÚTIL MÁXIMA 15.935 KG, DISTÂNCIA ENTRE EIXOS 4,8 M, POTÊNCIA 230 CV, INCLUSIVE TANQUE DE AÇO PARA TRANSPORTE DE ÁGUA","CHI","0,0220000","72,55",1.59]
[null,"COMPOSICAO","5932","MOTONIVELADORA POTÊNCIA BÁSICA LÍQUIDA (PRIMEIRA MARCHA) 125 HP, PESO BRUTO 13032 KG, LARGURA DA LÂMINA DE 3,7 M","CHP","0,0080000","262,71",2.1]
[null,"COMPOSICAO","5934","MOTONIVELADORA POTÊNCIA BÁSICA LÍQUIDA (PRIMEIRA MARCHA) 125 HP, PESO BRUTO 13032 KG, LARGURA DA LÂMINA DE 3,7 M","CHI","0,0190000","109,40",2.0699999999999998]
[null,"COMPOSICAO","88316","SERVENTE COM ENCARGOS COMPLEMENTARES","H","0,0260000","19,76",0.51]
[null,"COMPOSICAO","96463","ROLO COMPACTADOR DE PNEUS, ESTATICO, PRESSAO VARIAVEL, POTENCIA 110 HP, PESO SEM/COM LASTRO 10,8/27 T, LARGURA DE ROLAGEM 2,30 M","CHP","0,0040000","218,21",0.87]
[null,"COMPOSICAO","96464","ROLO COMPACTADOR DE PNEUS, ESTATICO, PRESSAO VARIAVEL, POTENCIA 110 HP, PESO SEM/COM LASTRO 10,8/27 T, LARGURA DE ROLAGEM 2,30 M","CHI","0,0220000","95,83",2.1]
[null,"PRODUÇÃO DA EQUIPE",null,null,1,"CUSTO ",null,{"$f":"SUM(H131:H139)","v":12.469999999999999}]
[null,"TOTAL",{"$nulls":5},{"$f":"H140/E140","v":12.469999999999999},"OK"]
[null,"BDI                %",{"$nulls":5},{"$f":"1+$M$1","v":1.2201}]
[null,"TOTAL DO SERVIÇO - R$",{"$nulls":5},{"$f":"ROUND(H141*H142,2)","v":15.21}]
[]
[10,"CODEVASF",null,null," COMPOSIÇÃO DE PREÇO UNITÁRIO",null,null,null,{"$f":"H160","v":1.23},{"$f":"H162","v":1.5}]
[null,"OBRA:  ",{"$f":"$C$2","v":"PAVIMENTAÇÃO ASFÁLTICA EM CBUQ - ESTRADA VICINAL DE LIGAÇÃO AO DISTRITO DE SERRA DO MUNHO (TIROS / MG)"},null,null,null,"DATA: ",{"$f":"$H$2","v":" SETEMBRO / 2023   "}]
[null,"SERVIÇO:  ",{"$f":"VLOOKUP(A145,ORÇAMENTO!$A$10:$I$30,3)","v":"IMPRIMAÇÃO COM EMULSÃO ASFÁLTICA (EAI)"},null,"SINAPI",{"$f":"VLOOKUP(A145,ORÇAMENTO!$A$10:$I$30,4)","v":96401},"UNIDADE: ",{"$f":"VLOOKUP(A145,ORÇAMENTO!$A$10:$I$30,5)","v":"M2"}]
[]
[null,"TIPO ITEM","CODIGO ITEM","DESCRIÇÃO ITEM","UNIDADE ITEM","COEFICIENTE","PRECO UNITARIO","CUSTO TOTAL"]
[null,"COMPOSICAO",5839,"VASSOURA MECÂNICA REBOCÁVEL COM ESCOVA CILÍNDRICA, LARGURA ÚTIL DE VARRIMENTO DE 2,44 M ","CHP","0,0020000",10.3,{"$f":"ROUNDDOWN(F150*G150,2)","v":0.02}]
[null,"COMPOSICAO",5841,"VASSOURA MECÂNICA REBOCÁVEL COM ESCOVA CILÍNDRICA, LARGURA ÚTIL DE VARRIMENTO DE 2,44 M ","CHI","0,0040000",5.18,0.02]
[null,"INSUMO","ANP","EMULSÃO ASFÁLTICA PARA IMPRIMAÇÃO - EAI (FORNECIMENTO COM BDI DIFERENCIADO)","T",{"$f":"1.3/1000","v":1.2999999999999999E-3},null,0]
[null,"COMPOSICAO",83362,"ESPARGIDOR DE ASFALTO PRESSURIZADO, TANQUE 6 M3 COM ISOLAÇÃO TÉRMICA, AQUECIDO COM 2 MAÇARICOS, COM BARRA ESPARGIDORA 3,60 M, MONTADO SOBRE CAMINHÃO  TOCO, PBT 14.300 KG, POTÊNCIA 185 CV","CHP","0,0010000",256.33999999999997,0.25]
[null,"COMPOSICAO",88316,"SERVENTE COM ENCARGOS COMPLEMENTARES","H","0,0060000",19.760000000000002,0.11]
[null,"COMPOSICAO",89035,"TRATOR DE PNEUS, POTÊNCIA 85 CV, TRAÇÃO 4X4, PESO COM LASTRO DE 4.675 KG ","CHP","0,0020000",135.08000000000001,0.27]
[null,"COMPOSICAO",89036,"TRATOR DE PNEUS, POTÊNCIA 85 CV, TRAÇÃO 4X4, PESO COM LASTRO DE 4.675 KG ","CHI","0,0040000",56.48,0.22]
[null,"COMPOSICAO",91486,"ESPARGIDOR DE ASFALTO PRESSURIZADO, TANQUE 6 M3 COM ISOLAÇÃO TÉRMICA, AQUECIDO COM 2 MAÇARICOS, COM BARRA ESPARGIDORA 3,60 M, MONTADO SOBRE CAMINHÃO  TOCO, PBT 14.300 KG, POTÊNCIA 185 CV","CHI","0,0050000",68.430000000000007,0.34]
[{"$nulls":7},0]
[null,"PRODUÇÃO DA EQUIPE",null,null,1,"CUSTO ",null,{"$f":"SUM(H150:H158)","v":1.23}]
[null,"TOTAL",{"$nulls":5},{"$f":"H159/E159","v":1.23},"OK"]
[null,"BDI                %",{"$nulls":5},{"$f":"1+$M$1","v":1.2201}]
[null,"TOTAL DO SERVIÇO - R$",{"$nulls":5},{"$f":"ROUND(H160*H161,2)","v":1.5}]
[]
[11,"CODEVASF",null,null," COMPOSIÇÃO DE PREÇO UNITÁRIO",null,null,null,{"$f":"H179","v":1.01},{"$f":"H181","v":1.23}]
[null,"OBRA:  ",{"$f":"$C$2","v":"PAVIMENTAÇÃO ASFÁLTICA EM CBUQ - ESTRADA VICINAL DE LIGAÇÃO AO DISTRITO DE SERRA DO MUNHO (TIROS / MG)"},null,null,null,"DATA: ",{"$f":"$H$2","v":" SETEMBRO / 2023   "}]
[null,"SERVIÇO:  ",{"$f":"VLOOKUP(A164,ORÇAMENTO!$A$10:$I$30,3)","v":"PINTURA DE LIGAÇÃO COM EMULSÃO ASFÁLTICA RR-1C"},null,"SINAPI",{"$f":"VLOOKUP(A164,ORÇAMENTO!$A$10:$I$30,4)","v":96402},"UNIDADE: ","M2"]
[]
[null,"TIPO ITEM","CODIGO ITEM","DESCRIÇÃO ITEM","UNIDADE ITEM","COEFICIENTE","PRECO UNITARIO","CUSTO TOTAL"]
[null,"COMPOSICAO",5839,"VASSOURA MECÂNICA REBOCÁVEL COM ESCOVA CILÍNDRICA, LARGURA ÚTIL DE VARRIMENTO DE 2,44 M","CHP","0,0020000",10.3,{"$f":"ROUNDDOWN(F169*G169,2)","v":0.02}]
[null,"COMPOSICAO",5841,"VASSOURA MECÂNICA REBOCÁVEL COM ESCOVA CILÍNDRICA, LARGURA ÚTIL DE VARRIMENTO DE 2,44 M","CHI","0,0040000",5.18,0.02]
[null,"INSUMO",41903,"EMULSAO ASFALTICA CATIONICA RR-2C PARA USO EM PAVIMENTACAO ASFALTICA (FORNECIMENTO COM BDI DIFERENCIADO)","KG","0,4500000",null,0]
[null,"COMPOSICAO",83362,"ESPARGIDOR DE ASFALTO PRESSURIZADO, TANQUE 6 M3 COM ISOLAÇÃO TÉRMICA, AQUECIDO COM 2 MAÇARICOS, COM BARRA ESPARGIDORA 3,60 M, MONTADO SOBRE CAMINHÃO  TOCO, PBT 14.300 KG, POTÊNCIA 185 CV","CHP","0,0004000",256.33999999999997,0.1]
[null,"COMPOSICAO",88316,"SERVENTE COM ENCARGOS COMPLEMENTARES","H","0,0055000",19.760000000000002,0.1]
[null,"COMPOSICAO",89035,"TRATOR DE PNEUS, POTÊNCIA 85 CV, TRAÇÃO 4X4, PESO COM LASTRO DE 4.675 KG","CHP","0,0017000",135.08000000000001,0.22]
[null,"COMPOSICAO",89036,"TRATOR DE PNEUS, POTÊNCIA 85 CV, TRAÇÃO 4X4, PESO COM LASTRO DE 4.675 KG","CHI","0,0038000",56.48,0.21]
[null,"COMPOSICAO",91486,"ESPARGIDOR DE ASFALTO PRESSURIZADO, TANQUE 6 M3 COM ISOLAÇÃO TÉRMICA, AQUECIDO COM 2 MAÇARICOS, COM BARRA ESPARGIDORA 3,60 M, MONTADO SOBRE CAMINHÃO  TOCO, PBT 14.300 KG, POTÊNCIA 185 CV","CHI","0,0051000",68.430000000000007,0.34]
[{"$nulls":7},0]
[null,"PRODUÇÃO DA EQUIPE",null,null,1,"CUSTO ",null,{"$f":"SUM(H169:H177)","v":1.01}]
[null,"TOTAL",{"$nulls":5},{"$f":"H178/E178","v":1.01},"OK"]
[null,"BDI                %",{"$nulls":5},{"$f":"1+$M$1","v":1.2201}]
[null,"TOTAL DO SERVIÇO - R$",{"$nulls":5},{"$f":"ROUND(H179*H180,2)","v":1.23}]
[]
[12,"CODEVASF",null,null," COMPOSIÇÃO DE PREÇO UNITÁRIO",null,null,null,{"$f":"H201","v":129.6},{"$f":"H203","v":158.12}]
[null,"OBRA:  ",{"$f":"$C$2","v":"PAVIMENTAÇÃO ASFÁLTICA EM CBUQ - ESTRADA VICINAL DE LIGAÇÃO AO DISTRITO DE SERRA DO MUNHO (TIROS / MG)"},null,null,null,"DATA: ",{"$f":"$H$2","v":" SETEMBRO / 2023   "}]
[null,"SERVIÇO:  ",{"$f":"VLOOKUP(A183,ORÇAMENTO!$A$10:$I$30,3)","v":"EXECUÇÃO DE PAVIMENTO COM APLICAÇÃO DE CONCRETO ASFÁLTICO USINADO A QUENTE (CBUQ), CAMADA DE ROLAMENTO - EXCLUSIVE TRANSPORTE"},null,"SINAPI",{"$f":"VLOOKUP(A183,ORÇAMENTO!$A$10:$I$30,4)","v":95995},"UNIDADE: ",{"$f":"VLOOKUP(A183,ORÇAMENTO!$A$10:$I$30,5)","v":"M3"}]
[]
[null,"TIPO ITEM","CODIGO ITEM","DESCRIÇÃO ITEM","UNIDADE ITEM","COEFICIENTE","PRECO UNITARIO","CUSTO TOTAL"]
[null,"INSUMO",1518,"CONCRETO BETUMINOSO USINADO A QUENTE (CBUQ) PARA PAVIMENTACAO ASFALTICA, PADRAO DNIT, FAIXA C, COM CAP 50/70 - AQUISICAO POSTO USINA (FORNECIMENTO COM BDI DIFERENCIADO)","T","2,5548000",null,{"$f":"ROUNDDOWN(F188*G188,2)","v":0}]
[null,"COMPOSICAO","5835","VIBROACABADORA DE ASFALTO SOBRE ESTEIRAS, LARGURA DE PAVIMENTAÇÃO 1,90 M A 5,30 M, POTÊNCIA 105 HP CAPACIDADE 450 T/H","CHP","0,0464000","396,75",18.399999999999999]
[null,"COMPOSICAO","5837","VIBROACABADORA DE ASFALTO SOBRE ESTEIRAS, LARGURA DE PAVIMENTAÇÃO 1,90 M A 5,30 M, POTÊNCIA 105 HP CAPACIDADE 450 T/H ","CHI","0,0949000","165,12",15.66]
[null,"COMPOSICAO",88314,"RASTELEIRO COM ENCARGOS COMPLEMENTARES","H","1,1301000","26,52",29.97]
[null,"COMPOSICAO",91386,"CAMINHÃO BASCULANTE 10 M3, TRUCADO CABINE SIMPLES, PESO BRUTO TOTAL 23.000 KG, CARGA ÚTIL MÁXIMA 15.935 KG, DISTÂNCIA ENTRE EIXOS 4,80 M, POTÊNCIA 230 CV INCLUSIVE CAÇAMBA METÁLICA ","CHP","0,0464000","252,13",11.69]
[null,"COMPOSICAO",95631,"ROLO COMPACTADOR VIBRATORIO TANDEM, ACO LISO, POTENCIA 125 HP, PESO SEM/COM LASTRO 10,20/11,65 T, LARGURA DE TRABALHO 1,73 M ","CHP","0,0805000","228,02",18.350000000000001]
[null,"COMPOSICAO",95632,"ROLO COMPACTADOR VIBRATORIO TANDEM, ACO LISO, POTENCIA 125 HP, PESO SEM/COM LASTRO 10,20/11,65 T, LARGURA DE TRABALHO 1,73 M ","CHI","0,0607000","89,32",5.42]
[null,"COMPOSICAO",96155,"TRATOR DE PNEUS COM POTÊNCIA DE 85 CV, TRAÇÃO 4X4, COM VASSOURA MECÂNICA ACOPLADA ","CHI","0,1071000","61,42",6.57]
[null,"COMPOSICAO",96157,"TRATOR DE PNEUS COM POTÊNCIA DE 85 CV, TRAÇÃO 4X4, COM VASSOURA MECÂNICA ACOPLADA","CHP","0,0341000","144,29",4.92]
[null,"COMPOSICAO",96463,"ROLO COMPACTADOR DE PNEUS, ESTATICO, PRESSAO VARIAVEL, POTENCIA 110 HP, PESO SEM/COM LASTRO 10,8/27 T, LARGURA DE ROLAGEM 2,30 M ","CHP","0,0419000","218,21",9.14]
[null,"COMPOSICAO",96464,"ROLO COMPACTADOR DE PNEUS, ESTATICO, PRESSAO VARIAVEL, POTENCIA 110 HP, PESO SEM/COM LASTRO 10,8/27 T, LARGURA DE ROLAGEM 2,30 M ","CHI","0,0990000","95,83",9.48]
[{"$nulls":7},0]
[null,"PRODUÇÃO DA EQUIPE",null,null,1,"CUSTO ",null,{"$f":"SUM(H188:H199)","v":129.6}]
[null,"TOTAL",{"$nulls":5},{"$f":"H200/E200","v":129.6},"OK"]
[null,"BDI                %",{"$nulls":5},{"$f":"1+$M$1","v":1.2201}]
[null,"TOTAL DO SERVIÇO - R$",{"$nulls":5},{"$f":"ROUND(H201*H202,2)","v":158.12}]
[]
[13,"CODEVASF",null,null," COMPOSIÇÃO DE PREÇO UNITÁRIO",null,null,null,{"$f":"H214","v":0.73},{"$f":"H216","v":0.89}]
[null,"OBRA:  ",{"$f":"$C$2","v":"PAVIMENTAÇÃO ASFÁLTICA EM CBUQ - ESTRADA VICINAL DE LIGAÇÃO AO DISTRITO DE SERRA DO MUNHO (TIROS / MG)"},null,null,null,"DATA: ",{"$f":"$H$2","v":" SETEMBRO / 2023   "}]
[null,"SERVIÇO:  ",{"$f":"VLOOKUP(A205,ORÇAMENTO!$A$10:$I$30,3)","v":"TRANSPORTE COM CAMINHÃO BASCULANTE, EM VIA URBANA PAVIMENTADA"},null,"SINAPI",{"$f":"VLOOKUP(A205,ORÇAMENTO!$A$10:$I$30,4)","v":95427},"UNIDADE: ",{"$f":"VLOOKUP(A205,ORÇAMENTO!$A$10:$I$30,5)","v":"M3XKM"}]
[]
[null,"TIPO ITEM","CODIGO ITEM","DESCRIÇÃO ITEM","UNIDADE ITEM","COEFICIENTE","PRECO UNITARIO","CUSTO TOTAL"]
[null,"COMPOSICAO","89883","CAMINHÃO BASCULANTE 18 M3, COM CAVALO MECÂNICO DE CAPACIDADE MÁXIMA DE TRAÇÃO COMBINADO DE 45000 KG, POTÊNCIA 330 CV, INCLUSIVE SEMIREBOQUE COM CAÇAMBA METÁLICA","CHP","0,0019000",348.45,{"$f":"ROUNDDOWN(F210*G210,2)","v":0.66}]
[null,"COMPOSICAO","89884","CAMINHÃO BASCULANTE 18 M3, COM CAVALO MECÂNICO DE CAPACIDADE MÁXIMA DE TRAÇÃO COMBINADO DE 45000 KG, POTÊNCIA 330 CV, INCLUSIVE SEMIREBOQUE COM CAÇAMBA METÁLICA","CHI","0,0008000",93.65,{"$f":"ROUNDDOWN(F211*G211,2)","v":7.0000000000000007E-2}]
[{"$nulls":7},{"$f":"ROUNDDOWN(F212*G212,2)","v":0}]
[null,"PRODUÇÃO DA EQUIPE",null,null,1,"CUSTO ",null,{"$f":"SUM(H210:H212)","v":0.73}]
[null,"TOTAL",{"$nulls":5},{"$f":"H213/E213","v":0.73},"OK"]
[null,"BDI                %",{"$nulls":5},{"$f":"1+$M$1","v":1.2201}]
[null,"TOTAL DO SERVIÇO - R$",{"$nulls":5},{"$f":"ROUND(H214*H215,2)","v":0.89}]
[]
[14,"CODEVASF",null,null," COMPOSIÇÃO DE PREÇO UNITÁRIO",null,null,null,{"$f":"H227","v":1.03},{"$f":"H229","v":1.26}]
[null,"OBRA:  ",{"$f":"$C$2","v":"PAVIMENTAÇÃO ASFÁLTICA EM CBUQ - ESTRADA VICINAL DE LIGAÇÃO AO DISTRITO DE SERRA DO MUNHO (TIROS / MG)"},null,null,null,"DATA: ",{"$f":"$H$2","v":" SETEMBRO / 2023   "}]
[null,"SERVIÇO:  ",{"$f":"VLOOKUP(A218,ORÇAMENTO!$A$10:$I$30,3)","v":"TRANSPORTE COM CAMINHÃO CARROCERIA 9T, EM VIA URBANA PAVIMENTADA"},null,"SINAPI",{"$f":"VLOOKUP(A218,ORÇAMENTO!$A$10:$I$30,4)","v":100947},"UNIDADE: ",{"$f":"VLOOKUP(A218,ORÇAMENTO!$A$10:$I$30,5)","v":"TXKM"}]
[]
[null,"TIPO ITEM","CODIGO ITEM","DESCRIÇÃO ITEM","UNIDADE ITEM","COEFICIENTE","PRECO UNITARIO","CUSTO TOTAL"]
[null,"COMPOSICAO","5824","CAMINHÃO TOCO, PBT 16.000 KG, CARGA ÚTIL MÁX. 10.685 KG, DIST. ENTRE EIXOS 4,8 M, POTÊNCIA 189 CV, INCLUSIVE CARROCERIA FIXA ABERTA DE MADEIRA P/ TRANSPORTE GERAL DE CARGA SECA, DIMEN. APROX. 2,5 X 7,00 X 0,50 M ","CHP",3.8999999999999998E-3,202.74,{"$f":"ROUNDDOWN(F223*G223,2)","v":0.79}]
[null,"COMPOSICAO","5826","CAMINHÃO TOCO, PBT 16.000 KG, CARGA ÚTIL MÁX. 10.685 KG, DIST. ENTRE EIXOS 4,8 M, POTÊNCIA 189 CV, INCLUSIVE CARROCERIA FIXA ABERTA DE MADEIRA P/ TRANSPORTE GERAL DE CARGA SECA, DIMEN. APROX. 2,5 X 7,00 X 0,50 M ","CHI","0,0040000",60.95,{"$f":"ROUNDDOWN(F224*G224,2)","v":0.24}]
[{"$nulls":7},{"$f":"ROUNDDOWN(F225*G225,2)","v":0}]
[null,"PRODUÇÃO DA EQUIPE",null,null,1,"CUSTO ",null,{"$f":"SUM(H223:H225)","v":1.03}]
[null,"TOTAL",{"$nulls":5},{"$f":"H226/E226","v":1.03},"OK"]
[null,"BDI                %",{"$nulls":5},{"$f":"1+$M$1","v":1.2201}]
[null,"TOTAL DO SERVIÇO - R$",{"$nulls":5},{"$f":"ROUND(H227*H228,2)","v":1.26}]
[]
[15,"CODEVASF",null,null," COMPOSIÇÃO DE PREÇO UNITÁRIO",null,null,null,{"$f":"H240","v":0.44999999999999996},{"$f":"H242","v":0.52}]
[null,"OBRA:  ",{"$f":"$C$2","v":"PAVIMENTAÇÃO ASFÁLTICA EM CBUQ - ESTRADA VICINAL DE LIGAÇÃO AO DISTRITO DE SERRA DO MUNHO (TIROS / MG)"},null,null,null,"DATA: ",{"$f":"$H$2","v":" SETEMBRO / 2023   "}]
[null,"SERVIÇO:  ",{"$f":"VLOOKUP(A231,ORÇAMENTO!$A$10:$I$30,3)","v":"TRANSPORTE DE MASSA ASFÁLTICA COM CAMINHÃO BASCULANTE, EM VIA URBANA PAVIMENTADA (BDI DIFERENCIADO)"},null,"SINAPI",{"$f":"VLOOKUP(A231,ORÇAMENTO!$A$10:$I$30,4)","v":95430},"UNIDADE: ",{"$f":"VLOOKUP(A231,ORÇAMENTO!$A$10:$I$30,5)","v":"TXKM"}]
[]
[null,"TIPO ITEM","CODIGO ITEM","DESCRIÇÃO ITEM","UNIDADE ITEM","COEFICIENTE","PRECO UNITARIO","CUSTO TOTAL"]
[null,"COMPOSICAO","89883","CAMINHÃO BASCULANTE 18 M3, COM CAVALO MECÂNICO DE CAPACIDADE MÁXIMA DE TRAÇÃO COMBINADO DE 45000 KG, POTÊNCIA 330 CV, INCLUSIVE SEMIREBOQUE COM CAÇAMBA METÁLICA","CHP","0,0012000",348.45,{"$f":"ROUNDDOWN(F236*G236,2)","v":0.41}]
[null,"COMPOSICAO","89884","CAMINHÃO BASCULANTE 18 M3, COM CAVALO MECÂNICO DE CAPACIDADE MÁXIMA DE TRAÇÃO COMBINADO DE 45000 KG, POTÊNCIA 330 CV, INCLUSIVE SEMIREBOQUE COM CAÇAMBA METÁLICA","CHI","0,0005000",93.65,{"$f":"ROUNDDOWN(F237*G237,2)","v":0.04}]
[{"$nulls":7},{"$f":"ROUNDDOWN(F238*G238,2)","v":0}]
[null,"PRODUÇÃO DA EQUIPE",null,null,1,"CUSTO ",null,{"$f":"SUM(H236:H238)","v":0.44999999999999996}]
[null,"TOTAL",{"$nulls":5},{"$f":"H239/E239","v":0.44999999999999996},"OK"]
[null,"BDI                %",{"$nulls":5},{"$f":"1+$M$2","v":1.1499999999999999}]
[null,"TOTAL DO SERVIÇO - R$",{"$nulls":5},{"$f":"ROUND(H240*H241,2)","v":0.52}]
[]
[16,"CODEVASF",null,null," COMPOSIÇÃO DE PREÇO UNITÁRIO",null,null,null,{"$f":"H252","v":0.52},{"$f":"H254","v":0.6}]
[null,"OBRA:  ",{"$f":"$C$2","v":"PAVIMENTAÇÃO ASFÁLTICA EM CBUQ - ESTRADA VICINAL DE LIGAÇÃO AO DISTRITO DE SERRA DO MUNHO (TIROS / MG)"},null,null,null,"DATA: ",{"$f":"$H$2","v":" SETEMBRO / 2023   "}]
[null,"SERVIÇO:  ",{"$f":"VLOOKUP(A244,ORÇAMENTO!$A$10:$I$30,3)","v":"TRANSPORTE COM CAMINHÃO TANQUE DE TRANSPORTE DE MATERIAL ASFÁLTICO DE 30000 L, EM VIA URBANA PAVIMENTADA (BDI DIFERENCIADO)"},null,"SINAPI",{"$f":"VLOOKUP(A244,ORÇAMENTO!$A$10:$I$30,4)","v":102331},"UNIDADE: ",{"$f":"VLOOKUP(A244,ORÇAMENTO!$A$10:$I$30,5)","v":"TXKM"}]
[]
[null,"TIPO ITEM","CODIGO ITEM","DESCRIÇÃO ITEM","UNIDADE ITEM","COEFICIENTE","PRECO UNITARIO","CUSTO TOTAL"]
[null,"COMPOSICAO","91645","CAMINHÃO DE TRANSPORTE DE MATERIAL ASFÁLTICO 30.000 L, COM CAVALO MECÂNICO DE CAPACIDADE MÁXIMA DE TRAÇÃO COMBINADO DE 66.000 KG, POTÊNCIA 360 CV, INCLUSIVE TANQUE DE ASFALTO COM SERPENTINA ","CHP","0,0011000","442,21",{"$f":"ROUNDDOWN(F249*G249,2)","v":0.48}]
[null,"COMPOSICAO","91646","CAMINHÃO DE TRANSPORTE DE MATERIAL ASFÁLTICO 30.000 L, COM CAVALO MECÂNICO DE CAPACIDADE MÁXIMA DE TRAÇÃO COMBINADO DE 66.000 KG, POTÊNCIA 360 CV, INCLUSIVE TANQUE DE ASFALTO COM SERPENTINA","CHI","0,0005000","98,91",{"$f":"ROUNDDOWN(F250*G250,2)","v":0.04}]
[null,"PRODUÇÃO DA EQUIPE",null,null,1,"CUSTO ",null,{"$f":"SUM(H249:H250)","v":0.52}]
[null,"TOTAL",{"$nulls":5},{"$f":"H251/E251","v":0.52},"OK"]
[null,"BDI                %",{"$nulls":5},{"$f":"1+$M$2","v":1.1499999999999999}]
[null,"TOTAL DO SERVIÇO - R$",{"$nulls":5},{"$f":"ROUND(H252*H253,2)","v":0.6}]
[]
[17,"CODEVASF",null,null," COMPOSIÇÃO DE PREÇO UNITÁRIO",null,null,null,{"$f":"H270","v":62.759999999999991},{"$f":"H272","v":76.569999999999993}]
[null,"OBRA:  ",{"$f":"$C$2","v":"PAVIMENTAÇÃO ASFÁLTICA EM CBUQ - ESTRADA VICINAL DE LIGAÇÃO AO DISTRITO DE SERRA DO MUNHO (TIROS / MG)"},null,null,null,"DATA: ",{"$f":"$H$2","v":" SETEMBRO / 2023   "}]
[null,"SERVIÇO:  ",{"$f":"VLOOKUP(A256,ORÇAMENTO!$A$10:$I$30,3)","v":"GUIA (MEIO-FIO) E SARJETA CONJUGADOS DE CONCRETO, MOLDADA IN LOCO EM COM EXTRUSORA, 65 CM BASE (15 CM BASE DA GUIA + 50 CM BASE DA SARJETA) X 22 CM ALTURA "},null,"SINAPI",{"$f":"VLOOKUP(A256,ORÇAMENTO!$A$10:$I$30,4)","v":94271},"UNIDADE: ",{"$f":"VLOOKUP(A256,ORÇAMENTO!$A$10:$I$30,5)","v":"M"}]
[]
[null,"TIPO ITEM","CODIGO ITEM","DESCRIÇÃO ITEM","UNIDADE ITEM","COEFICIENTE","PRECO UNITARIO","CUSTO TOTAL"]
[null,"INSUMO","370","AREIA MEDIA - POSTO JAZIDA/FORNECEDOR (RETIRADO NA JAZIDA, SEM TRANSPORTE)","M3",2.1000000000000001E-2,"97,50",{"$f":"ROUNDDOWN(F261*G261,2)","v":2.04}]
[null,"INSUMO","34492","CONCRETO USINADO BOMBEAVEL, CLASSE DE RESISTENCIA C20, COM BRITA 0 E 1","M3",{"$f":"(0.5*0.05*1)+(0.12+0.15)*0.3/2","v":6.5500000000000003E-2},"550,00",36.020000000000003,{"$nulls":8},{"$f":"AVERAGE(I262:L262)","v":{"$error":"#DIV/0!"}},"(MÉDIA)"]
[null,"COMPOSICAO","88243","AJUDANTE ESPECIALIZADO COM ENCARGOS COMPLEMENTARES","H","0,2030000","21,76",4.41]
[null,"COMPOSICAO","88309","PEDREIRO COM ENCARGOS COMPLEMENTARES","H","0,3370000","27,45",9.25]
[null,"COMPOSICAO","88316","SERVENTE COM ENCARGOS COMPLEMENTARES","H","0,3370000","19,76",6.65]
[null,"COMPOSICAO","88631","ARGAMASSA TRAÇO 1:4 (EM VOLUME DE CIMENTO E AREIA MÉDIA ÚMIDA), PREPARO MANUAL","M3","0,0050000","575,87",2.87]
[null,"COMPOSICAO","92960","MÁQUINA EXTRUSORA DE CONCRETO PARA GUIAS E SARJETAS, MOTOR A DIESEL, POTÊNCIA 14 CV","CHP","0,0340000","18,46",0.62]
[null,"COMPOSICAO","92961","MÁQUINA EXTRUSORA DE CONCRETO PARA GUIAS E SARJETAS, MOTOR A DIESEL, POTÊNCIA 14 CV","CHI","0,1690000","5,38",0.9]
[null,"PRODUÇÃO DA EQUIPE",null,null,1,"CUSTO ",null,{"$f":"SUM(H261:H268)","v":62.759999999999991}]
[null,"TOTAL",{"$nulls":5},{"$f":"H269/E269","v":62.759999999999991},"OK"]
[null,"BDI                %",{"$nulls":5},{"$f":"1+$M$1","v":1.2201}]
[null,"TOTAL DO SERVIÇO - R$",{"$nulls":5},{"$f":"ROUND(H270*H271,2)","v":76.569999999999993}]
[]
[18,"CODEVASF",null,null," COMPOSIÇÃO DE PREÇO UNITÁRIO",null,null,null,{"$f":"H286","v":603.86},{"$f":"H288","v":736.77}]
[null,"OBRA:  ",{"$f":"$C$2","v":"PAVIMENTAÇÃO ASFÁLTICA EM CBUQ - ESTRADA VICINAL DE LIGAÇÃO AO DISTRITO DE SERRA DO MUNHO (TIROS / MG)"},null,null,null,"DATA: ",{"$f":"$H$2","v":" SETEMBRO / 2023   "}]
[null,"SERVIÇO:  ",{"$f":"VLOOKUP(A274,ORÇAMENTO!$A$10:$I$38,3)","v":"DESCIDA D’ÁGUA DE ATERROS EM DEGRAUS - DAD 04 - AREIA E BRITA COMERCIAIS"},null,"SICRO",{"$f":"VLOOKUP(A274,ORÇAMENTO!$A$10:$I$42,4)","v":2003411},"UNIDADE: ",{"$f":"VLOOKUP(A274,ORÇAMENTO!$A$10:$I$42,5)","v":"M"}]
[]
[null,"TIPO ITEM","CODIGO ITEM","DESCRIÇÃO ITEM","UNIDADE ITEM","COEFICIENTE","PRECO UNITARIO","CUSTO TOTAL"]
[null,"COMPOSIÇÃO",101616,"PREPARO DE FUNDO DE VALA COM LARGURA MENOR QUE 1,5 M (ACERTO DO SOLO NATURAL)","M2",0.9,6.07,{"$f":"ROUNDDOWN(F279*G279,2)","v":5.46}]
[null,"COMPOSIÇÃO",103797,"ARMAÇÃO DE DESCIDA DÁGUA UTILIZANDO AÇO CA-60 DE 5 MM","KG",11.96,15.53,185.73]
[null,"INSUMO","34492","CONCRETO USINADO BOMBEAVEL, CLASSE DE RESISTENCIA C20, COM BRITA 0 E 1, SLUMP = 100 +/- 20 MM","M3",0.59,550,324.5]
[null,"COMPOSIÇÃO",96527,"ESCAVAÇÃO MANUAL DE VALA ","M3",0.37,121.8,45.06]
[null,"COMPOSIÇÃO",103795,"FABRICAÇÃO, MONTAGEM E DESMONTAGEM DE FÔRMA PARA DRENAGEM EM CHAPA DE MADEIRA COMPENSADA RESINADA, E = 17 MM","M2",0.53,81.34,43.11]
[{"$nulls":7},0]
[null,"PRODUÇÃO DA EQUIPE",null,null,1,"CUSTO ",null,{"$f":"SUM(H279:H283)","v":603.86}]
[null,"TOTAL",{"$nulls":5},{"$f":"H285/E285","v":603.86},"OK"]
[null,"BDI                %",{"$nulls":5},{"$f":"1+$M$1","v":1.2201}]
[null,"TOTAL DO SERVIÇO - R$",{"$nulls":5},{"$f":"ROUND(H286*H287,2)","v":736.77}]
[]
[19,"CODEVASF",null,null," COMPOSIÇÃO DE PREÇO UNITÁRIO",null,null,null,{"$f":"H299","v":781.01},{"$f":"H301","v":952.91}]
[null,"OBRA:  ",{"$f":"$C$2","v":"PAVIMENTAÇÃO ASFÁLTICA EM CBUQ - ESTRADA VICINAL DE LIGAÇÃO AO DISTRITO DE SERRA DO MUNHO (TIROS / MG)"},null,null,null,"DATA: ",{"$f":"$H$2","v":" SETEMBRO / 2023   "}]
[null,"SERVIÇO:  ",{"$f":"VLOOKUP(A290,ORÇAMENTO!$A$10:$I$38,3)","v":"BACIA DE DISSIPAÇÃO, TIPO BACIA EM PEDRA DE MÃO FIXADA COM CONCRETO (DEB 01, 02), COM PREPARO MANUAL, FCK = 20 MPA, LANÇADO MANUALMENTE, INCLUINDO MATERIAIS E FÔRMAS"},null,"SINAPI",{"$f":"VLOOKUP(A290,ORÇAMENTO!$A$10:$I$42,4)","v":103930},"UNIDADE: ",{"$f":"VLOOKUP(A290,ORÇAMENTO!$A$10:$I$42,5)","v":"M3"}]
[]
[null,"TIPO ITEM","CODIGO ITEM","DESCRIÇÃO ITEM","UNIDADE ITEM","COEFICIENTE","PRECO UNITARIO","CUSTO TOTAL"]
[null,"COMPOSICAO","103796","FABRICAÇÃO, MONTAGEM E DESMONTAGEM DE FÔRMA PARA BACIA DE DISSIPAÇÃO, EM MADEIRA SERRADA, E = 25 MM","M2","4,1235000","60,26",{"$f":"ROUNDDOWN(F295*G295,2)","v":248.48}]
[null,"COMPOSICAO","103799","PEDRA DE MÃO FIXADA COM CONCRETO PARA BACIA DE DISSIPAÇÃO, 40% DE CONCRETO EM VOLUME, FCK = 20 MPA, COM USO DE JERICA E PREPARO EM BETONEIRA DE 600 L - AREIA, BRITA E PEDRA DE MÃO COMERCIAIS - LANÇAMENTO, ADENSAMENTO E ACABAMENTO","M3","0,5387000","432,56",233.02]
[null,"COMPOSICAO","103801","CONCRETAGEM DE DISSIPADOR DE ENERGIA, FCK = 20 MPA, COM USO DE JERICAS E PREPARO EM BETONEIRA DE 600 L - AREIA E BRITA COMERCIAIS - LANÇAMENTO, ADENSAMENTO E ACABAMENTO","M3","0,4613000","649,28",299.51]
[null,"PRODUÇÃO DA EQUIPE",null,null,1,"CUSTO ",null,{"$f":"SUM(H295:H297)","v":781.01}]
[null,"TOTAL",{"$nulls":5},{"$f":"H298/E298","v":781.01},"OK"]
[null,"BDI                %",{"$nulls":5},{"$f":"1+$M$1","v":1.2201}]
[null,"TOTAL DO SERVIÇO - R$",{"$nulls":5},{"$f":"ROUND(H299*H300,2)","v":952.91}]
[]
[20,"CODEVASF",null,null," COMPOSIÇÃO DE PREÇO UNITÁRIO",null,null,null,{"$f":"H316","v":264.27},{"$f":"H318","v":322.44}]
[null,"OBRA:  ",{"$f":"$C$2","v":"PAVIMENTAÇÃO ASFÁLTICA EM CBUQ - ESTRADA VICINAL DE LIGAÇÃO AO DISTRITO DE SERRA DO MUNHO (TIROS / MG)"},null,null,null,"DATA: ",{"$f":"$H$2","v":" SETEMBRO / 2023   "}]
[null,"SERVIÇO:  ",{"$f":"VLOOKUP(A303,ORÇAMENTO!$A$10:$I$38,3)","v":"FORNECIMENTO E INSTALAÇÃO DE PLACA DE SINALIZAÇÃO VIÁRIA - REGULAMENTAÇÃO CIRCULAR OU QUADRADA"},null,"SINAPI",{"$f":"VLOOKUP(A303,ORÇAMENTO!$A$10:$I$42,4)","v":"CPU.4"},"UNIDADE: ",{"$f":"VLOOKUP(A303,ORÇAMENTO!$A$10:$I$42,5)","v":"UN."}]
[]
[null,"TIPO ITEM","CODIGO ITEM","DESCRIÇÃO ITEM","UNIDADE ITEM","COEFICIENTE","PRECO UNITARIO","CUSTO TOTAL"]
[null,"COMPOSICAO",94962,"CONCRETO MAGRO PARA LASTRO, TRAÇO 1:4,5:4,5 (EM MASSA SECA DE CIMENTO/ AREIA / BRITA 1)","M3",2.4E-2,402.82,{"$f":"ROUNDDOWN(F308*G308,2)","v":9.66}]
[null,"COMPOSICAO",93358,"ESCAVAÇÃO MANUAL DE VALA COM PROFUNDIDADE MENOR OU IGUAL A 1,30 M","M3",2.4E-2,78.17,1.87]
[null,"COMPOSICAO",88309,"PEDREIRO COM ENCARGOS COMPLEMENTARES","H",0.2,27.45,5.49]
[null,"COMPOSICAO",88316,"SERVENTE COM ENCARGOS COMPLEMENTARES","H",1,19.760000000000002,19.760000000000002]
[null,"COMPOSICAO",103670,"LANÇAMENTO COM USO DE BALDES, ADENSAMENTO E ACABAMENTO DE CONCRETO EM ESTRUTURAS","M3",2.4E-2,281.77999999999997,6.76]
[null,"INSUMO",34723,"PLACA DE SINALIZACAO EM CHAPA DE ACO NUM 16 COM PINTURA REFLETIVA (CIRCULAR - D=50CM) ","M2",{"$f":"3.14*0.5*0.5/4","v":0.19625000000000001},577.5,113.33]
[null,"INSUMO",20209,"CAIBRO APARELHADO *6 X 8* CM, EM MASSARANDUBA, ANGELIM OU EQUIVALENTE DA REGIAO","M",3,35.799999999999997,107.4]
[null,"PRODUÇÃO DA EQUIPE",null,null,1,"CUSTO ",null,{"$f":"SUM(H308:H314)","v":264.27}]
[null,"TOTAL",{"$nulls":5},{"$f":"H315/E315","v":264.27},"OK"]
[null,"BDI                %",{"$nulls":5},{"$f":"1+$M$1","v":1.2201}]
[null,"TOTAL DO SERVIÇO - R$",{"$nulls":5},{"$f":"ROUND(H316*H317,2)","v":322.44}]
[]
[21,"CODEVASF",null,null," COMPOSIÇÃO DE PREÇO UNITÁRIO",null,null,null,{"$f":"H332","v":31.53},{"$f":"H334","v":38.47}]
[null,"OBRA:  ",{"$f":"$C$2","v":"PAVIMENTAÇÃO ASFÁLTICA EM CBUQ - ESTRADA VICINAL DE LIGAÇÃO AO DISTRITO DE SERRA DO MUNHO (TIROS / MG)"},null,null,null,"DATA: ",{"$f":"$H$2","v":" SETEMBRO / 2023   "}]
[null,"SERVIÇO:  ",{"$f":"VLOOKUP(A320,ORÇAMENTO!$A$10:$I$38,3)","v":"FORNECIMENTO E COLOCAÇÃO DE TACHA REFLETIVA EM PLÁSTICO INJETADO, BIDIRECIONAL, TIPO 1 (VERMELHA, AMARELA OU BRANCA)"},null,"SINAPI",{"$f":"VLOOKUP(A320,ORÇAMENTO!$A$10:$I$42,4)","v":"CPU.5"},"UNIDADE: ","UN."]
[]
[null,"TIPO ITEM","CODIGO ITEM","DESCRIÇÃO ITEM","UNIDADE ITEM","COEFICIENTE","PRECO UNITARIO","CUSTO TOTAL"]
[null,"COMPOSICAO","5824","CAMINHÃO TOCO, PBT 16.000 KG, CARGA ÚTIL MÁX. 10.685 KG, DIST. ENTRE EIXOS 4,8 M, POTÊNCIA 189 CV, INCLUSIVE CARROCERIA FIXA ABERTA DE MADEIRA P/ TRANSPORTE GERAL DE CARGA SECA","CHP",{"$f":"1/40.93","v":2.4431956999755682E-2},202.74,{"$f":"ROUNDDOWN(F325*G325,2)","v":4.95}]
[null,"COMPOSICAO",88277,"MONTADOR COM ENCARGOS COMPLEMENTARES","H",{"$f":"1/40.93","v":2.4431956999755682E-2},35.44,0.86]
[null,"COMPOSICAO","88316","SERVENTE COM ENCARGOS COMPLEMENTARES","H",{"$f":"4/40.93","v":9.7727827999022729E-2},"19,76",1.93]
[null,"INSUMO","M2041","ADESIVO A BASE DE RESINA POLIESTER","KG",0.10292,27.66,2.84]
[null,"INSUMO","M3825","TACHA REFLETIVA EM PLASTICO INJETADO BIDIRECIONAL SEM PINO - TIPO I","UNID.",1,20.951499999999999,20.95]
[{"$nulls":7},0]
[null,"PRODUÇÃO DA EQUIPE",null,null,1,"CUSTO ",null,{"$f":"SUM(H325:H330)","v":31.53}]
[null,"TOTAL",{"$nulls":5},{"$f":"H331/E331","v":31.53},"OK"]
[null,"BDI                %",{"$nulls":5},{"$f":"1+$M$1","v":1.2201}]
[null,"TOTAL DO SERVIÇO - R$",{"$nulls":5},{"$f":"ROUND(H332*H333,2)","v":38.47}]
[]
[22,"CODEVASF",null,null," COMPOSIÇÃO DE PREÇO UNITÁRIO",null,null,null,{"$f":"H350","v":5.84},{"$f":"H352","v":7.13}]
[null,"OBRA:  ",{"$f":"$C$2","v":"PAVIMENTAÇÃO ASFÁLTICA EM CBUQ - ESTRADA VICINAL DE LIGAÇÃO AO DISTRITO DE SERRA DO MUNHO (TIROS / MG)"},null,null,null,"DATA: ",{"$f":"$H$2","v":" SETEMBRO / 2023   "}]
[null,"SERVIÇO:  ",{"$f":"VLOOKUP(A336,ORÇAMENTO!$A$10:$I$38,3)","v":"PINTURA DE EIXO VIÁRIO SOBRE ASFALTO COM TINTA RETRORREFLETIVA A BASE DE RESINA ACRÍLICA COM MICROESFERAS DE VIDRO, APLICAÇÃO MECÂNICA COM DEMARCADORA AUTOPROPELIDA"},null,"SINAPI",{"$f":"VLOOKUP(A336,ORÇAMENTO!$A$10:$I$42,4)","v":102512},"UNIDADE: ",{"$f":"VLOOKUP(A336,ORÇAMENTO!$A$10:$I$42,5)","v":"M"}]
[]
[null,"TIPO ITEM","CODIGO ITEM","DESCRIÇÃO ITEM","UNIDADE ITEM","COEFICIENTE","PRECO UNITARIO","CUSTO TOTAL"]
[null,"INSUMO","5318","DILUENTE AGUARRAS","L","0,0020000","25,91",{"$f":"ROUNDDOWN(F341*G341,2)","v":0.05}]
[null,"INSUMO","7343","TINTA ACRILICA A BASE DE SOLVENTE, PARA SINALIZACAO HORIZONTAL VIARIA (NBR 11862)","L","0,0430000","17,82",0.76]
[null,"INSUMO","44477","MICROESFERAS DE VIDRO PARA SINALIZACAO HORIZONTAL VIARIA, TIPO II-A (DROP-ON)","KG","0,0250000","10,74",0.26]
[null,"INSUMO","44478","MICROESFERAS DE VIDRO PARA SINALIZACAO HORIZONTAL VIARIA, TIPO I-B (PREMIX)","KG","0,0110000","10,74",0.11]
[null,"COMPOSICAO","88310","PINTOR COM ENCARGOS COMPLEMENTARES","H","0,0340000","28,66",0.97]
[null,"COMPOSICAO","88316","SERVENTE COM ENCARGOS COMPLEMENTARES","H","0,0140000","19,76",0.27]
[null,"COMPOSICAO","95133","MÁQUINA DEMARCADORA DE FAIXA DE TRÁFEGO À FRIO, AUTOPROPELIDA, POTÊNCIA 38 HP","CHP","0,0003000","186,11",0.05]
[null,"COMPOSICAO","96159","MÁQUINA DEMARCADORA DE FAIXA DE TRÁFEGO À FRIO, AUTOPROPELIDA, POTÊNCIA 38 HP","CHI","0,0334000","100,90",3.37]
[null,"PRODUÇÃO DA EQUIPE",null,null,1,"CUSTO ",null,{"$f":"SUM(H341:H348)","v":5.84}]
[null,"TOTAL",{"$nulls":5},{"$f":"H349/E349","v":5.84},"OK"]
[null,"BDI                %",{"$nulls":5},{"$f":"1+$M$1","v":1.2201}]
[null,"TOTAL DO SERVIÇO - R$",{"$nulls":5},{"$f":"ROUND(H350*H351,2)","v":7.13}]
[]
[25,"CODEVASF",null,null," COMPOSIÇÃO DE PREÇO UNITÁRIO",null,null,null,{"$f":"H361","v":2812.65},{"$f":"H363","v":3234.55}]
[null,"OBRA:  ",{"$f":"$C$2","v":"PAVIMENTAÇÃO ASFÁLTICA EM CBUQ - ESTRADA VICINAL DE LIGAÇÃO AO DISTRITO DE SERRA DO MUNHO (TIROS / MG)"},null,null,null,"DATA: ",{"$f":"$H$2","v":" SETEMBRO / 2023   "}]
[null,"SERVIÇO:  ",{"$f":"VLOOKUP(A354,ORÇAMENTO!$A$10:$I$47,3)","v":"AQUISIÇÃO DE EMULSÃO ASFÁLTICA PARA IMPRIMAÇÃO (EAI) - EXCLUSIVE TRANSPORTE"},null,"SEINFRA",{"$f":"VLOOKUP(A354,ORÇAMENTO!$A$10:$I$47,4)","v":"CPU.7"},"UNIDADE: ",{"$f":"VLOOKUP(A354,ORÇAMENTO!$A$10:$I$47,5)","v":"T"}]
[]
[null,"TIPO ITEM","CODIGO ITEM","DESCRIÇÃO ITEM","UNIDADE ITEM","COEFICIENTE","PRECO UNITARIO","CUSTO TOTAL"]
[null,"INSUMO","ANP","EMULSÃO ASFÁLTICA PARA SERVIÇO DE IMPRIMAÇÃO (CUSTO ANP, INCLUINDO ICMS 18%)","T",1,{"$f":"2.30638*1000*1.2195122","v":2812.6585478359998},{"$f":"ROUNDDOWN(F359*G359,2)","v":2812.65}]
[null,"PRODUÇÃO DA EQUIPE",null,null,1,"CUSTO ",null,{"$f":"SUM(H359:H359)","v":2812.65}]
[null,"TOTAL",{"$nulls":5},{"$f":"H360/E360","v":2812.65}]
[null,"BDI                %",{"$nulls":5},{"$f":"1+$M$2","v":1.1499999999999999}]
[null,"TOTAL DO SERVIÇO - R$",{"$nulls":5},{"$f":"ROUND(H361*H362,2)","v":3234.55},"OK"]
[]
[26,"CODEVASF",null,null," COMPOSIÇÃO DE PREÇO UNITÁRIO",null,null,null,{"$f":"H372","v":2736.39},{"$f":"H374","v":3146.85}]
[null,"OBRA:  ",{"$f":"$C$2","v":"PAVIMENTAÇÃO ASFÁLTICA EM CBUQ - ESTRADA VICINAL DE LIGAÇÃO AO DISTRITO DE SERRA DO MUNHO (TIROS / MG)"},null,null,null,"DATA: ",{"$f":"$H$2","v":" SETEMBRO / 2023   "}]
[null,"SERVIÇO:  ",{"$f":"VLOOKUP(A365,ORÇAMENTO!$A$10:$I$47,3)","v":"AQUISIÇÃO DE EMULSAO ASFALTICA CATIONICA RR-1C - EXCLUSIVE TRANSPORTE"},null,"SINAPI",{"$f":"VLOOKUP(A365,ORÇAMENTO!$A$10:$I$47,4)","v":"CPU.8"},"UNIDADE: ",{"$f":"VLOOKUP(A365,ORÇAMENTO!$A$10:$I$47,5)","v":"T"}]
[]
[null,"TIPO ITEM","CODIGO ITEM","DESCRIÇÃO ITEM","UNIDADE ITEM","COEFICIENTE","PRECO UNITARIO","CUSTO TOTAL"]
[null,"INSUMO","ANP","EMULSÃO ASFÁLTICA CATIÔNICA RR-2C(CUSTO ANP, INCLUINDO ICMS 18%)","T",1,{"$f":"2.24384*1.2195122*1000","v":2736.390254848},{"$f":"ROUNDDOWN(F370*G370,2)","v":2736.39}]
[null,"PRODUÇÃO DA EQUIPE",null,null,1,"CUSTO ",null,{"$f":"SUM(H370:H370)","v":2736.39}]
[null,"TOTAL",{"$nulls":5},{"$f":"H371/E371","v":2736.39},"OK"]
[null,"BDI                %",{"$nulls":5},{"$f":"1+$M$2","v":1.1499999999999999}]
[null,"TOTAL DO SERVIÇO - R$",{"$nulls":5},{"$f":"ROUND(H372*H373,2)","v":3146.85}]
[]
[27,"CODEVASF",null,null," COMPOSIÇÃO DE PREÇO UNITÁRIO",null,null,null,{"$f":"H383","v":580},{"$f":"H385","v":667}]
[null,"OBRA:  ",{"$f":"$C$2","v":"PAVIMENTAÇÃO ASFÁLTICA EM CBUQ - ESTRADA VICINAL DE LIGAÇÃO AO DISTRITO DE SERRA DO MUNHO (TIROS / MG)"},null,null,null,"DATA: ",{"$f":"$H$2","v":" SETEMBRO / 2023   "}]
[null,"SERVIÇO:  ",{"$f":"VLOOKUP(A376,ORÇAMENTO!$A$10:$I$47,3)","v":"AQUISIÇÃO DE CONCRETO BETUMINOSO USINADO A QUENTE (CBUQ) PARA PAVIMENTACAO ASFALTICA, PADRAO DNIT, FAIXA C, COM CAP 50/70 - EXCLUSIVE TRANSPORTE"},null,"SINAPI",{"$f":"VLOOKUP(A376,ORÇAMENTO!$A$10:$I$47,4)","v":"CPU.9"},"UNIDADE: ",{"$f":"VLOOKUP(A376,ORÇAMENTO!$A$10:$I$47,5)","v":"T"}]
[]
[null,"TIPO ITEM","CODIGO ITEM","DESCRIÇÃO ITEM","UNIDADE ITEM","COEFICIENTE","PRECO UNITARIO","CUSTO TOTAL"]
[null,"INSUMO",1518,"CONCRETO BETUMINOSO USINADO A QUENTE (CBUQ) PARA PAVIMENTACAO ASFALTICA, PADRAO DNIT, FAIXA C, COM CAP 50/70 - AQUISICAO POSTO USINA","T",1,580,{"$f":"ROUNDDOWN(F381*G381,2)","v":580}]
[null,"PRODUÇÃO DA EQUIPE",null,null,1,"CUSTO ",null,{"$f":"SUM(H381:H381)","v":580}]
[null,"TOTAL",{"$nulls":5},{"$f":"H382/E382","v":580},"OK"]
[null,"BDI                %",{"$nulls":5},{"$f":"1+$M$2","v":1.1499999999999999}]
[null,"TOTAL DO SERVIÇO - R$",{"$nulls":5},{"$f":"ROUND(H383*H384,2)","v":667}]

{"sheet":"BDI SERV","index":2,"n_rows":37,"n_cols":20,"rows_kept":37,"cut":false,"hidden":false,"merged":[[31,1,31,2],[32,0,34,5],[36,0,36,5],[0,1,2,4],[3,1,4,1],[3,2,4,2],[28,0,28,5],[30,1,30,2]]}
[null,"DETALHAMENTO DO BDI - SERVIÇOS"]
[]
[]
[null,"Item","Descrição dos Serviços","%","%"]
[null,null,null,"PV","CD"]
[]
[null,1,"ADMINISTRAÇÃO CENTRAL"," ",4.01]
[null,"1.1","ESCRITÓRIO CENTRAL"," "," "]
[null,"1.2","VIAGENS"," "," "]
[null,"1.3","OUTROS"," "," "]
[null," "," "," "," "]
[null,2,"IMPOSTOS E TAXAS",{"$f":"SUM(D13:D16)","v":6.0500000000000007},{"$f":"SUM(E13:E16)","v":7.5600000000000005}]
[null,"2.1","ISS (*)",{"$f":"3*0.8","v":2.4000000000000004},{"$f":"ROUND(D13*1.2515,2)","v":3}]
[null,"2.2","PIS",0.65,{"$f":"ROUND(D14*1.2515,2)","v":0.81}]
[null,"2.3","Cofins",3,{"$f":"ROUND(D15*1.2515,2)","v":3.75}]
[null,"2.4","CONTRIBUIÇÃO PREVIDENCIÁRIA SOBRE A RENDA BRUTA",0,{"$f":"ROUND(D16*1.2515,2)","v":0}]
[]
[null,3,"TAXA DE RISCO"," ",{"$f":"SUM(E19:E22)","v":0.96}]
[null,"3.1","SEGURO",null,0.2]
[null,"3.2","RISCO",null,0.56000000000000005]
[null,"3.3","GARANTIA",null,0.2]
[{"$nulls":19},{"$f":"1/0.82","v":1.2195121951219512}]
[null,4,"DESPESAS FINANCEIRAS"," ",1.1100000000000001]
[]
[null,5,"LUCRO",null,8]
[]
[null," ","BDI - CALCULADO"," ",{"$f":"ROUND((((1+(E7+E18)/100)*(1+E23/100)*(1+E25/100)/(1-D12/100)-1)*100),2)","v":22.01}]
[]
["BDI = ((1+((AC+S+R+G)/100))x(1+DF/100)x(1+L/100)/(1-I/100)-1)*100"]
[]
[null,"BDI (CALCULADO):",null,{"$f":"ROUND((((1+((E7+E18)/100))*(1+E23/100)*(1+E25/100))/(1-D12/100)-1)*100,2)","v":22.01},"%"]
[null," "]
["(*) ISS CONFORME LEI COMPLEMENTAR Nº 1.416/2017 - ART. 2º\nDEDUÇÕES CONFORME ART.134 - §2º - I DO CÓDIGO TRIBUTÁRIO - QUANT. ESTIM. MATERIAL = 20%\n(FORNECIMENTO DE MATERIAIS ASFÁLTICOS COM BDI DIFERENCIADO)"]
[]
[]
[]
["BDI EM CONFORMIDADE COM OS ACÓRDÃOS Nº 2369/2011 e ACÓRDÃO Nº 2.622/2013 - TCU - PLENÁRIO"]

{"sheet":"BDI FORN","index":3,"n_rows":37,"n_cols":5,"rows_kept":37,"cut":false,"hidden":false,"merged":[[31,1,31,2],[32,0,34,5],[36,0,36,5],[0,1,2,4],[3,1,4,1],[3,2,4,2],[28,0,28,5],[30,1,30,2]]}
[null,"DETALHAMENTO DO BDI - FORNECIMENTO \n(MATERIAL ASFÁLTICO)"]
[]
[]
[null,"Item","Descrição dos Serviços","%","%"]
[null,null,null,"PV","CD"]
[]
[null,1,"ADMINISTRAÇÃO CENTRAL"," ",3.72]
[null,"1.1","ESCRITÓRIO CENTRAL"," "," "]
[null,"1.2","VIAGENS"," "," "]
[null,"1.3","OUTROS"," "," "]
[null," "," "," "," "]
[null,2,"IMPOSTOS E TAXAS",{"$f":"SUM(D13:D16)","v":3.65},{"$f":"SUM(E13:E16)","v":4.5600000000000005}]
[null,"2.1","ISS (*)",null,{"$f":"ROUND(D13*1.2515,2)","v":0}]
[null,"2.2","PIS",0.65,{"$f":"ROUND(D14*1.2515,2)","v":0.81}]
[null,"2.3","Cofins",3,{"$f":"ROUND(D15*1.2515,2)","v":3.75}]
[null,"2.4","CONTRIBUIÇÃO PREVIDENCIÁRIA SOBRE A RENDA BRUTA",0,{"$f":"ROUND(D16*1.2515,2)","v":0}]
[]
[null,3,"TAXA DE RISCO"," ",{"$f":"SUM(E19:E22)","v":0.82000000000000006}]
[null,"3.1","SEGURO",null,0.16]
[null,"3.2","RISCO",null,0.5]
[null,"3.3","GARANTIA",null,0.16]
[]
[null,4,"DESPESAS FINANCEIRAS"," ",0.94]
[]
[null,5,"LUCRO",null,5]
[]
[null," ","BDI - CALCULADO"," ",{"$f":"ROUND((((1+(E7+E18)/100)*(1+E23/100)*(1+E25/100)/(1-D12/100)-1)*100),2)","v":15}]
[]
["BDI = ((1+((AC+S+R+G)/100))x(1+DF/100)x(1+L/100)/(1-I/100)-1)*100"]
[]
[null,"BDI (CALCULADO):",null,{"$f":"ROUND((((1+((E7+E18)/100))*(1+E23/100)*(1+E25/100))/(1-D12/100)-1)*100,2)","v":15},"%"]
[null," "]
[]
[]
[]
[]
["BDI EM CONFORMIDADE COM OS ACÓRDÃOS Nº 2369/2011 e ACÓRDÃO Nº 2.622/2013 - TCU - PLENÁRIO"]

{"sheet":"CRONOGRAMA","index":4,"n_rows":21,"n_cols":14,"rows_kept":21,"cut":false,"hidden":false,"merged":[[17,1,18,2],[20,1,24,13],[13,0,14,0],[13,1,14,1],[13,2,14,2],[15,0,16,0],[15,1,16,1],[15,2,16,2],[9,0,10,0],[9,1,10,1],[9,2,10,2],[11,0,12,0],[11,1,12,1],[11,2,12,2],[3,1,3,12],[5,0,6,0],[5,1,6,1],[5,2,6,2],[7,0,8,0],[7,1,8,1],[7,2,8,2],[0,1,0,13],[1,1,2,1],[1,2,2,4],[1,6,1,13],[2,6,2,13]]}
[null,"CRONOGRAMA FÍSICO-FINANCEIRO"]
[null,"OBRA: ",{"$f":"ORÇAMENTO!C5","v":"PAVIMENTAÇÃO ASFÁLTICA EM CBUQ - ESTRADA VICINAL DE LIGAÇÃO AO DISTRITO DE SERRA DO MUNHO (TIROS / MG)"},null,null,"VALOR:",{"$f":"ORÇAMENTO!I40","v":4878272.22}]
[{"$nulls":5},"PRAZO: ","180 DIAS "]
[]
[null,"ITEM","ETAPAS/DESCRIÇAO","FISICO/  FINANCEIRO","TOTAL    ETAPAS","MÊS 1","MÊS 2","MÊS 3","MÊS 4","MÊS 5","MÊS 6","MÊS 7","MÊS 8","TOTAL"]
["A",{"$f":"VLOOKUP(A6,ORÇAMENTO!$A$9:$I$40,2)","v":1},{"$f":"VLOOKUP(A6,ORÇAMENTO!$A$9:$I$40,3)","v":"SERVIÇOS PRELIMINARES "},"FISICO ",{"$f":"ROUND(E7/$G$2,4)","v":6.0999999999999999E-2},0.1,0.1,0.15,0.15,0.15,0.15,0.1,0.1,{"$f":"SUM(F6:M6)","v":1}]
[null,null,null,"FINANCEIRO",{"$f":"ORÇAMENTO!I9","v":297578.78000000003},{"$f":"ROUND($E$7*F6,2)","v":29757.88},{"$f":"ROUND($E$7*G6,2)","v":29757.88},{"$f":"ROUND($E$7*H6,2)","v":44636.82},{"$f":"ROUND($E$7*I6,2)","v":44636.82},{"$f":"ROUND($E$7*J6,2)","v":44636.82},{"$f":"ROUND($E$7*K6,2)","v":44636.82},29757.88,29757.88,{"$f":"SUM(F7:M7)","v":297578.8}]
["B",{"$f":"VLOOKUP(A8,ORÇAMENTO!$A$9:$I$40,2)","v":2},{"$f":"VLOOKUP(A8,ORÇAMENTO!$A$9:$I$40,3)","v":"TERRAPLANAGEM E PAVIMENTAÇÃO"},"FISICO ",{"$f":"ROUND(E9/$G$2,4)","v":0.1492},0.1,0.1,0.15,0.15,0.15,0.15,0.1,0.1,{"$f":"SUM(F8:M8)","v":1}]
[null,null,null,"FINANCEIRO",{"$f":"ORÇAMENTO!I15","v":728062.2},{"$f":"ROUND($E$9*F8,2)","v":72806.22},{"$f":"ROUND($E$9*G8,2)","v":72806.22},{"$f":"ROUND($E$9*H8,2)","v":109209.33},{"$f":"ROUND($E$9*I8,2)","v":109209.33},{"$f":"ROUND($E$9*J8,2)","v":109209.33},{"$f":"ROUND($E$9*K8,2)","v":109209.33},72806.22,72806.22,{"$f":"SUM(F9:M9)","v":728062.2}]
["C",{"$f":"VLOOKUP(A10,ORÇAMENTO!$A$9:$I$40,2)","v":3},{"$f":"VLOOKUP(A10,ORÇAMENTO!$A$9:$I$40,3)","v":"TRANSPORTE DE MATERIAIS"},"FISICO ",{"$f":"ROUND(E11/$G$2,4)","v":3.7400000000000003E-2},0.1,0.1,0.15,0.15,0.15,0.15,0.1,0.1,{"$f":"SUM(F10:M10)","v":1}]
[null,null,null,"FINANCEIRO",{"$f":"ORÇAMENTO!I23","v":182410},{"$f":"ROUND($E$11*F10,2)","v":18241},{"$f":"ROUND($E$11*G10,2)","v":18241},{"$f":"ROUND($E$11*H10,2)","v":27361.5},{"$f":"ROUND($E$11*I10,2)","v":27361.5},{"$f":"ROUND($E$11*J10,2)","v":27361.5},{"$f":"ROUND($E$11*K10,2)","v":27361.5},18241,18241,{"$f":"SUM(F11:M11)-0.04","v":182409.96}]
["D",{"$f":"VLOOKUP(A12,ORÇAMENTO!$A$9:$I$40,2)","v":4},{"$f":"VLOOKUP(A12,ORÇAMENTO!$A$9:$I$40,3)","v":"TRANSPORTE DE MATERIAL ASFÁLTICO (BDI DIFERENCIADO)"},"FISICO ",{"$f":"ROUND(E13/$G$2,4)","v":3.7400000000000003E-2},0.1,0.1,0.15,0.15,0.15,0.15,0.1,0.1,{"$f":"SUM(F12:M12)","v":1}]
[null,null,null,"FINANCEIRO",{"$f":"ORÇAMENTO!I26","v":182600},{"$f":"ROUND($E$13*F12,2)","v":18260},{"$f":"ROUND($E$13*G12,2)","v":18260},{"$f":"ROUND($E$13*H12,2)","v":27390},{"$f":"ROUND($E$13*I12,2)","v":27390},{"$f":"ROUND($E$13*J12,2)","v":27390},{"$f":"ROUND($E$13*K12,2)","v":27390},18260,18260,{"$f":"SUM(F13:M13)-0.02","v":182599.98}]
["E",{"$f":"VLOOKUP(A14,ORÇAMENTO!$A$9:$I$40,2)","v":5},{"$f":"VLOOKUP(A14,ORÇAMENTO!$A$9:$I$40,3)","v":"DRENAGEM E OBRAS COMPLEMENTARES"},"FISICO ",{"$f":"ROUND(E15/$G$2,4)","v":0.25340000000000001},0,0,0.1,0.15,0.2,0.2,0.2,0.15,{"$f":"SUM(F14:M14)","v":1}]
[null,null,null,"FINANCEIRO",{"$f":"ORÇAMENTO!I29","v":1235922},{"$f":"ROUND($E$15*F14,2)","v":0},{"$f":"ROUND($E$15*G14,2)","v":0},{"$f":"ROUND($E$15*H14,2)","v":123592.2},{"$f":"ROUND($E$15*I14,2)","v":185388.3},{"$f":"ROUND($E$15*J14,2)","v":247184.4},{"$f":"ROUND($E$15*K14,2)","v":247184.4},247184.4,185388.3,{"$f":"SUM(F15:M15)-0.02","v":1235921.98}]
["F",{"$f":"VLOOKUP(A16,ORÇAMENTO!$A$9:$I$40,2)","v":6},{"$f":"VLOOKUP(A16,ORÇAMENTO!$A$9:$I$40,3)","v":"FORNECIMENTOS - MATERIAL ASFÁLTICO (BDI DIFERENCIADO)"},"FISICO ",{"$f":"ROUND(E17/$G$2,4)","v":0.46160000000000001},0.1,0.1,0.15,0.15,0.15,0.15,0.1,0.1,{"$f":"SUM(F16:M16)","v":1}]
[null,null,null,"FINANCEIRO",{"$f":"ORÇAMENTO!I36","v":2251699.2399999998},{"$f":"ROUND($E$17*F16,2)","v":225169.92000000001},{"$f":"ROUND($E$17*G16,2)","v":225169.92000000001},{"$f":"ROUND($E$17*H16,2)","v":337754.89},{"$f":"ROUND($E$17*I16,2)","v":337754.89},{"$f":"ROUND($E$17*J16,2)","v":337754.89},{"$f":"ROUND($E$17*K16,2)","v":337754.89},225169.92000000001,225169.92000000001,{"$f":"SUM(F17:M17)-0.02","v":2251699.2200000002}]
[null,"TOTAL",null,"FISICO ",{"$f":"SUM(F18:M18)","v":1.0000000040998123},{"$f":"F19/$E$19","v":7.4664759073244186E-2},{"$f":"G19/$E$19","v":7.4664759073244186E-2},{"$f":"H19/$E$19","v":0.13733238117654697},{"$f":"I19/$E$19","v":0.1500000014349343},{"$f":"J19/$E$19","v":0.16266762169332161},0.16266762169332161,0.12533524010679339,0.11266761984840611,{"$f":"SUM(F18:M18)","v":1.0000000040998123}]
[null,null,null,"FINANCEIRO",{"$f":"E11+E9+E7+E13+E17+E15","v":4878272.22},364235.02,364235.02,669944.74,731740.84000000008,{"$f":"J11+J9+J7+J13+J17+J15","v":793536.94000000006},793536.94000000006,611419.42000000004,{"$f":"M11+M9+M7+M13+M17+M15","v":549623.32000000007},{"$f":"SUM(F19:M19)-0.02","v":4878272.2200000007}]
[]
[null,"OBSERVAÇÕES:"]