{"text_format":"2","workbook":"xlsx","n_sheets":5,"sheets":["ORÇAMENTO","CPU","BDI SERV","BDI FORN","CRONOGRAMA"],"not_rendered":{"charts":0,"images":4,"macros":0,"external_links":0,"defined_names":5,"comments":0,"pivot_tables":0},"unopened":[],"bounds":{"document_bytes":16777216,"sheet_cells":100000,"run_cost":"one","rows_first":2000,"rows_last":500,"rows_between":2000,"halvings":0,"cell_chars":16384,"cell_head_chars":4096},"cells_cut":0,"cells_raw":0,"read":"whole","date_system":"1900"}

{"sheet":"ORÇAMENTO","index":0,"n_rows":43,"n_cols":9,"rows_kept":43,"cut":false,"hidden":false,"merged":[[42,1,42,2],[0,0,7,0],[0,2,0,8],[1,2,1,8],[2,2,2,8],[4,2,4,8],[5,6,5,7],[6,1,6,2],[6,6,6,7],[18,6,18,7]]}
["<---- NUMERAR SERVIÇOS PARA CPU",null,"Ministério do Desenvolvimento Regional"]
[null,null,"Companhia de Desenvolvimento dos Vales do São Francisco e do Parnaíba"]
[null,null,"1ª Superintendência Regional"]
[]
[null,"OBRA: "," PAVIMENTAÇÃO ASFÁLTICA EM CBUQ – ITEM 2 – DIVERSOS LOGRADOUROS DA COMUNIDADE MANGUEIRO - NINHEIRA/MG "]
[null,"DATA:"," SETEMBRO / 2023   ",null,null,null,"BDI Serviços:",null,{"$f":"'BDI SERV'!D31/100","v":0.23550000000000001}]
[null,"PRAZO DE EXECUÇÃO:     120 DIAS",{"$nulls":4},"BDI Fornecimento:",null,{"$f":"'BDI FORN'!D31/100","v":0.15}]
[null,"ITEM","DISCRIMINAÇÃO","REFER.","UNID.","QUANT.","P. UNITÁRIO","P.UNIT.C/ BDI","P. TOTAL"]
["A",1,"SERVIÇOS PRELIMINARES ",{"$nulls":5},{"$f":"SUM(I10:I14)","v":73691.7}]
[1,"1.1","MOBILIZAÇÃO E DESMOBILIZAÇÃO","CPU.1","GL",1,{"$f":"VLOOKUP(A10,CPU!$A$1:$N$4726,9)","v":6732.48},{"$f":"VLOOKUP(A10,CPU!$A$1:$N$4726,10)","v":8317.98},{"$f":"ROUND(F10*H10,2)","v":8317.98}]
[2,"1.2","ADMINISTRAÇÃO LOCAL","CPU.2","GL",1,{"$f":"VLOOKUP(A11,CPU!$A$1:$N$4726,9)","v":39779.480000000003},{"$f":"VLOOKUP(A11,CPU!$A$1:$N$4726,10)","v":49147.55},{"$f":"ROUND(F11*H11,2)","v":49147.55}]
[3,"1.3","CANTEIRO DE OBRAS","CPU.3","GL",1,{"$f":"VLOOKUP(A12,CPU!$A$1:$N$4726,9)","v":9444},{"$f":"VLOOKUP(A12,CPU!$A$1:$N$4726,10)","v":11668.06},{"$f":"ROUND(F12*H12,2)","v":11668.06}]
[4,"1.4","PLACA DE OBRA EM CHAPA DE AÇO GALVANIZADO",103689,"M2",4.5,{"$f":"VLOOKUP(A13,CPU!$A$1:$N$4726,9)","v":340.5},{"$f":"VLOOKUP(A13,CPU!$A$1:$N$4726,10)","v":420.69},{"$f":"ROUND(F13*H13,2)","v":1893.11}]
[5,"1.5","SERVIÇOS TOPOGRÁFICOS PARA PAVIMENTAÇÃO, INCLUSIVE NOTA DE SERVIÇO, ACOMPANHAMENTO E GREIDE",78472,"M2",6500,{"$f":"VLOOKUP(A14,CPU!$A$1:$N$4726,9)","v":0.32999999999999996},{"$f":"VLOOKUP(A14,CPU!$A$1:$N$4726,10)","v":0.41},{"$f":"ROUND(F14*H14,2)","v":2665}]
["B",2,"PAVIMENTAÇÃO",{"$nulls":5},{"$f":"SUM(I16:I23)","v":116873.23999999999}]
[6,"2.1","ESCAVAÇÃO HORIZONTAL EM SOLO DE 1A CATEGORIA ",101116,"M3",2000,{"$f":"VLOOKUP(A16,CPU!$A$1:$N$4726,9)","v":2.2000000000000002},{"$f":"VLOOKUP(A16,CPU!$A$1:$N$4726,10)","v":2.72},{"$f":"ROUND(F16*H16,2)","v":5440}]
[7,"2.2","CARGA, MANOBRA E DESCARGA DE SOLOS E MATERIAIS GRANULARES EM CAMINHÃO BASCULANTE",100976,"M3",2000,{"$f":"VLOOKUP(A17,CPU!$A$1:$N$4726,9)","v":8.7100000000000009},{"$f":"VLOOKUP(A17,CPU!$A$1:$N$4726,10)","v":10.76},21520]
[8,"2.3","REGULARIZAÇÃO E COMPACTAÇÃO DO SUBLEITO ",100576,"M2",6500,{"$f":"VLOOKUP(A18,CPU!$A$1:$N$4726,9)","v":2.57},{"$f":"VLOOKUP(A18,CPU!$A$1:$N$4726,10)","v":3.18},20670]
[8.5,"2.4","CASCALHO DE CAVA - (EXCLUSIVE CARGA/TRANSPORTE)","-","M3",1000,"FORNECIDO PELA PREFEITURA",null,"-"]
[9,"2.5","EXECUÇÃO E COMPACTAÇÃO DE BASE E OU SUB BASE PARA PAVIMENTAÇÃO EM CASCALHO - EXCLUSIVE SOLO, ESCAVAÇÃO, CARGA E TRANSPORTE.",96388,"M3",1000,{"$f":"VLOOKUP(A20,CPU!$A$1:$N$4726,9)","v":12.469999999999999},{"$f":"VLOOKUP(A20,CPU!$A$1:$N$4726,10)","v":15.41},15410]
[10,"2.6","IMPRIMAÇÃO COM EMULSÃO ASFÁLTICA DE IMPRIMAÇÃO (EAI)",96401,"M2",6500,{"$f":"VLOOKUP(A21,CPU!$A$1:$N$4726,9)","v":1.23},{"$f":"VLOOKUP(A21,CPU!$A$1:$N$4726,10)","v":1.52},9880]
[11,"2.7","PINTURA DE LIGAÇÃO COM EMULSÃO ASFÁLTICA RR-1C",96402,"M2",5700,{"$f":"VLOOKUP(A22,CPU!$A$1:$N$4726,9)","v":1.01},{"$f":"VLOOKUP(A22,CPU!$A$1:$N$4726,10)","v":1.25},7125]
[12,"2.8","EXECUÇÃO DE PAVIMENTO COM APLICAÇÃO DE CONCRETO ASFÁLTICO USINADO A QUENTE (CBUQ), CAMADA DE ROLAMENTO - EXCLUSIVE TRANSPORTE",95995,"M3",230.00400000000002,{"$f":"VLOOKUP(A23,CPU!$A$1:$N$4726,9)","v":129.6},{"$f":"VLOOKUP(A23,CPU!$A$1:$N$4726,10)","v":160.12},36828.239999999998]
["C",3,"TRANSPORTE DE MATERIAIS",{"$nulls":5},{"$f":"SUM(I25:I26)","v":32822.31}]
[13,"3.1","TRANSPORTE COM CAMINHÃO BASCULANTE, EM VIA URBANA EM REVESTIMENTO PRIMÁRIO",95426,"M3XKM",15999.995500000001,{"$f":"VLOOKUP(A25,CPU!$A$1:$N$4726,9)","v":1.24},{"$f":"VLOOKUP(A25,CPU!$A$1:$N$4726,10)","v":1.5320199999999999},{"$f":"ROUND(F25*H25,2)","v":24512.31}]
[14,"3.3","TRANSPORTE COM CAMINHÃO CARROCERIA 9T, EM VIA DE REVESTIMENTO PRIMÁRIO",100946,"TXKM",3000.000556,{"$f":"VLOOKUP(A26,CPU!$A$1:$N$4726,9)","v":2.2400000000000002},{"$f":"VLOOKUP(A26,CPU!$A$1:$N$4726,10)","v":2.77},{"$f":"ROUND(F26*H26,2)","v":8310}]
["D",4,"TRANSPORTE DE MATERIAL ASFÁLTICO (BDI DIFERENCIADO)",{"$nulls":5},{"$f":"SUM(I28:I30)","v":68460}]
[15,"4.1","TRANSPORTE DE MASSA ASFÁLTICA COM CAMINHÃO BASCULANTE, EM VIA URBANA PAVIMENTADA (BDI DIFERENCIADO)",95430,"TXKM",43000,{"$f":"VLOOKUP(A28,CPU!$A$1:$N$4726,9)","v":0.44999999999999996},{"$f":"VLOOKUP(A28,CPU!$A$1:$N$4726,10)","v":0.52},{"$f":"ROUND(F28*H28,2)","v":22360}]
[15.5,"4.2","TRANSPORTE DE MASSA ASFÁLTICA COM CAMINHÃO BASCULANTE, EM VIA DE REVESTIMENTO PRIMÁRIO (BDI DIFERENCIADO)",95429,"TXKM",37000,{"$f":"VLOOKUP(A29,CPU!$A$1:$N$4726,9)","v":0.96},{"$f":"VLOOKUP(A29,CPU!$A$1:$N$4726,10)","v":1.1000000000000001},{"$f":"ROUND(F29*H29,2)","v":40700}]
[16,"4.2","TRANSPORTE COM CAMINHÃO TANQUE DE TRANSPORTE DE MATERIAL ASFÁLTICO DE 30000 L, EM VIA URBANA PAVIMENTADA (BDI DIFERENCIADO)",102331,"TXKM",9000,{"$f":"VLOOKUP(A30,CPU!$A$1:$N$4726,9)","v":0.52},{"$f":"VLOOKUP(A30,CPU!$A$1:$N$4726,10)","v":0.6},{"$f":"ROUND(F30*H30,2)","v":5400}]
["E",5,"OBRAS COMPLEMENTARES",{"$nulls":5},{"$f":"SUM(I32:I38)","v":225927.32}]
[17,"5.1","ASSENTAMENTO DE GUIA (MEIO-FIO) EM TRECHO RETO, CONFECCIONADA EM CONCRETO PRÉ-FABRICADO, DIMENSÕES 100X15X13X30 CM (COMPRIMENTO X BASE INFERIOR X BASE SUPERIOR X ALTURA), PARA VIAS URBANAS ","94273a","M",1750,{"$f":"VLOOKUP(A32,CPU!$A$1:$N$4726,9)","v":48.56},{"$f":"VLOOKUP(A32,CPU!$A$1:$N$4726,10)","v":60},{"$f":"ROUND(F32*H32,2)","v":105000}]
[17.5,"5.2","EXECUÇÃO DE SARJETA DE CONCRETO USINADO, MOLDADA IN LOCO, 30 CM BASE X 5 CM ALTURA","94287a","M",1550,{"$f":"VLOOKUP(A33,CPU!$A$1:$N$4726,9)","v":36.480000000000004},{"$f":"VLOOKUP(A33,CPU!$A$1:$N$4726,10)","v":45.07},{"$f":"ROUND(F33*H33,2)","v":69858.5}]
[18,"5.3","PINTURA DE FAIXA DE PEDESTRE OU ZEBRADA TINTA RETRORREFLETIVA A BASE DE RESINA ACRÍLICA COM MICROESFERAS DE VIDRO, E = 30 CM, APLICAÇÃO MANUAL",102509,"M2",250,{"$f":"VLOOKUP(A34,CPU!$A$1:$N$4726,9)","v":25.52},{"$f":"VLOOKUP(A34,CPU!$A$1:$N$4726,10)","v":31.53},7882.5]
[19,"5.4","FORNECIMENTO E INSTALAÇÃO DE PLACA DE SINALIZAÇÃO VIÁRIA - REGULAMENTAÇÃO (FAIXA DE PEDESTRE E OUTROS)","CPU.4","UN.",20,{"$f":"VLOOKUP(A35,CPU!$A$1:$N$4726,9)","v":384.81},{"$f":"VLOOKUP(A35,CPU!$A$1:$N$4726,10)","v":475.43},9508.6]
[20,"5.5","FORNECIMENTO E INSTALAÇÃO DE PLACA DE SINALIZAÇÃO VIÁRIA - REGULAMENTAÇÃO (PARE)","CPU.5","UN.",12,{"$f":"VLOOKUP(A36,CPU!$A$1:$N$4726,9)","v":444.73},{"$f":"VLOOKUP(A36,CPU!$A$1:$N$4726,10)","v":549.46},6593.52]
[21,"5.6","FORNECIMENTO E INSTALAÇÃO DE PLACA DE AÇO PARA IDENTIFICACAO DE RUA, *45 CM X 20* CM, INCLUSIVE SUPORTE EM TUBO DE AÇO GALVANIZADO                                   ","CPU.6","UN.",10,{"$f":"VLOOKUP(A37,CPU!$A$1:$N$4726,9)","v":322.14999999999998},{"$f":"VLOOKUP(A37,CPU!$A$1:$N$4726,10)","v":398.02},3980.2]
[22,"5.7","PINTURA DE EIXO VIÁRIO SOBRE ASFALTO COM TINTA RETRORREFLETIVA A BASE DE RESINA ACRÍLICA COM MICROESFERAS DE VIDRO, APLICAÇÃO MECÂNICA COM DEMARCADORA AUTOPROPELIDA - ESPESSURA DE 0,10 MM",102512,"M",3200,{"$f":"VLOOKUP(A38,CPU!$A$1:$N$4726,9)","v":5.84},{"$f":"VLOOKUP(A38,CPU!$A$1:$N$4726,10)","v":7.22},23104]
["F",6,"FORNECIMENTOS - MATERIAL ASFÁLTICO (BDI DIFERENCIADO)",{"$nulls":5},{"$f":"SUM(I40:I42)","v":449957.01999999996}]
[23,"6.1","AQUISIÇÃO DE EMULSÃO ASFÁLTICA PARA IMPRIMAÇÃO (EAI) - EXCLUSIVE TRANSPORTE","CPU.7","T",8.5,{"$f":"VLOOKUP(A40,CPU!$A$1:$N$4726,9)","v":2689.76},{"$f":"VLOOKUP(A40,CPU!$A$1:$N$4726,10)","v":3093.22},{"$f":"ROUND(F40*H40,2)","v":26292.37}]
{"$rows_left_out":4}
{"sheet":"CPU","index":1,"n_rows":423,"n_cols":13,"rows_kept":423,"cut":false,"hidden":false,"merged":[[244,0,256,0],[244,1,244,3],[244,4,244,7],[245,2,245,5],[246,2,246,3],[247,1,247,7],[252,1,252,3],[252,5,252,6],[253,1,253,6],[254,1,254,6],[255,1,255,6],[205,0,217,0],[205,1,205,3],[205,4,205,7],[206,2,206,5],[207,2,207,3],[208,1,208,7],[213,1,213,3],[213,5,213,6],[214,1,214,6],[215,1,215,6],[216,1,216,6],[285,0,300,0],[285,1,285,3],[285,4,285,7],[286,2,286,5],[287,2,287,3],[288,1,288,7],[297,1,297,3],[297,5,297,6],[298,1,298,6],[299,1,299,6],[300,1,300,6],[413,0,422,0],[413,1,413,3],[413,4,413,7],[414,2,414,5],[415,2,415,3],[416,1,416,7],[419,1,419,3],[419,5,419,6],[420,1,420,6],[421,1,421,6],[422,1,422,6],[402,0,411,0],[402,1,402,3],[402,4,402,7],[403,2,403,5],[404,2,404,3],[405,1,405,7],[408,1,408,3],[408,5,408,6],[409,1,409,6],[410,1,410,6],[411,1,411,6],[391,0,400,0],[391,1,391,3],[391,4,391,7],[392,2,392,5],[393,2,393,3],[394,1,394,7],[397,1,397,3],[397,5,397,6],[398,1,398,6],[399,1,399,6],[400,1,400,6],[373,0,389,0],[373,1,373,3],[373,4,373,7],[374,2,374,5],[375,2,375,3],[376,1,376,7],[386,1,386,3],[386,5,386,6],[387,1,387,6],[388,1,388,6],[389,1,389,6],[355,0,371,0],[355,1,355,3],[355,4,355,7],[356,2,356,5],[357,2,357,3],[358,1,358,7],[368,1,368,3],[368,5,368,6],[369,1,369,6],[370,1,370,6],[371,1,371,6],[337,0,353,0],[337,1,337,3],[337,4,337,7],[338,2,338,5],[339,2,339,3],[340,1,340,7],[350,1,350,3],[350,5,350,6],[351,1,351,6],[352,1,352,6],[353,1,353,6],[319,0,335,0],[319,1,319,3],[319,4,319,7],[320,2,320,5],[321,2,321,3],[322,1,322,7],[332,1,332,3],[332,5,332,6],[333,1,333,6],[334,1,334,6],[335,1,335,6],[302,0,317,0],[302,1,302,3],[302,4,302,7],[303,2,303,5],[304,2,304,3],[305,1,305,7],[314,1,314,3],[314,5,314,6],[315,1,315,6],[316,1,316,6],[317,1,317,6],[269,0,283,0],[269,1,269,3],[269,4,269,7],[269,10,269,11],[270,2,270,5],[271,2,271,3],[272,1,272,7],[280,1,280,3],[280,5,280,6],[281,1,281,6],[282,1,282,6],[283,1,283,6],[257,0,268,0],[257,1,257,3],[257,4,257,7],[257,10,257,11],[258,2,258,5],[259,2,259,3],[260,1,260,7],[264,1,264,3],[264,5,264,6],[265,1,265,6],[266,1,266,6],[267,1,267,6],[231,0,242,0],[231,1,231,3],[231,4,231,7],[232,2,232,5],[233,2,233,3],[234,1,234,7],[239,1,239,3],[239,5,239,6],[240,1,240,6],[241,1,241,6],[242,1,242,6],[218,0,229,0],[218,1,218,3],[218,4,218,7],[219,2,219,5],[220,2,220,3],[221,1,221,7],[226,1,226,3],[226,5,226,6],[227,1,227,6],[228,1,228,6],[229,1,229,6],[183,0,204,0],[183,1,183,3],[183,4,183,7],[183,10,183,11],[184,2,184,5],[185,2,185,3],[186,1,186,7],[200,1,200,3],[200,5,200,6],[201,1,201,6],[202,1,202,6],[203,1,203,6],[164,0,182,0],[164,1,164,3],[164,4,164,7],[164,10,164,11],[165,2,165,5],[166,2,166,3],[167,1,167,7],[178,1,178,3],[178,5,178,6],[179,1,179,6],[180,1,180,6],[181,1,181,6],[145,0,163,0],[145,1,145,3],[145,4,145,7],[145,10,145,11],[146,2,146,5],[147,2,147,3],[148,1,148,7],[159,1,159,3],[159,5,159,6],[160,1,160,6],[161,1,161,6],[162,1,162,6],[126,0,143,0],[126,1,126,3],[126,4,126,7],[127,2,127,5],[128,2,128,3],[129,1,129,7],[140,1,140,3],[140,5,140,6],[141,1,141,6],[142,1,142,6],[143,1,143,6],[108,0,125,0],[108,1,108,3],[108,4,108,7],[108,10,108,11],[109,2,109,5],[110,2,110,3],[111,1,111,7],[121,1,121,3],[121,5,121,6],[122,1,122,6],[123,1,123,6],[124,1,124,6],[94,0,106,0],[94,1,94,3],[94,4,94,7],[95,2,95,5],[96,2,96,3],[97,1,97,7],[103,1,103,3],[103,5,103,6],[104,1,104,6],[105,1,105,6],[106,1,106,6],[81,0,93,0],[81,1,81,3],[81,4,81,7],[81,10,81,11],[82,2,82,5],[83,2,83,3],[84,1,84,7],[89,1,89,3],[89,5,89,6],[90,1,90,6],[91,1,91,6],[92,1,92,6],[65,0,80,0],[65,1,65,3],[65,4,65,7],[65,10,65,11],[66,2,66,5],[67,2,67,3],[68,1,68,7],[76,1,76,3],[76,5,76,6],[77,1,77,6],[78,1,78,6],[79,1,79,6],[47,0,64,0],[47,1,47,3],[47,4,47,7],[47,10,47,11],[48,2,48,5],[49,2,49,3],[50,1,50,7],[60,1,60,3],[60,5,60,6],[61,1,61,6],[62,1,62,6],[63,1,63,6],[33,0,46,0],[33,1,33,3],[33,4,33,7],[33,10,33,11],[34,2,34,5],[34,8,35,9],[35,2,35,3],[36,1,36,7],[42,1,42,3],[42,5,42,6],[43,1,43,6],[44,1,44,6],[45,1,45,6],[14,0,32,0],[14,1,14,3],[14,4,14,7],[14,10,14,11],[15,2,15,5],[15,8,16,9],[16,2,16,3],[17,1,17,7],[28,1,28,3],[28,5,28,6],[29,1,29,6],[30,1,30,6],[31,1,31,6],[0,0,13,0],[0,1,0,3],[0,4,0,7],[0,10,0,11],[1,2,1,5],[1,10,1,11],[2,2,2,3],[3,1,3,7],[9,1,9,3],[9,5,9,6],[10,1,10,6],[11,1,11,6],[12,1,12,6]]}
[1,"CODEVASF",null,null," COMPOSIÇÃO DE PREÇO UNITÁRIO",null,null,null,{"$f":"H11","v":6732.48},{"$f":"H13","v":8317.98},"BDI CALCULADO:",null,{"$f":"ORÇAMENTO!I6","v":0.23550000000000001}]
[null,"OBRA:  ",{"$f":"ORÇAMENTO!C5","v":" PAVIMENTAÇÃO ASFÁLTICA EM CBUQ – ITEM 2 – DIVERSOS LOGRADOUROS DA COMUNIDADE MANGUEIRO - NINHEIRA/MG "},null,null,null,"DATA: ",{"$f":"ORÇAMENTO!C6","v":" SETEMBRO / 2023   "},null,null,"BDI DIFERENCIADO:",null,{"$f":"'BDI FORN'!D31/100","v":0.15}]
[null,"SERVIÇO:  ",{"$f":"VLOOKUP(A1,ORÇAMENTO!A10:I32,3)","v":"MOBILIZAÇÃO E DESMOBILIZAÇÃO"},null,"Referência:",{"$f":"VLOOKUP(A1,ORÇAMENTO!$A$10:$I$32,4)","v":"CPU.1"},"UNIDADE: ",{"$f":"VLOOKUP(A1,ORÇAMENTO!A10:I32,5)","v":"GL"}]
[]
[null,"TIPO ITEM","CODIGO ITEM","DESCRIÇÃO ITEM","UNIDADE ITEM","COEFICIENTE","PRECO UNITARIO","CUSTO TOTAL"]
[null,"COMPOSICAO",89876,"CAMINHÃO BASCULANTE 14 M3, COM CAVALO MECÂNICO DE CAPACIDADE MÁXIMA DE TRAÇÃO COMBINADO DE 36000 KG, POTÊNCIA 286 CV, INCLUSIVE SEMIREBOQUE COM CAÇAMBA METÁLICA","CHP DIURNO.",4,316.13,{"$f":"ROUNDDOWN(F6*G6,2)","v":1264.52}]
[null,"COMPOSICAO",89877,"CAMINHÃO BASCULANTE 14 M3, COM CAVALO MECÂNICO DE CAPACIDADE MÁXIMA DE TRAÇÃO COMBINADO DE 36000 KG, POTÊNCIA 286 CV, INCLUSIVE SEMIREBOQUE COM CAÇAMBA METÁLICA","CHI DIURNO.",4,89.75,{"$f":"ROUNDDOWN(F7*G7,2)","v":359}]
[null,"COMPOSICAO",5914640,"TRANSPORTE COM CAVALO MECÂNICO COM SEMIRREBOQUE COM CAPACIDADE DE 30 T - RODOVIA PAVIMENTADA","T.KM",8536,0.57999999999999996,{"$f":"ROUNDDOWN(F8*G8,2)","v":4950.88}]
[null,"COMPOSIÇÃO",88316,"SERVENTE COM ENCARGOS COMPLEMENTARES","H",8,19.760000000000002,{"$f":"ROUNDDOWN(F9*G9,2)","v":158.08000000000001}]
[null,"PRODUÇÃO DA EQUIPE",null,null,1,"CUSTO ",null,{"$f":"SUM(H6:H9)","v":6732.48}]
[null,"TOTAL",{"$nulls":5},{"$f":"H10/E10","v":6732.48},"OK"]
[null,"BDI                %",{"$nulls":5},{"$f":"1+$M$1","v":1.2355}]
[null,"TOTAL DO SERVIÇO - R$",{"$nulls":5},{"$f":"ROUND(H11*H12,2)","v":8317.98}]
[]
[2,"CODEVASF",null,null," COMPOSIÇÃO DE PREÇO UNITÁRIO",null,null,null,{"$f":"H30","v":39779.480000000003},{"$f":"H32","v":49147.55}]
[null,"OBRA:  ",{"$f":"$C$2","v":" PAVIMENTAÇÃO ASFÁLTICA EM CBUQ – ITEM 2 – DIVERSOS LOGRADOUROS DA COMUNIDADE MANGUEIRO - NINHEIRA/MG "},null,null,null,"DATA: ",{"$f":"$H$2","v":" SETEMBRO / 2023   "}]
[null,"SERVIÇO:  ",{"$f":"VLOOKUP(A15,ORÇAMENTO!$A$10:$I$32,3)","v":"ADMINISTRAÇÃO LOCAL"},null,"SINAPI",{"$f":"VLOOKUP(A15,ORÇAMENTO!$A$10:$I$32,4)","v":"CPU.2"},"UNIDADE: ",{"$f":"VLOOKUP(A15,ORÇAMENTO!$A$10:$I$32,5)","v":"GL"}]
[]
[null,"TIPO ITEM","CODIGO ITEM","DESCRIÇÃO ITEM","UNIDADE ITEM","COEFICIENTE","PRECO UNITARIO","CUSTO TOTAL"]
[null,"INSUMO",14250,"ENERGIA ELÉTRICA","kwh",40,0.94,{"$f":"ROUNDDOWN(F20*G20,2)","v":37.6}]
[null,"INSUMO",44480,"TARIFA \"A\" - ÁGUA/ESGOTO ","m³",4,17.78,71.12]
[null,"COTAÇÃO","MERC.","TELEFONE (PLANO CONTROLE)","UNID",2,59.9,119.8]
[null,"INSUMO","ED-50155 SEINFRA","BANHEIRO QUÍMICO 110 X 120 X 230 CM COM MANUTENÇÃO (CONSIDERANDO OBRAS SIMULTÂNEAS)","MÊS",1,820,820]
[null,"COMPOSICAO",90777,"Engenheiro Civil Júnior com encargos complementares","H",30,114.12,3423.6]
[null,"COMPOSICAO",90776,"Encarregado Geral com encargos complementares","H",55,57.73,3175.15]
[null,"COMPOSICAO",88321,"Tecnico de Laboratório com encargos complementares","H",20,45.45,909]
[null,"COMPOSICAO",100309,"Tecnico em Segurança do Trabalho com encargos complementares","H",20,45.71,{"$f":"ROUNDDOWN(F27*G27,2)","v":914.2}]
[null,"COMPOSICAO",90772,"Auxiliar de escritório com encargos complementares","H",20,23.72,474.4]
[null,"PRODUÇÃO DA EQUIPE",null,null,{"$f":"1/4","v":0.25},"CUSTO ",null,{"$f":"SUM(H20:H28)","v":9944.8700000000008}]
[null,"TOTAL",{"$nulls":5},{"$f":"ROUND(H29/E29,2)","v":39779.480000000003},"OK"]
[null,"BDI                %",{"$nulls":5},{"$f":"1+$M$1","v":1.2355}]
[null,"TOTAL DO SERVIÇO - R$",{"$nulls":5},{"$f":"ROUND(H30*H31,2)","v":49147.55}]
[]
[{"$f":"A15+1","v":3},"CODEVASF",null,null," COMPOSIÇÃO DE PREÇO UNITÁRIO",null,null,null,{"$f":"H44","v":9444},{"$f":"H46","v":11668.06}]
[null,"OBRA:  ",{"$f":"$C$2","v":" PAVIMENTAÇÃO ASFÁLTICA EM CBUQ – ITEM 2 – DIVERSOS LOGRADOUROS DA COMUNIDADE MANGUEIRO - NINHEIRA/MG "},null,null,null,"DATA: ",{"$f":"$H$2","v":" SETEMBRO / 2023   "}]
[null,"SERVIÇO:  ",{"$f":"VLOOKUP(A34,ORÇAMENTO!$A$10:$I$32,3)","v":"CANTEIRO DE OBRAS"},null,"SINAPI",{"$f":"VLOOKUP(A34,ORÇAMENTO!$A$10:$I$32,4)","v":"CPU.3"},"UNIDADE: ",{"$f":"VLOOKUP(A34,ORÇAMENTO!$A$10:$I$32,5)","v":"GL"}]
[]
[null,"TIPO ITEM","CODIGO ITEM","DESCRIÇÃO ITEM","UNIDADE ITEM","COEFICIENTE","PRECO UNITARIO","CUSTO TOTAL"]
[null,"INSUMO",10775,"ALUGUEL DE IMÓVEL OU CONTEINER QUE ATENDA AOS REQUISITOS MÍNIMOS PARA INSTALAÇÃO DO CANTEIRO DE OBRAS","MÊS",4,975,{"$f":"ROUNDDOWN(F39*G39,2)","v":3900}]
[null,"INSUMO",10779,"LOCACAO DE CONTAINER 2,30 X 4,30 M, ALT. 2,50 M, P/ SANITARIO, C/ 5 BACIAS, 1 LAVATORIO E 4 MICTORIOS","MÊS",4,1218.75,{"$f":"ROUNDDOWN(F40*G40,2)","v":4875}]
{"$rows_left_out":384}
{"sheet":"BDI SERV","index":2,"n_rows":37,"n_cols":5,"rows_kept":37,"cut":false,"hidden":false,"merged":[[31,1,31,2],[32,0,34,5],[36,0,36,5],[0,1,2,4],[3,1,4,1],[3,2,4,2],[28,0,28,5],[30,1,30,2]]}
[null,"DETALHAMENTO DO BDI - SERVIÇOS"]
[]
[]
[null,"Item","Descrição dos Serviços","%","%"]
[null,null,null,"PV","CD"]
[]
[null,1,"ADMINISTRAÇÃO CENTRAL"," ",4.01]
[null,"1.1","ESCRITÓRIO CENTRAL"," "," "]
[null,"1.2","VIAGENS"," "," "]
[null,"1.3","OUTROS"," "," "]
[null," "," "," "," "]
[null,2,"IMPOSTOS E TAXAS",{"$f":"SUM(D13:D16)","v":7.65},{"$f":"SUM(E13:E16)","v":9.57}]
[null,"2.1","ISS (*)",{"$f":"5*0.8","v":4},{"$f":"ROUND(D13*1.2515,2)","v":5.01}]
[null,"2.2","PIS",0.65,{"$f":"ROUND(D14*1.2515,2)","v":0.81}]
[null,"2.3","Cofins",3,{"$f":"ROUND(D15*1.2515,2)","v":3.75}]
[null,"2.4","CONTRIBUIÇÃO PREVIDENCIÁRIA SOBRE A RENDA BRUTA",0,{"$f":"ROUND(D16*1.2515,2)","v":0}]
[]
[null,3,"TAXA DE RISCO"," ",{"$f":"SUM(E19:E22)","v":0.96}]
[null,"3.1","SEGURO",null,0.2]
[null,"3.2","RISCO",null,0.56000000000000005]
[null,"3.3","GARANTIA",null,0.2]
[]
[null,4,"DESPESAS FINANCEIRAS"," ",1.1100000000000001]
[]
[null,5,"LUCRO",null,7.5]
[]
[null," ","BDI - CALCULADO"," ",{"$f":"ROUND((((1+(E7+E18)/100)*(1+E23/100)*(1+E25/100)/(1-D12/100)-1)*100),2)","v":23.55}]
[]
["BDI = ((1+((AC+S+R+G)/100))x(1+DF/100)x(1+L/100)/(1-I/100)-1)*100"]
[]
[null,"BDI (CALCULADO):",null,{"$f":"ROUND((((1+((E7+E18)/100))*(1+E23/100)*(1+E25/100))/(1-D12/100)-1)*100,2)","v":23.55},"%"]
[null," "]
["(*) ISS CONFORME DECLARAÇAO FORNECIDA PELA PREFEITURA DE NINHEIRA\nConsiderando redução de 20% na base de cálculo, relativo ao desconto dos materiais empregaddos na obra"]
[]
[]
[]
["BDI EM CONFORMIDADE COM OS ACÓRDÃOS Nº 2369/2011 e ACÓRDÃO Nº 2.622/2013 - TCU - PLENÁRIO"]

{"sheet":"BDI FORN","index":3,"n_rows":37,"n_cols":5,"rows_kept":37,"cut":false,"hidden":false,"merged":[[31,1,31,2],[32,0,34,5],[36,0,36,5],[0,1,2,4],[3,1,4,1],[3,2,4,2],[28,0,28,5],[30,1,30,2]]}
[null,"DETALHAMENTO DO BDI - FORNECIMENTO \n(MATERIAL ASFÁLTICO)"]
[]
[]
[null,"Item","Descrição dos Serviços","%","%"]
[null,null,null,"PV","CD"]
[]
[null,1,"ADMINISTRAÇÃO CENTRAL"," ",3.72]
[null,"1.1","ESCRITÓRIO CENTRAL"," "," "]
[null,"1.2","VIAGENS"," "," "]
[null,"1.3","OUTROS"," "," "]
[null," "," "," "," "]
[null,2,"IMPOSTOS E TAXAS",{"$f":"SUM(D13:D16)","v":3.65},{"$f":"SUM(E13:E16)","v":4.5600000000000005}]
[null,"2.1","ISS (*)",null,{"$f":"ROUND(D13*1.2515,2)","v":0}]
[null,"2.2","PIS",0.65,{"$f":"ROUND(D14*1.2515,2)","v":0.81}]
[null,"2.3","Cofins",3,{"$f":"ROUND(D15*1.2515,2)","v":3.75}]
[null,"2.4","CONTRIBUIÇÃO PREVIDENCIÁRIA SOBRE A RENDA BRUTA",0,{"$f":"ROUND(D16*1.2515,2)","v":0}]
[]
[null,3,"TAXA DE RISCO"," ",{"$f":"SUM(E19:E22)","v":0.82000000000000006}]
[null,"3.1","SEGURO",null,0.16]
[null,"3.2","RISCO",null,0.5]
[null,"3.3","GARANTIA",null,0.16]
[]
[null,4,"DESPESAS FINANCEIRAS"," ",0.94]
[]
[null,5,"LUCRO",null,5]
[]
[null," ","BDI - CALCULADO"," ",{"$f":"ROUND((((1+(E7+E18)/100)*(1+E23/100)*(1+E25/100)/(1-D12/100)-1)*100),2)","v":15}]
[]
["BDI = ((1+((AC+S+R+G)/100))x(1+DF/100)x(1+L/100)/(1-I/100)-1)*100"]
[]
[null,"BDI (CALCULADO):",null,{"$f":"ROUND((((1+((E7+E18)/100))*(1+E23/100)*(1+E25/100))/(1-D12/100)-1)*100,2)","v":15},"%"]
[null," "]
[]
[]
[]
[]
["BDI EM CONFORMIDADE COM OS ACÓRDÃOS Nº 2369/2011 e ACÓRDÃO Nº 2.622/2013 - TCU - PLENÁRIO"]

{"sheet":"CRONOGRAMA","index":4,"n_rows":21,"n_cols":10,"rows_kept":21,"cut":false,"hidden":false,"merged":[[17,1,18,2],[20,1,24,9],[13,0,14,0],[13,1,14,1],[13,2,14,2],[15,0,16,0],[15,1,16,1],[15,2,16,2],[9,0,10,0],[9,1,10,1],[9,2,10,2],[11,0,12,0],[11,1,12,1],[11,2,12,2],[3,1,3,8],[5,0,6,0],[5,1,6,1],[5,2,6,2],[7,0,8,0],[7,1,8,1],[7,2,8,2],[0,1,0,9],[1,1,2,1],[1,2,2,4],[1,6,1,9],[2,6,2,9]]}
[null,"CRONOGRAMA FÍSICO-FINANCEIRO"]
[null,"OBRA: ",{"$f":"ORÇAMENTO!C5","v":" PAVIMENTAÇÃO ASFÁLTICA EM CBUQ – ITEM 2 – DIVERSOS LOGRADOUROS DA COMUNIDADE MANGUEIRO - NINHEIRA/MG "},null,null,"VALOR:",{"$f":"ORÇAMENTO!I43","v":967731.59}]
[{"$nulls":5},"PRAZO: ","120 DIAS "]
[]
[null,"ITEM","ETAPAS/DESCRIÇAO","FISICO/  FINANCEIRO","TOTAL    ETAPAS","MÊS 1","MÊS 2","MÊS 3","MÊS 4","TOTAL"]
["A",{"$f":"VLOOKUP(A6,ORÇAMENTO!$A$9:$I$43,2)","v":1},{"$f":"VLOOKUP(A6,ORÇAMENTO!$A$9:$I$43,3)","v":"SERVIÇOS PRELIMINARES "},"FISICO ",{"$f":"ROUND(E7/$G$2,4)","v":7.6100000000000001E-2},0.35,0.2,0.2,0.25,{"$f":"SUM(F6:I6)","v":1}]
[null,null,null,"FINANCEIRO",{"$f":"ORÇAMENTO!I9","v":73691.7},{"$f":"ROUND($E$7*F6,2)","v":25792.1},14738.34,14738.34,18422.93,73691.709999999992]
["B",{"$f":"VLOOKUP(A8,ORÇAMENTO!$A$9:$I$43,2)","v":2},{"$f":"VLOOKUP(A8,ORÇAMENTO!$A$9:$I$43,3)","v":"PAVIMENTAÇÃO"},"FISICO ",{"$f":"ROUND(E9/$G$2,4)","v":0.1208},0.3,0.3,0.25,0.15,1]
[null,null,null,"FINANCEIRO",{"$f":"ORÇAMENTO!I15","v":116873.23999999999},{"$f":"ROUND($E$9*F8,2)","v":35061.97},35061.97,29218.31,17530.990000000002,116873.24]
["C",{"$f":"VLOOKUP(A10,ORÇAMENTO!$A$9:$I$43,2)","v":3},{"$f":"VLOOKUP(A10,ORÇAMENTO!$A$9:$I$43,3)","v":"TRANSPORTE DE MATERIAIS"},"FISICO ",{"$f":"ROUND(E11/$G$2,4)","v":3.39E-2},0.3,0.25,0.25,0.2,1]
[null,null,null,"FINANCEIRO",{"$f":"ORÇAMENTO!I24","v":32822.31},{"$f":"ROUND($E$11*F10,2)","v":9846.69},8205.58,8205.58,6564.46,32822.31]
["D",{"$f":"VLOOKUP(A12,ORÇAMENTO!$A$9:$I$43,2)","v":4},{"$f":"VLOOKUP(A12,ORÇAMENTO!$A$9:$I$43,3)","v":"TRANSPORTE DE MATERIAL ASFÁLTICO (BDI DIFERENCIADO)"},"FISICO ",{"$f":"ROUND(E13/$G$2,4)","v":7.0699999999999999E-2},null,0.15,0.55000000000000004,0.3,1]
[null,null,null,"FINANCEIRO",{"$f":"ORÇAMENTO!I27","v":68460},{"$f":"ROUND($E$13*F12,2)","v":0},10269,37653,20538,68460]
["E",{"$f":"VLOOKUP(A14,ORÇAMENTO!$A$9:$I$43,2)","v":5},{"$f":"VLOOKUP(A14,ORÇAMENTO!$A$9:$I$43,3)","v":"OBRAS COMPLEMENTARES"},"FISICO ",{"$f":"ROUND(E15/$G$2,4)","v":0.23350000000000001},null,null,0.15,0.85,1]
[null,null,null,"FINANCEIRO",{"$f":"ORÇAMENTO!I31","v":225927.32},{"$f":"ROUND($E$15*F14,2)","v":0},0,33889.1,192038.22,225927.32]
["F",{"$f":"VLOOKUP(A16,ORÇAMENTO!$A$9:$I$43,2)","v":6},{"$f":"VLOOKUP(A16,ORÇAMENTO!$A$9:$I$43,3)","v":"FORNECIMENTOS - MATERIAL ASFÁLTICO (BDI DIFERENCIADO)"},"FISICO ",{"$f":"ROUND(E17/$G$2,4)","v":0.46500000000000002},null,0.15,0.55000000000000004,0.3,1]
[null,null,null,"FINANCEIRO",{"$f":"ORÇAMENTO!I39","v":449957.01999999996},{"$f":"ROUND($E$17*F16,2)","v":0},67493.55,247476.36,134987.10999999999,449957.01999999996]
[null,"TOTAL",null,"FISICO ",{"$f":"SUM(F18:I18)","v":1.0000000103334437},{"$f":"F19/$E$19","v":7.3058233016863691E-2},0.14029555447290915,0.38355748002398055,0.40308874281969026,1.0000000103334437]
[null,null,null,"FINANCEIRO",{"$f":"E11+E9+E7+E13+E17+E15","v":967731.59000000008},70700.760000000009,135768.44,371180.68999999994,390081.70999999996,{"$f":"SUM(F19:I19)-0.01","v":967731.58999999985}]
[]
[null,"OBSERVAÇÕES:"]