{"text_format":"2","workbook":"xlsx","n_sheets":4,"sheets":["ORÇAMENTO","CPU","BDI SERV","CRONOGRAMA"],"not_rendered":{"charts":0,"images":3,"macros":0,"external_links":0,"defined_names":4,"comments":0,"pivot_tables":0},"unopened":[],"bounds":{"document_bytes":16777216,"sheet_cells":100000,"run_cost":"one","rows_first":2000,"rows_last":500,"rows_between":2000,"halvings":0,"cell_chars":16384,"cell_head_chars":4096},"cells_cut":0,"cells_raw":0,"read":"whole","date_system":"1900"}

{"sheet":"ORÇAMENTO","index":0,"n_rows":29,"n_cols":9,"rows_kept":29,"cut":false,"hidden":false,"merged":[[6,6,6,7],[28,1,28,2],[0,0,7,0],[0,2,0,8],[1,2,1,8],[2,2,2,8],[4,2,4,8],[5,6,5,7]]}
["<---- NUMERAR SERVIÇOS PARA CPU",null,"Ministério do Desenvolvimento Regional"]
[null,null,"Companhia de Desenvolvimento dos Vales do São Francisco e do Parnaíba"]
[null,null,"1ª Superintendência Regional"]
[]
[null,"OBRA: ","PAVIMENTAÇÃO EM BLOQUETE SEXTAVADOS - RUAS DIVERAS - ARAÇUAÍ/MG"]
[null,"DATA:","SETEMBRO/2023",null,null,null,"BDI Serviços:",null,{"$f":"'BDI SERV'!D30/100","v":0.20469999999999999}]
[null,"PRAZO DE EXECUÇÃO:    300 DIAS"]
[null,"ITEM","DISCRIMINAÇÃO","REFER.","UNID.","QUANT.","P. UNITÁRIO","P.UNIT.C/ BDI","P. TOTAL"]
["A",1,"SERVIÇOS PRELIMINARES ",{"$nulls":5},{"$f":"SUM(I10:I14)","v":135440.22999999998}]
[1,"1.1","MOBILIZAÇÃO E DESMOBILIZAÇÃO","CPU.1","GL",1,{"$f":"VLOOKUP(A10,CPU!$A$1:$N$4508,9)","v":6071.4},{"$f":"VLOOKUP(A10,CPU!$A$1:$N$4508,10)","v":7314.2155799999991},{"$f":"ROUND(F10*H10,2)","v":7314.22}]
[2,"1.2","ADMINISTRAÇÃO LOCAL","CPU.2","GL",1,{"$f":"VLOOKUP(A11,CPU!$A$1:$N$4508,9)","v":92700.2},{"$f":"VLOOKUP(A11,CPU!$A$1:$N$4508,10)","v":111675.93093999999},{"$f":"ROUND(F11*H11,2)","v":111675.93}]
[3,"1.3","CANTEIRO DE OBRAS","CPU.3","GL",1,{"$f":"VLOOKUP(A12,CPU!$A$1:$N$4508,9)","v":9750},{"$f":"VLOOKUP(A12,CPU!$A$1:$N$4508,10)","v":11745.824999999999},{"$f":"ROUND(F12*H12,2)","v":11745.83}]
[4,"1.4","PLACA DE OBRA EM CHAPA DE AÇO GALVANIZADO",103689,"M2",4.5,{"$f":"VLOOKUP(A13,CPU!$A$1:$N$4508,9)","v":307.76},{"$f":"VLOOKUP(A13,CPU!$A$1:$N$4508,10)","v":370.75847199999993},{"$f":"ROUND(F13*H13,2)","v":1668.41}]
[5,"1.5","LOCAÇÃO DE PAVIMENTAÇÃO",99064,"M",3600,{"$f":"VLOOKUP(A14,CPU!$A$1:$N$4508,9)","v":0.7},{"$f":"VLOOKUP(A14,CPU!$A$1:$N$4508,10)","v":0.84328999999999987},{"$f":"ROUND(F14*H14,2)","v":3035.84}]
["B",2,"PAVIMENTAÇÃO",{"$nulls":5},{"$f":"SUM(I16:I19)","v":2060415.27}]
[6,"2.1","ESCAVAÇÃO HORIZONTAL EM SOLO DE 1A CATEGORIA COM TRATOR DE ESTEIRAS",101116,"M3",4000,{"$f":"VLOOKUP(A16,CPU!$A$1:$N$4508,9)","v":2.2000000000000002},{"$f":"VLOOKUP(A16,CPU!$A$1:$N$4508,10)","v":2.6503399999999999},{"$f":"ROUND(F16*H16,2)","v":10601.36}]
[7,"2.2","CARGA, MANOBRA E DESCARGA DE SOLOS E MATERIAIS GRANULARES EM CAMINHÃO BASCULANTE - CARGA COM PÁ CARREGADEIRA E DESCARGA LIVRE",100976,"M3",4000,{"$f":"VLOOKUP(A17,CPU!$A$1:$N$4508,9)","v":8.7100000000000009},{"$f":"VLOOKUP(A17,CPU!$A$1:$N$4508,10)","v":10.492937},{"$f":"ROUND(F17*H17,2)","v":41971.75}]
[8,"2.3","REGULARIZAÇÃO E COMPACTAÇÃO DE SUBLEITO",100576,"M2",26000,{"$f":"VLOOKUP(A18,CPU!$A$1:$N$4508,9)","v":2.57},{"$f":"VLOOKUP(A18,CPU!$A$1:$N$4508,10)","v":3.0960789999999996},{"$f":"ROUND(F18*H18,2)","v":80498.05}]
[9,"2.6","EXECUÇÃO DE PAVIMENTO EM PISO INTERTRAVADO, COM BLOCO SEXTAVADO DE 25 X 25 CM, ESPESSURA 8 CM","92394a","M2",22600,{"$f":"VLOOKUP(A19,CPU!$A$1:$N$4508,9)","v":70.789999999999992},{"$f":"VLOOKUP(A19,CPU!$A$1:$N$4508,10)","v":85.280712999999977},{"$f":"ROUND(F19*H19,2)","v":1927344.11}]
["C",3,"TRANSPORTE DE MATERIAIS",{"$nulls":5},{"$f":"SUM(I21:I23)","v":63752.729999999996}]
[9.5,"3.1","TRANSPORTE COM CAMINHÃO BASCULANTE, EM VIA URBANA EM REVESTIMENTO PRIMÁRIO",95426,"M3XKM",12000,{"$f":"VLOOKUP(A21,CPU!$A$1:$N$4508,9)","v":1.41},{"$f":"VLOOKUP(A21,CPU!$A$1:$N$4508,10)","v":1.6986269999999997},{"$f":"ROUND(F21*H21,2)","v":20383.52}]
[10,"3.2","TRANSPORTE COM CAMINHÃO BASCULANTE, EM VIA URBANA PAVIMENTADA",95427,"M3XKM",24000.002,{"$f":"VLOOKUP(A22,CPU!$A$1:$N$4508,9)","v":0.73},{"$f":"VLOOKUP(A22,CPU!$A$1:$N$4508,10)","v":0.87943099999999985},{"$f":"ROUND(F22*H22,2)","v":21106.35}]
[11,"3.3","TRANSPORTE COM CAMINHÃO CARROCERIA, EM VIA URBANA PAVIMENTADA",100948,"TXKM",22000.004124799998,{"$f":"VLOOKUP(A23,CPU!$A$1:$N$4508,9)","v":0.84},{"$f":"VLOOKUP(A23,CPU!$A$1:$N$4508,10)","v":1.0119479999999998},{"$f":"ROUND(F23*H23,2)","v":22262.86}]
["D",4,"DRENAGEM E OBRAS COMPLEMENTARES",{"$nulls":5},{"$f":"SUM(I25:I28)","v":737959.13}]
[12,"4.1","ASSENTAMENTO DE GUIA (MEIO-FIO) EM TRECHO RETO, CONFECCIONADA EM CONCRETO PRÉ-FABRICADO, DIMENSÕES 100X15X13X30 CM (COMPRIMENTO X BASE INFERIOR X BASE SUPERIOR X ALTURA)","94273a","M",7400,{"$f":"VLOOKUP(A25,CPU!$A$1:$N$4508,9)","v":45.31},{"$f":"VLOOKUP(A25,CPU!$A$1:$N$4508,10)","v":54.584956999999996},{"$f":"ROUND(F25*H25,2)","v":403928.68}]
[13,"4.2","EXECUÇÃO DE SARJETA DE CONCRETO USINADO, MOLDADA  IN LOCO  EM TRECHO RETO, 30 CM BASE X 5 CM ALTURA","94273a","M",7150,{"$f":"VLOOKUP(A26,CPU!$A$1:$N$4508,9)","v":34.31},{"$f":"VLOOKUP(A26,CPU!$A$1:$N$4508,10)","v":41.333256999999996},{"$f":"ROUND(F26*H26,2)","v":295532.78999999998}]
[14,"4.3","FORNECIMENTO E INSTALAÇÃO DE PLACA DE SINALIZAÇÃO VIÁRIA - REGULAMENTAÇÃO (PARE)","CPU.4","UNID.",46,{"$f":"VLOOKUP(A27,CPU!$A$1:$N$4508,9)","v":482.58000000000004},{"$f":"VLOOKUP(A27,CPU!$A$1:$N$4508,10)","v":581.36412599999994},{"$f":"ROUND(F27*H27,2)","v":26742.75}]
[15,"4.4","FORNECIMENTO E INSTALAÇÃO DE PLACA DE AÇO PARA IDENTIFICACAO DE RUA, *45 CM X 20* CM, INCLUSIVE SUPORTE EM TUBO DE AÇO GALVANIZADO (02 PLACAS POR SUPORTE)                                  ","CPU.5","UNID.",26,{"$f":"VLOOKUP(A28,CPU!$A$1:$N$4508,9)","v":375.29},{"$f":"VLOOKUP(A28,CPU!$A$1:$N$4508,10)","v":452.11186299999997},{"$f":"ROUND(F28*H28,2)","v":11754.91}]
[null,"TOTAL GERAL DA OBRA COM BDI ",{"$nulls":6},{"$f":"SUM(I9,I15,I20,I24)","v":2997567.36}]

{"sheet":"CPU","index":1,"n_rows":243,"n_cols":13,"rows_kept":243,"cut":false,"hidden":false,"merged":[[121,13,121,15],[158,1,158,6],[159,1,159,6],[43,10,43,11],[44,2,44,5],[45,2,45,3],[46,1,46,7],[56,1,56,3],[64,1,64,7],[67,1,67,3],[116,10,116,11],[117,2,117,5],[118,2,118,3],[119,1,119,7],[130,1,130,3],[130,5,130,6],[131,1,131,6],[99,10,99,11],[100,2,100,5],[101,2,101,3],[102,1,102,7],[43,1,43,3],[43,4,43,7],[80,5,80,6],[57,1,57,6],[58,1,58,6],[59,1,59,6],[61,1,61,3],[61,4,61,7],[61,10,61,11],[62,2,62,5],[156,5,156,6],[72,10,72,11],[80,1,80,3],[111,1,111,3],[85,1,85,3],[85,4,85,7],[86,2,86,5],[87,2,87,3],[88,1,88,7],[94,1,94,3],[94,5,94,6],[95,1,95,6],[96,1,96,6],[113,1,113,6],[114,1,114,6],[99,1,99,3],[67,5,67,6],[68,1,68,6],[69,1,69,6],[70,1,70,6],[72,1,72,3],[72,4,72,7],[63,2,63,3],[97,1,97,6],[151,1,151,7],[150,2,150,3],[83,1,83,6],[73,2,73,5],[111,5,111,6],[112,1,112,6],[132,1,132,6],[133,1,133,6],[148,1,148,3],[148,4,148,7],[116,1,116,3],[116,4,116,7],[74,2,74,3],[75,1,75,7],[81,1,81,6],[56,5,56,6],[32,10,32,11],[33,2,33,5],[34,2,34,3],[35,1,35,7],[38,1,38,3],[28,1,28,6],[29,1,29,6],[30,1,30,6],[32,1,32,3],[32,4,32,7],[38,5,38,6],[39,1,39,6],[10,1,10,6],[11,1,11,6],[12,1,12,6],[14,4,14,7],[14,10,14,11],[15,2,15,5],[16,2,16,3],[17,1,17,7],[27,1,27,3],[27,5,27,6],[99,0,114,0],[82,1,82,6],[148,10,148,11],[149,2,149,5],[0,0,13,0],[14,0,31,0],[32,0,42,0],[43,0,60,0],[61,0,71,0],[116,0,134,0],[0,1,0,3],[0,4,0,7],[148,0,160,0],[40,1,40,6],[41,1,41,6],[72,0,83,0],[14,1,14,3],[85,0,97,0],[0,10,0,11],[1,2,1,5],[2,2,2,3],[3,1,3,7],[9,1,9,3],[9,5,9,6],[99,4,99,7],[161,10,161,11],[162,2,162,5],[163,2,163,3],[164,1,164,7],[169,1,169,3],[169,5,169,6],[170,1,170,6],[171,1,171,6],[157,1,157,6],[156,1,156,3],[172,1,172,6],[161,1,161,3],[225,0,243,0],[225,1,225,3],[225,4,225,7],[226,2,226,5],[227,2,227,3],[228,1,228,7],[239,1,239,3],[239,5,239,6],[240,1,240,6],[241,1,241,6],[242,1,242,6],[207,0,224,0],[207,1,207,3],[207,4,207,7],[208,2,208,5],[209,2,209,3],[210,1,210,7],[220,1,220,3],[220,5,220,6],[221,1,221,6],[222,1,222,6],[223,1,223,6],[161,0,173,0],[190,0,206,0],[190,1,190,3],[190,4,190,7],[191,2,191,5],[192,2,192,3],[193,1,193,7],[202,1,202,3],[202,5,202,6],[203,1,203,6],[161,4,161,7],[174,0,189,0],[174,1,174,3],[174,4,174,7],[175,2,175,5],[176,2,176,3],[177,1,177,7],[185,1,185,3],[185,5,185,6],[186,1,186,6],[187,1,187,6],[188,1,188,6],[204,1,204,6],[205,1,205,6],[135,0,147,0],[135,1,135,3],[135,4,135,7],[136,2,136,5],[137,2,137,3],[138,1,138,7],[143,1,143,3],[143,5,143,6],[144,1,144,6],[145,1,145,6],[146,1,146,6]]}
[1,"CODEVASF",null,null," COMPOSIÇÃO DE PREÇO UNITÁRIO",null,null,null,{"$f":"H11","v":6071.4},{"$f":"H13","v":7314.2155799999991},"BDI CALCULADO:",null,{"$f":"ORÇAMENTO!I6","v":0.20469999999999999}]
[null,"OBRA:  ",{"$f":"ORÇAMENTO!C5","v":"PAVIMENTAÇÃO EM BLOQUETE SEXTAVADOS - RUAS DIVERAS - ARAÇUAÍ/MG"},null,null,null,"DATA: ",{"$f":"ORÇAMENTO!C6","v":"SETEMBRO/2023"}]
[null,"SERVIÇO:  ",{"$f":"VLOOKUP(A1,ORÇAMENTO!A10:I26,3)","v":"MOBILIZAÇÃO E DESMOBILIZAÇÃO"},null,"Referência:",{"$f":"VLOOKUP(A1,ORÇAMENTO!A10:I26,4)","v":"CPU.1"},"UNIDADE: ",{"$f":"VLOOKUP(A1,ORÇAMENTO!A10:I26,5)","v":"GL"}]
[]
[null,"TIPO ITEM","CODIGO ITEM","DESCRIÇÃO ITEM","UNIDADE ITEM","COEFICIENTE","PRECO UNITARIO","CUSTO TOTAL"]
[null,"COMPOSICAO","5824","CAMINHÃO TOCO, PBT 16.000 KG, CARGA ÚTIL MÁX. 10.685 KG, DIST. ENTRE EIXOS 4,8 M, POTÊNCIA 189 CV, INCLUSIVE CARROCERIA FIXA ABERTA DE MADEIRA P/ TRANSPORTE GERAL DE CARGA SECA ","CHP",12,"202,74",{"$f":"ROUNDDOWN(F6*G6,2)","v":2432.88}]
[null,"COMPOSICAO","5826","CAMINHÃO TOCO, PBT 16.000 KG, CARGA ÚTIL MÁX. 10.685 KG, DIST. ENTRE EIXOS 4,8 M, POTÊNCIA 189 CV, INCLUSIVE CARROCERIA FIXA ABERTA DE MADEIRA P/ TRANSPORTE GERAL DE CARGA SECA ","CHI",6,"60,95",{"$f":"ROUNDDOWN(F7*G7,2)","v":365.7}]
[null,"COMPOSIÇÃO",88316,"SERVENTE COM ENCARGOS COMPLEMENTARES","H",12,"19,76",{"$f":"ROUNDDOWN(F8*G8,2)","v":237.12}]
[{"$nulls":7},{"$f":"ROUNDDOWN(F9*G9,2)","v":0}]
[null,"PRODUÇÃO DA EQUIPE",null,null,0.5,"CUSTO ",null,{"$f":"SUM(H6:H9)","v":3035.7}]
[null,"TOTAL",{"$nulls":5},{"$f":"H10/E10","v":6071.4},"OK"]
[null,"BDI                %",{"$nulls":5},{"$f":"1+$M$1","v":1.2046999999999999}]
[null,"TOTAL DO SERVIÇO - R$",{"$nulls":5},{"$f":"H11*H12","v":7314.2155799999991}]
[]
[{"$f":"A1+1","v":2},"CODEVASF",null,null," COMPOSIÇÃO DE PREÇO UNITÁRIO",null,null,null,{"$f":"H29","v":92700.2},{"$f":"H31","v":111675.93093999999}]
[null,"OBRA:  ",{"$f":"$C$2","v":"PAVIMENTAÇÃO EM BLOQUETE SEXTAVADOS - RUAS DIVERAS - ARAÇUAÍ/MG"},null,null,null,"DATA: ",{"$f":"$H$2","v":"SETEMBRO/2023"}]
[null,"SERVIÇO:  ",{"$f":"VLOOKUP(A15,ORÇAMENTO!$A$10:$I$26,3)","v":"ADMINISTRAÇÃO LOCAL"},null,"SINAPI","CPU","UNIDADE: ",{"$f":"VLOOKUP(A15,ORÇAMENTO!$A$10:$I$26,5)","v":"GL"}]
[]
[null,"TIPO ITEM","CODIGO ITEM","DESCRIÇÃO ITEM","UNIDADE ITEM","COEFICIENTE","PRECO UNITARIO","CUSTO TOTAL"]
[null,"INSUMO",14250,"ENERGIA ELÉTRICA","kwh",60,"0,94",{"$f":"ROUNDDOWN(F20*G20,2)","v":56.4}]
[null,"INSUMO",44480,"TARIFA \"A\" ENTRE 0 E 20 M³ - FORNECIMENTO D'ÁGUA","m³",4,"17,78",{"$f":"ROUNDDOWN(F21*G21,2)","v":71.12}]
[null,"COTAÇÃO","MERC.","TELEFONE (PLANO CONTROLE)","UNID",3,60,180]
[null,"COMPOSICAO",90777,"ENGENHEIRO CIVIL DE OBRA COM ENCARGOS COMPLEMENTARES","H",30,"114,12",3423.6]
[null,"COMPOSICAO",90776,"ENCARREGADO GERAL COM ENCARGOS COMPLEMENTARES","H",60,"57,73",{"$f":"ROUNDDOWN(F24*G24,2)","v":3463.8}]
[null,"COMPOSICAO",88321,"TÉCNICO DE LABORATÓRIO COM ENCARGOS COMPLEMENTARES","H",30,"45,45",{"$f":"ROUNDDOWN(F25*G25,2)","v":1363.5}]
[null,"COMPOSICAO",90772,"Auxiliar de escritório com encargos complementares","H",30,23.72,{"$f":"ROUNDDOWN(F26*G26,2)","v":711.6}]
[{"$nulls":7},0]
[null,"PRODUÇÃO DA EQUIPE",null,null,{"$f":"1/10","v":0.1},"CUSTO ",null,{"$f":"SUM(H20:H27)","v":9270.02}]
[null,"TOTAL",{"$nulls":5},{"$f":"H28/E28","v":92700.2},"OK"]
[null,"BDI                %",{"$nulls":5},{"$f":"1+$M$1","v":1.2046999999999999}]
[null,"TOTAL DO SERVIÇO - R$",{"$nulls":5},{"$f":"H29*H30","v":111675.93093999999}]
[]
[{"$f":"A15+1","v":3},"CODEVASF",null,null," COMPOSIÇÃO DE PREÇO UNITÁRIO",null,null,null,{"$f":"H40","v":9750},{"$f":"H42","v":11745.824999999999}]
[null,"OBRA:  ",{"$f":"$C$2","v":"PAVIMENTAÇÃO EM BLOQUETE SEXTAVADOS - RUAS DIVERAS - ARAÇUAÍ/MG"},null,null,null,"DATA: ",{"$f":"$H$2","v":"SETEMBRO/2023"}]
[null,"SERVIÇO:  ",{"$f":"VLOOKUP(A33,ORÇAMENTO!$A$10:$I$26,3)","v":"CANTEIRO DE OBRAS"},null,"SINAPI",{"$f":"VLOOKUP(A33,ORÇAMENTO!$A$10:$I$26,4)","v":"CPU.3"},"UNIDADE: ",{"$f":"VLOOKUP(A33,ORÇAMENTO!$A$10:$I$26,5)","v":"GL"}]
[]
[null,"TIPO ITEM","CODIGO ITEM","DESCRIÇÃO ITEM","UNIDADE ITEM","COEFICIENTE","PRECO UNITARIO","CUSTO TOTAL"]
[null,"COTAÇÃO",10775,"ALUGUEL DE IMÓVEL OU CONTEINER QUE ATENDA AOS REQUISITOS MÍNIMOS PARA INSTALAÇÃO DO CANTEIRO DE OBRAS ","MÊS",10,975,{"$f":"ROUNDDOWN(F38*G38,2)","v":9750}]
[null,"PRODUÇÃO DA EQUIPE",null,null,1,"CUSTO ",null,{"$f":"SUM(H38:H38)","v":9750}]
[null,"TOTAL",{"$nulls":5},{"$f":"H39/E39","v":9750},"OK"]
[null,"BDI                %",{"$nulls":5},{"$f":"1+$M$1","v":1.2046999999999999}]
[null,"TOTAL DO SERVIÇO - R$",{"$nulls":5},{"$f":"H40*H41","v":11745.824999999999}]
[]
[{"$f":"A33+1","v":4},"CODEVASF",null,null," COMPOSIÇÃO DE PREÇO UNITÁRIO",null,null,null,{"$f":"H58","v":307.76},{"$f":"H60","v":370.75847199999993}]
[null,"OBRA:  ",{"$f":"$C$2","v":"PAVIMENTAÇÃO EM BLOQUETE SEXTAVADOS - RUAS DIVERAS - ARAÇUAÍ/MG"},null,null,null,"DATA: ",{"$f":"$H$2","v":"SETEMBRO/2023"}]
[null,"SERVIÇO:  ",{"$f":"VLOOKUP(A44,ORÇAMENTO!$A$10:$I$26,3)","v":"PLACA DE OBRA EM CHAPA DE AÇO GALVANIZADO"},null,"SINAPI",{"$f":"VLOOKUP(A44,ORÇAMENTO!$A$10:$I$26,4)","v":103689},"UNIDADE: ",{"$f":"VLOOKUP(A44,ORÇAMENTO!$A$10:$I$26,5)","v":"M2"}]
[]
[null,"TIPO ITEM","CODIGO ITEM","DESCRIÇÃO ITEM","UNIDADE ITEM","COEFICIENTE","PRECO UNITARIO","CUSTO TOTAL"]
[null,"INSUMO","4509","SARRAFO *2,5 X 10* CM EM PINUS, MISTA OU EQUIVALENTE DA REGIAO - BRUTA","M","3,2083000",4.41,{"$f":"ROUNDDOWN(F49*G49,2)","v":14.14}]
[null,"INSUMO","4813","PLACA DE OBRA (PARA CONSTRUCAO CIVIL) EM CHAPA GALVANIZADA *N. 22*, ADESIVADA, DE *2,4 X 1,2* M (SEM POSTES PARA FIXACAO)","M2","1,0000000","250,00",{"$f":"ROUNDDOWN(F50*G50,2)","v":250}]
[null,"INSUMO","5065","PREGO DE ACO POLIDO COM CABECA 10 X 10 (7/8 X 17)","KG","0,0113000",36.57,0.41]
[null,"INSUMO","5069","PREGO DE ACO POLIDO COM CABECA 17 X 27 (2 1/2 X 11)","KG","0,0132000",19.59,0.25]
[null,"COMPOSICAO","88262","CARPINTEIRO DE FORMAS COM ENCARGOS COMPLEMENTARES","H","0,3729000","27,05",10.08]
[null,"COMPOSICAO","88316","SERVENTE COM ENCARGOS COMPLEMENTARES","H","1,1186000","19,76",22.1]
[null,"COMPOSICAO","102234","PINTURA IMUNIZANTE PARA MADEIRA, 2 DEMÃOS","M2","0,5000000",21.57,{"$f":"ROUNDDOWN(F55*G55,2)","v":10.78}]
[{"$nulls":7},0]
[null,"PRODUÇÃO DA EQUIPE",null,null,1,"CUSTO ",null,{"$f":"SUM(H49:H56)","v":307.76}]
[null,"TOTAL",{"$nulls":5},{"$f":"H57/E57","v":307.76},"OK"]
[null,"BDI                %",{"$nulls":5},{"$f":"1+$M$1","v":1.2046999999999999}]
[null,"TOTAL DO SERVIÇO - R$",{"$nulls":5},{"$f":"H58*H59","v":370.75847199999993}]
[]
[{"$f":"A44+1","v":5},"CODEVASF",null,null," COMPOSIÇÃO DE PREÇO UNITÁRIO",null,null,null,{"$f":"H69","v":0.7},{"$f":"H71","v":0.84328999999999987}]
[null,"OBRA:  ",{"$f":"$C$2","v":"PAVIMENTAÇÃO EM BLOQUETE SEXTAVADOS - RUAS DIVERAS - ARAÇUAÍ/MG"},null,null,null,"DATA: ",{"$f":"$H$2","v":"SETEMBRO/2023"}]
[null,"SERVIÇO:  ",{"$f":"VLOOKUP(A62,ORÇAMENTO!$A$10:$I$26,3)","v":"LOCAÇÃO DE PAVIMENTAÇÃO"},null,"SINAPI",{"$f":"VLOOKUP(A62,ORÇAMENTO!$A$10:$I$26,4)","v":99064},"UNIDADE: ",{"$f":"VLOOKUP(A62,ORÇAMENTO!$A$10:$I$26,5)","v":"M"}]
[]
[null,"TIPO ITEM","CODIGO ITEM","DESCRIÇÃO ITEM","UNIDADE ITEM","COEFICIENTE","PRECO UNITARIO","CUSTO TOTAL"]
[null,"COMPOSICAO","99058","LOCAÇÃO DE PONTO PARA REFERÊNCIA TOPOGRÁFICA","UN","0,0500000",14.14,{"$f":"ROUNDDOWN(F67*G67,2)","v":0.7}]
[null,"PRODUÇÃO DA EQUIPE",null,null,1,"CUSTO ",null,{"$f":"SUM(H67:H67)","v":0.7}]
[null,"TOTAL",{"$nulls":5},{"$f":"H68/E68","v":0.7},"OK"]
[null,"BDI                %",{"$nulls":5},{"$f":"1+$M$1","v":1.2046999999999999}]
[null,"TOTAL DO SERVIÇO - R$",{"$nulls":5},{"$f":"H69*H70","v":0.84328999999999987}]
[]
[{"$f":"A62+1","v":6},"CODEVASF",null,null," COMPOSIÇÃO DE PREÇO UNITÁRIO",null,null,null,{"$f":"H82","v":2.2000000000000002},{"$f":"H84","v":2.6503399999999999}]
[null,"OBRA:  ",{"$f":"$C$2","v":"PAVIMENTAÇÃO EM BLOQUETE SEXTAVADOS - RUAS DIVERAS - ARAÇUAÍ/MG"},null,null,null,"DATA: ",{"$f":"$H$2","v":"SETEMBRO/2023"}]
[null,"SERVIÇO:  ",{"$f":"VLOOKUP(A73,ORÇAMENTO!$A$10:$I$26,3)","v":"ESCAVAÇÃO HORIZONTAL EM SOLO DE 1A CATEGORIA COM TRATOR DE ESTEIRAS"},null,"SINAPI",{"$f":"VLOOKUP(A73,ORÇAMENTO!$A$10:$I$26,4)","v":101116},"UNIDADE: ",{"$f":"VLOOKUP(A73,ORÇAMENTO!$A$10:$I$26,5)","v":"M3"}]
[]
[null,"TIPO ITEM","CODIGO ITEM","DESCRIÇÃO ITEM","UNIDADE ITEM","COEFICIENTE","PRECO UNITARIO","CUSTO TOTAL"]
[null,"COMPOSICAO","5847","TRATOR DE ESTEIRAS, POTÊNCIA 170 HP, PESO OPERACIONAL 19 T, CAÇAMBA 5,2 M3 - CHP DIURNO. AF_06/2014","CHP","0,0048000","253,93",{"$f":"ROUNDDOWN(F78*G78,2)","v":1.21}]
[null,"COMPOSICAO","5849","TRATOR DE ESTEIRAS, POTÊNCIA 170 HP, PESO OPERACIONAL 19 T, CAÇAMBA 5,2 M3 - CHI DIURNO. AF_06/2014","CHI","0,0082000","90,40",{"$f":"ROUNDDOWN(F79*G79,2)","v":0.74}]
[null,"COMPOSICAO","88316","SERVENTE COM ENCARGOS COMPLEMENTARES","H","0,0131000","19,76",{"$f":"ROUNDDOWN(F80*G80,2)","v":0.25}]
{"$rows_left_out":164}
{"sheet":"BDI SERV","index":2,"n_rows":36,"n_cols":5,"rows_kept":36,"cut":false,"hidden":false,"merged":[[7,7,17,12],[35,0,35,5],[3,1,4,1],[3,2,4,2],[0,1,2,4],[31,0,33,5],[27,0,27,5],[29,1,29,2],[30,1,30,2]]}
[null,"DETALHAMENTO DO BDI - SERVIÇOS"]
[]
[]
[null,"Item","Descrição dos Serviços","%","%"]
[null,null,null,"PV","CD"]
[]
[null,1,"ADMINISTRAÇÃO CENTRAL"," ",4.01]
[null,"1.1","ESCRITÓRIO CENTRAL"," "," "]
[null,"1.2","VIAGENS"," "," "]
[null,"1.3","OUTROS"," "," "]
[null," "," "," "," "]
[null,2,"IMPOSTOS E TAXAS",{"$f":"SUM(D13:D15)","v":4.8499999999999996},{"$f":"SUM(E13:E15)","v":6.0600000000000005}]
[null,"2.1","ISS (*)",{"$f":"3*0.4","v":1.2000000000000002},{"$f":"ROUND(D13*1.2515,2)","v":1.5}]
[null,"2.2","PIS",0.65,{"$f":"ROUND(D14*1.2515,2)","v":0.81}]
[null,"2.3","Cofins",3,{"$f":"ROUND(D15*1.2515,2)","v":3.75}]
[]
[null,3,"TAXA DE RISCO"," ",{"$f":"SUM(E18:E21)","v":0.96}]
[null,"3.1","SEGURO",null,0.2]
[null,"3.2","RISCO",null,0.56000000000000005]
[null,"3.3","GARANTIA",null,0.2]
[]
[null,4,"DESPESAS FINANCEIRAS"," ",1.1100000000000001]
[]
[null,5,"LUCRO",null,8]
[]
[null," ","BDI - CALCULADO"," ",{"$f":"ROUND((((1+(E7+E17)/100)*(1+E22/100)*(1+E24/100)/(1-D12/100)-1)*100),2)","v":20.47}]
[]
["BDI = ((1+((AC+S+R+G)/100))x(1+DF/100)x(1+L/100)/(1-I/100)-1)*100"]
[]
[null,"BDI (CALCULADO):",null,{"$f":"ROUND((((1+((E7+E17)/100))*(1+E22/100)*(1+E24/100))/(1-D12/100)-1)*100,2)","v":20.47},"%"]
[null," "]
["(*) ISS CONFORME LEI COMPLEMENTAR N. º 006/2000 - QUANT. ESTIMADA DE MATERIAIS = 60%"]
[]
[]
[" "]
["BDI EM CONFORMIDADE COM OS ACÓRDÃOS Nº 2369/2011 e ACÓRDÃO Nº 2.622/2013 - TCU - PLENÁRIO"]

{"sheet":"CRONOGRAMA","index":3,"n_rows":26,"n_cols":17,"rows_kept":26,"cut":false,"hidden":false,"merged":[[7,0,8,0],[9,0,10,0],[11,0,12,0],[0,1,0,15],[1,6,1,15],[2,6,2,15],[3,1,3,6],[5,0,6,0],[5,2,6,2],[1,1,2,1],[5,1,6,1],[1,2,2,4],[13,1,14,2],[16,1,20,15],[7,2,8,2],[9,2,10,2],[11,2,12,2],[7,1,8,1],[9,1,10,1],[11,1,12,1]]}
[null,"CRONOGRAMA FÍSICO-FINANCEIRO"]
[null,"OBRA: ",{"$f":"ORÇAMENTO!C5","v":"PAVIMENTAÇÃO EM BLOQUETE SEXTAVADOS - RUAS DIVERAS - ARAÇUAÍ/MG"},null,null,"VALOR:",{"$f":"ORÇAMENTO!I29","v":2997567.36}]
[{"$nulls":5},"PRAZO: ","300 DIAS "]
[]
[null,"ITEM","ETAPAS/DESCRIÇAO","FISICO/  FINANCEIRO","TOTAL    ETAPAS","MÊS 1","MÊS 2","MÊS 3","MÊS 4","MÊS 5","MÊS 6","MÊS 7","MÊS 8","MÊS 9","MÊS 10","TOTAL"]
["A",{"$f":"VLOOKUP(A6,ORÇAMENTO!$A$9:$I$29,2)","v":1},{"$f":"VLOOKUP(A6,ORÇAMENTO!$A$9:$I$29,3)","v":"SERVIÇOS PRELIMINARES "},"FISICO ",{"$f":"ROUND(E7/$G$2,4)","v":4.5199999999999997E-2},0.05,7.4999999999999997E-2,0.1,0.15,0.15,0.15,0.125,0.1,7.4999999999999997E-2,2.5000000000000001E-2,{"$f":"SUM(F6:O6)","v":1}]
[null,null,null,"FINANCEIRO",{"$f":"ORÇAMENTO!I9","v":135440.22999999998},{"$f":"ROUND($E$7*F6,2)","v":6772.01},10158.02,13544.02,20316.03,20316.03,20316.03,16930.03,13544.02,10158.02,3386.01,135440.22]
["B",{"$f":"VLOOKUP(A8,ORÇAMENTO!$A$9:$I$29,2)","v":2},{"$f":"VLOOKUP(A8,ORÇAMENTO!$A$9:$I$29,3)","v":"PAVIMENTAÇÃO"},"FISICO ",{"$f":"ROUND(E9/$G$2,4)","v":0.68740000000000001},0.05,7.4999999999999997E-2,0.1,0.15,0.15,0.15,0.125,0.1,7.4999999999999997E-2,2.5000000000000001E-2,1]
[null,null,null,"FINANCEIRO",{"$f":"ORÇAMENTO!I15","v":2060415.27},{"$f":"ROUND($E$9*F8,2)","v":103020.76},{"$f":"ROUND($E$9*G8,2)","v":154531.15},{"$f":"ROUND($E$9*H8,2)","v":206041.53},309062.28999999998,309062.28999999998,309062.28999999998,257551.91,206041.53,{"$f":"ROUND($E$9*N8,2)","v":154531.15},51510.38,2060415.2799999998]
["C",{"$f":"VLOOKUP(A10,ORÇAMENTO!$A$9:$I$29,2)","v":3},{"$f":"VLOOKUP(A10,ORÇAMENTO!$A$9:$I$29,3)","v":"TRANSPORTE DE MATERIAIS"},"FISICO ",{"$f":"ROUND(E11/$G$2,4)","v":2.1299999999999999E-2},0.05,7.4999999999999997E-2,0.1,0.15,0.15,0.15,0.125,0.1,7.4999999999999997E-2,2.5000000000000001E-2,1]
[null,null,null,"FINANCEIRO",{"$f":"ORÇAMENTO!I20","v":63752.729999999996},{"$f":"ROUND($E$11*F10,2)","v":3187.64},{"$f":"ROUND($E$11*G10,2)","v":4781.45},{"$f":"ROUND($E$11*H10,2)","v":6375.27},9562.91,9562.91,9562.91,7969.09,{"$f":"ROUND($E$11*M10,2)","v":6375.27},{"$f":"ROUND($E$11*N10,2)","v":4781.45},1593.82,63752.719999999994]
["D",{"$f":"VLOOKUP(A12,ORÇAMENTO!$A$9:$I$29,2)","v":4},{"$f":"VLOOKUP(A12,ORÇAMENTO!$A$9:$I$29,3)","v":"DRENAGEM E OBRAS COMPLEMENTARES"},"FISICO ",0.05,null,0.05,0.1,0.1,0.125,0.17499999999999999,0.1,0.1,0.1,0.15,1]
[null,null,null,"FINANCEIRO",{"$f":"ORÇAMENTO!I24","v":737959.13},{"$f":"ROUND($E$13*F12,2)","v":0},{"$f":"ROUND($E$13*G12,2)","v":36897.96},{"$f":"ROUND($E$13*H12,2)","v":73795.91},73795.91,92244.89,129142.85,73795.91,73795.91,73795.91,110693.87,{"$f":"SUM(F13:O13)","v":737959.12000000011}]
[null,"TOTAL",null,"FISICO ",{"$f":"SUM(F14:O14)","v":0.999999993327923},{"$f":"F15/E15","v":3.7690699300915793E-2},{"$f":"G15/$E$15","v":6.8845351985684811E-2},{"$f":"H15/$E$15","v":9.9999997998376916E-2},{"$f":"I15/$E$15","v":0.13769069729929273},0.14384534798243867,0.15615464934873055,0.11884534931685407,9.9999997998376916E-2,{"$f":"N15/$E$15","v":8.1154650015938259E-2},5.577325208131436E-2,{"$f":"SUM(F14:O14)","v":0.999999993327923}]
[null,null,null,"FINANCEIRO",{"$f":"E11+E9+E7+E13","v":2997567.36},{"$f":"F11+F9+F7+F13","v":112980.40999999999},{"$f":"G11+G9+G7+G13","v":206368.58},{"$f":"H11+H9+H7+H13","v":299756.73},412737.14,431186.12,468084.07999999996,356246.94000000006,299756.73,{"$f":"N11+N9+N7+N13","v":243266.53},167184.07999999999,{"$f":"ROUND(SUM(F15:O15),2)+0.02","v":2997567.36}]
[]
[null,"OBSERVAÇÕES:"]
{"$rows_empty":8}
[{"$nulls":15},{"$f":"P15/10","v":299756.73599999998},"/MÊS"]