{"text_format":"2","workbook":"xlsx","n_sheets":5,"sheets":["ORÇAMENTO","CPU","BDI SERV","BDI FORN","CRONOGRAMA"],"not_rendered":{"charts":0,"images":2,"macros":0,"external_links":0,"defined_names":5,"comments":0,"pivot_tables":0},"unopened":[],"bounds":{"document_bytes":16777216,"sheet_cells":100000,"run_cost":"one","rows_first":2000,"rows_last":500,"rows_between":2000,"halvings":0,"cell_chars":16384,"cell_head_chars":4096},"cells_cut":0,"cells_raw":0,"read":"whole","date_system":"1900"}

{"sheet":"ORÇAMENTO","index":0,"n_rows":41,"n_cols":13,"rows_kept":41,"cut":false,"hidden":false,"merged":[[6,6,6,7],[40,1,40,2],[0,0,7,0],[0,2,0,8],[1,2,1,8],[2,2,2,8],[4,2,4,8],[5,6,5,7],[6,1,6,2],[19,6,19,7]]}
["<---- NUMERAR SERVIÇOS PARA CPU",null,"Ministério da Integração e do Desenvolvimento Regional - MIDR"]
[null,null,"Companhia de Desenvolvimento dos Vales do São Francisco e do Parnaíba"]
[null,null,"1ª Superintendência Regional"]
[]
[null,"OBRA: "," PAVIMENTAÇÃO ASFÁLTICA EM PMF - VIAS DIVERSAS -  RIO PARDO DE MINAS -MG"]
[null,"DATA:"," SETEMBRO DE 2023",null,null,null,"BDI Serviços:",null,{"$f":"'BDI SERV'!D31/100","v":0.2462}]
[null,"PRAZO DE EXECUÇÃO:     150 DIAS",{"$nulls":4},"BDI Fornecimento:",null,{"$f":"'BDI FORN'!D31/100","v":0.15},null,null,null,"."]
[null,"ITEM","DISCRIMINAÇÃO","REFER.","UNID.","QUANT.","P. UNITÁRIO","P.UNIT.C/ BDI","P. TOTAL"]
["A",1,"SERVIÇOS PRELIMINARES ",{"$nulls":5},{"$f":"SUM(I10:I14)","v":117122.68000000001}]
[1,"1.1","MOBILIZAÇÃO E DESMOBILIZAÇÃO","CPU.1","GL",1,{"$f":"VLOOKUP(A10,CPU!$A$1:$N$4716,9)","v":10220.700000000001},{"$f":"VLOOKUP(A10,CPU!$A$1:$N$4716,10)","v":12737.036340000001},{"$f":"ROUND(F10*H10,2)","v":12737.04}]
[2,"1.2","ADMINISTRAÇÃO LOCAL","CPU.2","GL",1,{"$f":"VLOOKUP(A11,CPU!$A$1:$N$4716,9)","v":65613.149999999994},{"$f":"VLOOKUP(A11,CPU!$A$1:$N$4716,10)","v":81767.107529999994},{"$f":"ROUND(F11*H11,2)","v":81767.11}]
[3,"1.3","CANTEIRO DE OBRAS","CPU.3","GL",1,{"$f":"VLOOKUP(A12,CPU!$A$1:$N$4716,9)","v":11337.75},{"$f":"VLOOKUP(A12,CPU!$A$1:$N$4716,10)","v":14129.10405},{"$f":"ROUND(F12*H12,2)","v":14129.1}]
[4,"1.4","PLACA DE OBRA EM CHAPA DE AÇO GALVANIZADO","74209/001","M2",4.5,{"$f":"VLOOKUP(A13,CPU!$A$1:$N$4716,9)","v":340.5},{"$f":"VLOOKUP(A13,CPU!$A$1:$N$4716,10)","v":424.33109999999999},{"$f":"ROUND(F13*H13,2)","v":1909.49}]
[5,"1.5","SERVIÇOS TOPOGRÁFICOS PARA PAVIMENTAÇÃO, INCLUSIVE NOTA DE SERVIÇO, ACOMPANHAMENTO E GREIDE",99064,"M2",16000,{"$f":"VLOOKUP(A14,CPU!$A$1:$N$4716,9)","v":0.32999999999999996},{"$f":"VLOOKUP(A14,CPU!$A$1:$N$4716,10)","v":0.41124599999999994},{"$f":"ROUND(F14*H14,2)","v":6579.94}]
["B",2,"PAVIMENTAÇÃO",{"$nulls":5},{"$f":"SUM(I16:I23)","v":492750.48}]
[6,"2.1","ESCAVAÇÃO HORIZONTAL EM SOLO DE 1A CATEGORIA",101116,"M3",6499.9999999999991,{"$f":"VLOOKUP(A16,CPU!$A$1:$N$4716,9)","v":2.2000000000000002},{"$f":"VLOOKUP(A16,CPU!$A$1:$N$4716,10)","v":2.7416400000000003},{"$f":"ROUND(F16*H16,2)","v":17820.66}]
[7,"2.2","CARGA, MANOBRA E DESCARGA DE SOLOS E MATERIAIS GRANULARES EM CAMINHÃO BASCULANTE - DESCARGA LIVRE",100976,"M3",6499.9999999999991,{"$f":"VLOOKUP(A17,CPU!$A$1:$N$4716,9)","v":5.22},{"$f":"VLOOKUP(A17,CPU!$A$1:$N$4716,10)","v":6.5051639999999997},{"$f":"ROUND(F17*H17,2)","v":42283.57}]
[8,"2.3","REGULARIZAÇÃO E COMPACTAÇÃO DE SUBLEITO",100576,"M2",15800,{"$f":"VLOOKUP(A18,CPU!$A$1:$N$4716,9)","v":2.57},{"$f":"VLOOKUP(A18,CPU!$A$1:$N$4716,10)","v":3.2027339999999995},50603.199999999997]
[9,"2.4","EXECUÇÃO E COMPACTAÇÃO DE BASE E OU SUB BASE PARA PAVIMENTAÇÃO DE SOLOS DE COMPORTAMENTO LATERÍTICO - EXCLUSIVE SOLO, ESCAVAÇÃO, CARGA E TRANSPORTE",96388,"M3",3199.9999999999995,{"$f":"VLOOKUP(A19,CPU!$A$1:$N$4716,9)","v":12.469999999999999},{"$f":"VLOOKUP(A19,CPU!$A$1:$N$4716,10)","v":15.540113999999999},49728.36]
[null,"2.4.1","CASCALHO DE CAVA (EXCLUSIVE CARGA/TRANSPORTE)","-","M3",3199.9999999999995,"FORNECIDO PELA PREFEITURA",null,"-"]
[10,"2.5","IMPRIMAÇÃO COM EMULSÃO ASFÁLTICA DE IMPRIMAÇÃO (EAI)",96401,"M2",15800,{"$f":"VLOOKUP(A21,CPU!$A$1:$N$4716,9)","v":1.23},{"$f":"VLOOKUP(A21,CPU!$A$1:$N$4716,10)","v":1.532826},24218.65]
[11,"2.6","PINTURA DE LIGAÇÃO COM EMULSÃO ASFÁLTICA RR-1C",96402,"M2",13800,{"$f":"VLOOKUP(A22,CPU!$A$1:$N$4716,9)","v":1.01},{"$f":"VLOOKUP(A22,CPU!$A$1:$N$4716,10)","v":1.2586619999999999},17369.54]
[12,"2.7","EXECUÇÃO DE PAVIMENTO COM APLICAÇÃO DE PRÉ-MISTURADO A FRIO, CAMADA DE ROLAMENTO - EXCLUSIVE TRANSPORTE",100624,"M3",560.00000000000011,{"$f":"VLOOKUP(A23,CPU!$A$1:$N$4716,9)","v":416.59},{"$f":"VLOOKUP(A23,CPU!$A$1:$N$4716,10)","v":519.15445799999998},290726.5]
["C",3,"TRANSPORTE DE MATERIAIS",{"$nulls":5},{"$f":"SUM(I25:I26)","v":130178.06}]
[13,"3.1","TRANSPORTE COM CAMINHÃO BASCULANTE, EM VIA URBANA EM REVESTIMENTO PRIMÁRIO",95426,"M3XKM",25999.999999999996,{"$f":"VLOOKUP(A25,CPU!$A$1:$N$4716,9,0)","v":1.94},{"$f":"VLOOKUP(A25,CPU!$A$1:$N$4716,10)","v":2.4176279999999997},{"$f":"ROUND(F25*H25,2)","v":62858.33}]
[14,"3.2","TRANSPORTE COM CAMINHÃO BASCULANTE, EM VIA URBANA PAVIMENTADA",95427,"M3XKM",74000.003879680007,{"$f":"VLOOKUP(A26,CPU!$A$1:$N$4716,9,0)","v":0.73},{"$f":"VLOOKUP(A26,CPU!$A$1:$N$4716,10,0)","v":0.90972599999999992},{"$f":"ROUND(F26*H26,2)","v":67319.73}]
["E",4,"OBRAS COMPLEMENTARES",{"$nulls":5},{"$f":"SUM(I28:I33)","v":401514.94}]
[15,"4.1","GUIA (MEIO-FIO) E SARJETA CONJUGADOS DE CONCRETO, MOLDADA  IN LOCO  EM TRECHO RETO COM EXTRUSORA, 45 CM BASE (15 CM BASE DA GUIA + SARJETA (30 X 0,07))X 22 CM ALTURA",94267,"M",4200,{"$f":"VLOOKUP(A28,CPU!$A$1:$N$4716,9,0)","v":57.319999999999986},{"$f":"VLOOKUP(A28,CPU!$A$1:$N$4716,10,0)","v":71.432183999999978},{"$f":"ROUND(F28*H28,2)","v":300015.17}]
[16,"4.2","FORNECIMENTO E INSTALAÇÃO DE PLACA DE SINALIZAÇÃO VIÁRIA - REGULAMENTAÇÃO (PARE)","CPU.4","UNID",25,{"$f":"VLOOKUP(A29,CPU!$A$1:$N$4716,9,0)","v":482.58000000000004},{"$f":"VLOOKUP(A29,CPU!$A$1:$N$4716,10,0)","v":601.39119600000004},{"$f":"ROUND(F29*H29,2)","v":15034.78}]
[16.5,"4.3","FORNECIMENTO E INSTALAÇÃO DE PLACA DE SINALIZAÇÃO VIÁRIA - REGULAMENTAÇÃO (FAIXA DE PEDESTRE E OUTROS) - CONFORME PROJETO","CPU.5","UNID",25,{"$f":"VLOOKUP(A30,CPU!$A$1:$N$4716,9,0)","v":415.85},{"$f":"VLOOKUP(A30,CPU!$A$1:$N$4716,10,0)","v":518.23226999999997},{"$f":"ROUND(F30*H30,2)","v":12955.81}]
[17,"4.4","PINTURA DE EIXO VIÁRIO SOBRE ASFALTO COM TINTA RETRORREFLETIVA A BASE DE RESINA ACRÍLICA COM MICROESFERAS DE VIDRO, APLICAÇÃO MECÂNICA COM DEMARCADORA AUTOPROPELIDA - ESPESSURA DE 0,10 MM",102512,"M",6500,{"$f":"VLOOKUP(A31,CPU!$A$1:$N$4716,9,0)","v":5.84},{"$f":"VLOOKUP(A31,CPU!$A$1:$N$4716,10,0)","v":7.28},{"$f":"ROUND(F31*H31,2)","v":47320}]
[17.100000000000001,"4.5","PINTURA DE FAIXA DE PEDESTRE OU ZEBRADA TINTA RETRORREFLETIVA A BASE DE RESINA ACRÍLICA COM MICROESFERAS DE VIDRO, E = 30 CM, APLICAÇÃO MANUAL",102509,"M2",499.99999999999994,{"$f":"VLOOKUP(A32,CPU!$A$1:$N$4716,9,0)","v":25.52},{"$f":"VLOOKUP(A32,CPU!$A$1:$N$4716,10,0)","v":31.8},{"$f":"ROUND(F32*H32,2)","v":15900}]
[17.2,"4.6","FORNECIMENTO E INSTALAÇÃO DE PLACA DE AÇO PARA IDENTIFICACAO DE RUA, *45 CM X 20* CM, INCLUSIVE SUPORTE EM TUBO DE AÇO GALVANIZADO (02 PLACAS POR SUPORTE)                      ","CPU.6","UNID.",22,{"$f":"VLOOKUP(A33,CPU!$A$1:$N$4716,9,0)","v":375.29},{"$f":"VLOOKUP(A33,CPU!$A$1:$N$4716,10,0)","v":467.69},10289.18]
["F",5,"TRANSPORTE DE MATERIAL ASFÁLTICO (BDI DIFERENCIADO)",{"$nulls":5},{"$f":"SUM(I35:I36)","v":58121}]
[18,"5.1","TRANSPORTE COM CAMINHÃO TANQUE DE TRANSPORTE DE MATERIAL ASFÁLTICO DE 30000 L, EM VIA URBANA PAVIMENTADA",102331,"TXKM",92000.000000000015,{"$f":"VLOOKUP(A35,CPU!$A$1:$N$4716,9,0)","v":0.52},{"$f":"VLOOKUP(A35,CPU!$A$1:$N$4716,10,0)","v":0.59799999999999998},{"$f":"ROUND(F35*H35,2)","v":55016}]
[19,"5.2","TRANSPORTE COM CAMINHÃO BASCULANTE, EM VIA URBANA PAVIMENTADA - MASSA ASFÁLTICA (PMF)",95430,"TXKM",6000.0000000000018,{"$f":"VLOOKUP(A36,CPU!$A$1:$N$4716,9,0)","v":0.44999999999999996},{"$f":"VLOOKUP(A36,CPU!$A$1:$N$4716,10,0)","v":0.51749999999999996},{"$f":"ROUND(F36*H36,2)","v":3105}]
["G",6,"FORNECIMENTOS - MATERIAL ASFÁLTICO (BDI DIFERENCIADO)",{"$nulls":5},{"$f":"SUM(I38:I40)","v":451978.02}]
[20,"6.1","AQUISIÇÃO DE EMULSÃO ASFÁLTICA PARA IMPRIMAÇÃO (EAI) - EXCLUSIVE TRANSPORTE","CPU.5","T",21,{"$f":"VLOOKUP(A38,CPU!$A$1:$N$4716,9,0)","v":2689.76},{"$f":"VLOOKUP(A38,CPU!$A$1:$N$4716,10,0)","v":3093.2240000000002},{"$f":"ROUND(F38*H38,2)","v":64957.7}]
[21,"6.2","AQUISIÇÃO DE EMULSAO ASFALTICA CATIONICA RR-1C - EXCLUSIVE TRANSPORTE","CPU.6","T",6.5,{"$f":"VLOOKUP(A39,CPU!$A$1:$N$4716,9,0)","v":2706.7},{"$f":"VLOOKUP(A39,CPU!$A$1:$N$4716,10,0)","v":3112.7049999999995},{"$f":"ROUND(F39*H39,2)","v":20232.580000000002}]
[22,"6.3","AQUISIÇÃO DE EMULSAO ASFALTICA CATIONICA RL-1C  - EXCLUSIVE TRANSPORTE","CPU.7","T",105.99800000000002,{"$f":"VLOOKUP(A40,CPU!$A$1:$N$4716,9,0)","v":3008.98},{"$f":"VLOOKUP(A40,CPU!$A$1:$N$4716,10,0)","v":3460.3269999999998},{"$f":"ROUND(F40*H40,2)","v":366787.74}]
[null,"TOTAL GERAL DA OBRA COM BDI ",{"$nulls":6},{"$f":"SUM(I9,I15,I24,I27,I34,I37)","v":1651665.18}]

{"sheet":"CPU","index":1,"n_rows":413,"n_cols":13,"rows_kept":413,"cut":false,"hidden":false,"merged":[[306,2,306,5],[307,2,307,3],[308,1,308,7],[318,1,318,3],[318,5,318,6],[319,1,319,6],[320,1,320,6],[271,0,287,0],[286,1,286,6],[271,1,271,3],[271,4,271,7],[272,2,272,5],[305,4,305,7],[273,2,273,3],[274,1,274,7],[283,1,283,3],[283,5,283,6],[284,1,284,6],[285,1,285,6],[288,0,303,0],[288,1,288,3],[288,4,288,7],[289,2,289,5],[290,2,290,3],[357,0,367,0],[369,0,379,0],[369,1,369,3],[369,4,369,7],[370,2,370,5],[371,2,371,3],[372,1,372,7],[376,1,376,3],[305,1,305,3],[376,5,376,6],[377,1,377,6],[378,1,378,6],[379,1,379,6],[357,1,357,3],[358,2,358,5],[359,2,359,3],[360,1,360,7],[364,1,364,3],[364,5,364,6],[357,4,357,7],[366,1,366,6],[367,1,367,6],[365,1,365,6],[321,1,321,6],[381,0,390,0],[392,0,401,0],[392,1,392,3],[392,4,392,7],[393,2,393,5],[394,2,394,3],[395,1,395,7],[398,1,398,3],[398,5,398,6],[399,1,399,6],[400,1,400,6],[401,1,401,6],[381,1,381,3],[381,4,381,7],[382,2,382,5],[383,2,383,3],[384,1,384,7],[387,1,387,3],[387,5,387,6],[388,1,388,6],[389,1,389,6],[390,1,390,6],[403,0,412,0],[403,1,403,3],[403,4,403,7],[404,2,404,5],[405,2,405,3],[406,1,406,7],[409,1,409,3],[409,5,409,6],[410,1,410,6],[411,1,411,6],[412,1,412,6],[49,2,49,3],[253,0,269,0],[255,2,255,3],[256,1,256,7],[266,1,266,3],[266,5,266,6],[267,1,267,6],[268,1,268,6],[254,2,254,5],[228,1,228,3],[228,4,228,7],[241,0,251,0],[241,1,241,3],[241,4,241,7],[242,2,242,5],[243,2,243,3],[244,1,244,7],[251,1,251,6],[238,1,238,6],[228,0,239,0],[167,1,167,7],[201,1,201,6],[183,1,183,3],[109,2,109,3],[0,0,13,0],[14,0,32,0],[33,0,46,0],[47,0,63,0],[64,0,79,0],[80,0,92,0],[107,0,124,0],[145,0,163,0],[164,0,182,0],[93,0,105,0],[125,0,143,0],[110,1,110,7],[120,1,120,3],[120,5,120,6],[183,0,203,0],[184,2,184,5],[185,2,185,3],[186,1,186,7],[178,1,178,3],[178,5,178,6],[179,1,179,6],[180,1,180,6],[181,1,181,6],[166,2,166,3],[126,2,126,5],[127,2,127,3],[128,1,128,7],[140,1,140,3],[140,5,140,6],[141,1,141,6],[142,1,142,6],[165,2,165,5],[164,10,164,11],[121,1,121,6],[122,1,122,6],[123,1,123,6],[145,1,145,3],[145,4,145,7],[145,10,145,11],[146,2,146,5],[147,2,147,3],[148,1,148,7],[159,1,159,3],[159,5,159,6],[160,1,160,6],[161,1,161,6],[162,1,162,6],[164,1,164,3],[164,4,164,7],[143,1,143,6],[125,1,125,3],[125,4,125,7],[107,10,107,11],[108,2,108,5],[107,1,107,3],[107,4,107,7],[66,2,66,3],[67,1,67,7],[75,1,75,3],[75,5,75,6],[76,1,76,6],[77,1,77,6],[78,1,78,6],[80,10,80,11],[81,2,81,5],[80,1,80,3],[80,4,80,7],[82,2,82,3],[83,1,83,7],[88,1,88,3],[88,5,88,6],[89,1,89,6],[90,1,90,6],[91,1,91,6],[50,1,50,7],[59,1,59,3],[59,5,59,6],[60,1,60,6],[61,1,61,6],[62,1,62,6],[64,10,64,11],[65,2,65,5],[64,1,64,3],[64,4,64,7],[0,1,0,3],[0,4,0,7],[0,10,0,11],[1,2,1,5],[2,2,2,3],[3,1,3,7],[9,1,9,3],[9,5,9,6],[10,1,10,6],[1,10,1,11],[11,1,11,6],[12,1,12,6],[14,1,14,3],[14,4,14,7],[14,10,14,11],[15,2,15,5],[16,2,16,3],[17,1,17,7],[28,1,28,3],[28,5,28,6],[15,8,16,9],[33,10,33,11],[34,2,34,5],[35,2,35,3],[36,1,36,7],[34,8,35,9],[42,1,42,3],[42,5,42,6],[43,1,43,6],[44,1,44,6],[47,10,47,11],[48,2,48,5],[248,1,248,3],[248,5,248,6],[249,1,249,6],[250,1,250,6],[29,1,29,6],[30,1,30,6],[31,1,31,6],[105,1,105,6],[93,1,93,3],[93,4,93,7],[94,2,94,5],[95,2,95,3],[96,1,96,7],[102,1,102,3],[102,5,102,6],[103,1,103,6],[104,1,104,6],[33,1,33,3],[33,4,33,7],[45,1,45,6],[47,1,47,3],[47,4,47,7],[236,5,236,6],[237,1,237,6],[225,1,225,3],[205,1,205,3],[205,4,205,7],[206,2,206,5],[207,2,207,3],[208,1,208,7],[230,2,230,3],[231,1,231,7],[291,1,291,7],[300,1,300,3],[300,5,300,6],[301,1,301,6],[302,1,302,6],[303,1,303,6],[305,0,321,0],[183,10,183,11],[225,5,225,6],[226,1,226,6],[200,1,200,3],[200,5,200,6],[183,4,183,7],[188,8,188,9],[228,10,228,11],[229,2,229,5],[253,10,253,11],[253,1,253,3],[253,4,253,7],[269,1,269,6],[239,1,239,6],[202,1,202,6],[203,1,203,6],[236,1,236,3],[338,1,338,6],[323,0,338,0],[340,0,355,0],[340,1,340,3],[340,4,340,7],[341,2,341,5],[342,2,342,3],[343,1,343,7],[352,1,352,3],[352,5,352,6],[353,1,353,6],[354,1,354,6],[355,1,355,6],[323,1,323,3],[323,4,323,7],[324,2,324,5],[325,2,325,3],[326,1,326,7],[335,1,335,3],[335,5,335,6],[336,1,336,6],[337,1,337,6]]}
[1,"CODEVASF",null,null," COMPOSIÇÃO DE PREÇO UNITÁRIO",null,null,null,{"$f":"H11","v":10220.700000000001},{"$f":"H13","v":12737.036340000001},"BDI CALCULADO:",null,{"$f":"ORÇAMENTO!I6","v":0.2462}]
[null,"OBRA:  ",{"$f":"ORÇAMENTO!C5","v":" PAVIMENTAÇÃO ASFÁLTICA EM PMF - VIAS DIVERSAS -  RIO PARDO DE MINAS -MG"},null,null,null,"DATA: ",{"$f":"ORÇAMENTO!C6","v":" SETEMBRO DE 2023"},null,null,"BDI DIFERENCIADO:",null,{"$f":"'BDI FORN'!D31/100","v":0.15}]
[null,"SERVIÇO:  ",{"$f":"VLOOKUP(A1,ORÇAMENTO!A10:I28,3)","v":"MOBILIZAÇÃO E DESMOBILIZAÇÃO"},null,"Referência:",{"$f":"VLOOKUP(A1,ORÇAMENTO!A10:I28,4)","v":"CPU.1"},"UNIDADE: ",{"$f":"VLOOKUP(A1,ORÇAMENTO!A10:I28,5)","v":"GL"}]
[]
[null,"TIPO ITEM","CODIGO ITEM","DESCRIÇÃO ITEM","UNIDADE ITEM","COEFICIENTE","PRECO UNITARIO","CUSTO TOTAL"]
[null,"COMPOSICAO",89876,"CAMINHÃO BASCULANTE 14 M3, COM CAVALO MECÂNICO DE CAPACIDADE MÁXIMA DE TRAÇÃO COMBINADO DE 36000 KG, POTÊNCIA 286 CV, INCLUSIVE SEMIREBOQUE COM CAÇAMBA METÁLICA","CHP DIURNO.",16,316.13,{"$f":"ROUNDDOWN(F6*G6,2)","v":5058.08}]
[null,"COMPOSICAO",89877,"CAMINHÃO BASCULANTE 14 M3, COM CAVALO MECÂNICO DE CAPACIDADE MÁXIMA DE TRAÇÃO COMBINADO DE 36000 KG, POTÊNCIA 286 CV, INCLUSIVE SEMIREBOQUE COM CAÇAMBA METÁLICA","CHI DIURNO.",16,89.75,{"$f":"ROUNDDOWN(F7*G7,2)","v":1436}]
[null,"COMPOSICAO",5914640,"TRANSPORTE COM CAVALO MECÂNICO COM SEMIRREBOQUE COM CAPACIDADE DE 30 T - RODOVIA PAVIMENTADA","T.KM",5335,0.57999999999999996,{"$f":"ROUNDDOWN(F8*G8,2)","v":3094.3}]
[null,"COMPOSIÇÃO",88316,"SERVENTE COM ENCARGOS COMPLEMENTARES","H",32,19.760000000000002,{"$f":"ROUNDDOWN(F9*G9,2)","v":632.32000000000005}]
[null,"PRODUÇÃO DA EQUIPE",null,null,1,"CUSTO ",null,{"$f":"SUM(H6:H9)","v":10220.700000000001}]
[null,"TOTAL",{"$nulls":5},{"$f":"H10/E10","v":10220.700000000001}]
[null,"BDI                %",{"$nulls":5},{"$f":"1+$M$1","v":1.2462}]
[null,"TOTAL DO SERVIÇO - R$",{"$nulls":5},{"$f":"H11*H12","v":12737.036340000001}]
[]
[{"$f":"A1+1","v":2},"CODEVASF",null,null," COMPOSIÇÃO DE PREÇO UNITÁRIO",null,null,null,{"$f":"H30","v":65613.149999999994},{"$f":"H32","v":81767.107529999994}]
[null,"OBRA:  ",{"$f":"$C$2","v":" PAVIMENTAÇÃO ASFÁLTICA EM PMF - VIAS DIVERSAS -  RIO PARDO DE MINAS -MG"},null,null,null,"DATA: ",{"$f":"$H$2","v":" SETEMBRO DE 2023"}]
[null,"SERVIÇO:  ",{"$f":"VLOOKUP(A15,ORÇAMENTO!$A$10:$I$28,3)","v":"ADMINISTRAÇÃO LOCAL"},null,"SINAPI","CPU","UNIDADE: ",{"$f":"VLOOKUP(A15,ORÇAMENTO!$A$10:$I$28,5)","v":"GL"}]
[]
[null,"TIPO ITEM","CODIGO ITEM","DESCRIÇÃO ITEM","UNIDADE ITEM","COEFICIENTE","PRECO UNITARIO","CUSTO TOTAL"]
[null,"INSUMO",14250,"ENERGIA ELÉTRICA","kwh",60,0.94,{"$f":"ROUNDDOWN(F20*G20,2)","v":56.4}]
[null,"INSUMO",44480,"TARIFA \"A\" - ÁGUA/ESGOTO ","m³",6,17.78,106.68]
[null,"COTAÇÃO","MERC.","TELEFONE (PLANO CONTROLE)","UNID",2,59.9,119.8]
[null,"INSUMO","ED-50155 SEINFRA","BANHEIRO QUÍMICO 110 X 120 X 230 CM COM MANUTENÇÃO (CONSIDERANDO OBRAS SIMULTÂNEAS)","MÊS",2,820,1640]
[null,"COMPOSICAO",90777,"Engenheiro Civil Júnior com encargos complementares","H",30,114.12,3423.6]
[null,"COMPOSICAO",90776,"Encarregado Geral com encargos complementares","H",75,57.73,4329.75]
[null,"COMPOSICAO",88321,"Tecnico de Laboratório com encargos complementares","H",30,45.45,1363.5]
[null,"COMPOSICAO",100309,"Tecnico em Segurança do Trabalho com encargos complementares","H",30,45.71,1371.3]
[null,"COMPOSICAO",90772,"Auxiliar de escritório com encargos complementares","H",30,23.72,711.6]
[null,"PRODUÇÃO DA EQUIPE",null,null,{"$f":"1/5","v":0.2},"CUSTO ",null,{"$f":"SUM(H20:H28)","v":13122.63}]
[null,"TOTAL",{"$nulls":5},{"$f":"H29/E29","v":65613.149999999994}]
[null,"BDI                %",{"$nulls":5},{"$f":"1+$M$1","v":1.2462}]
[null,"TOTAL DO SERVIÇO - R$",{"$nulls":5},{"$f":"H30*H31","v":81767.107529999994}]
[]
[{"$f":"A15+1","v":3},"CODEVASF",null,null," COMPOSIÇÃO DE PREÇO UNITÁRIO",null,null,null,{"$f":"H44","v":11337.75},{"$f":"H46","v":14129.10405}]
[null,"OBRA:  ",{"$f":"$C$2","v":" PAVIMENTAÇÃO ASFÁLTICA EM PMF - VIAS DIVERSAS -  RIO PARDO DE MINAS -MG"},null,null,null,"DATA: ",{"$f":"$H$2","v":" SETEMBRO DE 2023"}]
[null,"SERVIÇO:  ",{"$f":"VLOOKUP(A34,ORÇAMENTO!$A$10:$I$28,3)","v":"CANTEIRO DE OBRAS"},null,"SINAPI",{"$f":"VLOOKUP(A34,ORÇAMENTO!$A$10:$I$28,4)","v":"CPU.3"},"UNIDADE: ",{"$f":"VLOOKUP(A34,ORÇAMENTO!$A$10:$I$28,5)","v":"GL"}]
[]
[null,"TIPO ITEM","CODIGO ITEM","DESCRIÇÃO ITEM","UNIDADE ITEM","COEFICIENTE","PRECO UNITARIO","CUSTO TOTAL"]
[null,"INSUMO",10775,"ALUGUEL DE IMÓVEL OU CONTEINER QUE ATENDA AOS REQUISITOS MÍNIMOS PARA INSTALAÇÃO DO CANTEIRO DE OBRAS","MÊS",5,975,{"$f":"ROUNDDOWN(F39*G39,2)","v":4875}]
[null,"INSUMO",10779,"LOCACAO DE CONTAINER 2,30 X 4,30 M, ALT. 2,50 M, P/ SANITARIO, C/ 5 BACIAS, 1 LAVATORIO E 4 MICTORIOS","MÊS",5,1218.75,{"$f":"ROUNDDOWN(F40*G40,2)","v":6093.75}]
[null,"INSUMO","37525","TELA PLASTICA TECIDA LISTRADA BRANCA E LARANJA, TIPO GUARDA CORPO, EM POLIETILENO MONOFILADO, ROLO 1,20 X 50 M (L X C)","M",100,3.69,{"$f":"ROUNDDOWN(F41*G41,2)","v":369}]
[{"$nulls":7},{"$f":"ROUNDDOWN(F42*G42,2)","v":0}]
[null,"PRODUÇÃO DA EQUIPE",null,null,1,"CUSTO ",null,{"$f":"SUM(H39:H42)","v":11337.75}]
[null,"TOTAL",{"$nulls":5},{"$f":"H43/E43","v":11337.75}]
[null,"BDI                %",{"$nulls":5},{"$f":"1+$M$1","v":1.2462}]
[null,"TOTAL DO SERVIÇO - R$",{"$nulls":5},{"$f":"H44*H45","v":14129.10405}]
[]
[{"$f":"A34+1","v":4},"CODEVASF",null,null," COMPOSIÇÃO DE PREÇO UNITÁRIO",null,null,null,{"$f":"H61","v":340.5},{"$f":"H63","v":424.33109999999999}]
[null,"OBRA:  ",{"$f":"$C$2","v":" PAVIMENTAÇÃO ASFÁLTICA EM PMF - VIAS DIVERSAS -  RIO PARDO DE MINAS -MG"},null,null,null,"DATA: ",{"$f":"$H$2","v":" SETEMBRO DE 2023"}]
[null,"SERVIÇO:  ",{"$f":"VLOOKUP(A48,ORÇAMENTO!$A$10:$I$28,3)","v":"PLACA DE OBRA EM CHAPA DE AÇO GALVANIZADO"},null,"SINAPI",{"$f":"VLOOKUP(A48,ORÇAMENTO!$A$10:$I$28,4)","v":"74209/001"},"UNIDADE: ",{"$f":"VLOOKUP(A48,ORÇAMENTO!$A$10:$I$28,5)","v":"M2"}]
[]
[null,"TIPO ITEM","CODIGO ITEM","DESCRIÇÃO ITEM","UNIDADE ITEM","COEFICIENTE","PRECO UNITARIO","CUSTO TOTAL"]
[null,"INSUMO","4509","SARRAFO *2,5 X 10* CM EM PINUS, MISTA OU EQUIVALENTE DA REGIAO - BRUTA","M","3,2083000","4,41",{"$f":"ROUNDDOWN(F53*G53,2)","v":14.14}]
[null,"INSUMO","4813","PLACA DE OBRA (PARA CONSTRUCAO CIVIL) EM CHAPA GALVANIZADA *N. 22*, ADESIVADA, DE *2,4 X 1,2* M (SEM POSTES PARA FIXACAO)","M2","1,0000000","250,00",250]
[null,"INSUMO","5065","PREGO DE ACO POLIDO COM CABECA 10 X 10 (7/8 X 17)","KG","0,0113000","36,57",0.41]
[null,"INSUMO","5069","PREGO DE ACO POLIDO COM CABECA 17 X 27 (2 1/2 X 11)","KG","0,0132000","19,59",0.25]
[null,"COMPOSICAO","88262","CARPINTEIRO DE FORMAS COM ENCARGOS COMPLEMENTARES","H","0,3729000","27,05",10.08]
[null,"COMPOSICAO","88316","SERVENTE COM ENCARGOS COMPLEMENTARES","H","1,1186000","19,76",22.1]
[null,"INSUMO",4115,"MADEIRA ROLICA TRATADA, D = 12 A 15 CM, H = 3,00 M, EM EUCALIPTO OU EQUIVALENTE","M",2,21.76,43.52]
[null,"PRODUÇÃO DA EQUIPE",null,null,1,"CUSTO ",null,{"$f":"SUM(H53:H59)","v":340.5}]
[null,"TOTAL",{"$nulls":5},{"$f":"H60/E60","v":340.5}]
[null,"BDI                %",{"$nulls":5},{"$f":"1+$M$1","v":1.2462}]
[null,"TOTAL DO SERVIÇO - R$",{"$nulls":5},{"$f":"H61*H62","v":424.33109999999999}]
[]
[{"$f":"A48+1","v":5},"CODEVASF",null,null," COMPOSIÇÃO DE PREÇO UNITÁRIO",null,null,null,{"$f":"H77","v":0.32999999999999996},{"$f":"H79","v":0.41124599999999994}]
[null,"OBRA:  ",{"$f":"$C$2","v":" PAVIMENTAÇÃO ASFÁLTICA EM PMF - VIAS DIVERSAS -  RIO PARDO DE MINAS -MG"},null,null,null,"DATA: ",{"$f":"$H$2","v":" SETEMBRO DE 2023"}]
[null,"SERVIÇO:  ",{"$f":"VLOOKUP(A65,ORÇAMENTO!$A$10:$I$28,3)","v":"SERVIÇOS TOPOGRÁFICOS PARA PAVIMENTAÇÃO, INCLUSIVE NOTA DE SERVIÇO, ACOMPANHAMENTO E GREIDE"},null,"SINAPI",{"$f":"VLOOKUP(A65,ORÇAMENTO!$A$10:$I$28,4)","v":99064},"UNIDADE: ",{"$f":"VLOOKUP(A65,ORÇAMENTO!$A$10:$I$28,5)","v":"M2"}]
[]
[null,"TIPO ITEM","CODIGO ITEM","DESCRIÇÃO ITEM","UNIDADE ITEM","COEFICIENTE","PRECO UNITARIO","CUSTO TOTAL"]
[null,"COMPOSICAO",88253,"AUXILIAR DE TOPÓGRAFO COM ENCARGOS COMPLEMENTARES","H",2.5000000000000001E-3,21.57,{"$f":"ROUNDDOWN(F70*G70,2)","v":0.05}]
[null,"COMPOSICAO",88288,"NIVELADOR COM ENCARGOS COMPLEMENTARES","H",2.5000000000000001E-3,26.99,0.06]
[null,"COMPOSICAO",88316,"SERVENTE COM ENCARGOS COMPLEMENTARES","H",7.4999999999999997E-3,19.760000000000002,0.14000000000000001]
[null,"COMPOSICAO",88597,"DESENHISTA DETALHISTA COM ENCARGOS COMPLEMENTARES ","H",2E-3,29.72,0.05]
[null,"COMPOSICAO",92145,"CAMINHONETE CABINE SIMPLES COM MOTOR 1.6 FLEX, CÂMBIO MANUAL, POTÊNCIA 101/104 CV, 2 PORTAS","CHP",5.0000000000000001E-4,74.75,0.03]
[{"$nulls":7},"-"]
[null,"PRODUÇÃO DA EQUIPE",null,null,1,"CUSTO ",null,{"$f":"SUM(H70:H75)","v":0.32999999999999996}]
[null,"TOTAL",{"$nulls":5},{"$f":"H76/E76","v":0.32999999999999996}]
[null,"BDI                %",{"$nulls":5},{"$f":"1+$M$1","v":1.2462}]
[null,"TOTAL DO SERVIÇO - R$",{"$nulls":5},{"$f":"H77*H78","v":0.41124599999999994}]
[]
[{"$f":"A65+1","v":6},"CODEVASF",null,null," COMPOSIÇÃO DE PREÇO UNITÁRIO",null,null,null,{"$f":"H90","v":2.2000000000000002},{"$f":"H92","v":2.7416400000000003}]
[null,"OBRA:  ",{"$f":"$C$2","v":" PAVIMENTAÇÃO ASFÁLTICA EM PMF - VIAS DIVERSAS -  RIO PARDO DE MINAS -MG"},null,null,null,"DATA: ",{"$f":"$H$2","v":" SETEMBRO DE 2023"}]
[null,"SERVIÇO:  ",{"$f":"VLOOKUP(A81,ORÇAMENTO!$A$10:$I$28,3)","v":"ESCAVAÇÃO HORIZONTAL EM SOLO DE 1A CATEGORIA"},null,"SINAPI",{"$f":"VLOOKUP(A81,ORÇAMENTO!$A$10:$I$28,4)","v":101116},"UNIDADE: ",{"$f":"VLOOKUP(A81,ORÇAMENTO!$A$10:$I$28,5)","v":"M3"}]
[]
[null,"TIPO ITEM","CODIGO ITEM","DESCRIÇÃO ITEM","UNIDADE ITEM","COEFICIENTE","PRECO UNITARIO","CUSTO TOTAL"]
[null,"COMPOSICAO",5847,"TRATOR DE ESTEIRAS, POTÊNCIA 170 HP, PESO OPERACIONAL 19 T, CAÇAMBA 5,2 M3","CHP","0,0048000","253,93",{"$f":"ROUNDDOWN(F86*G86,2)","v":1.21}]
[null,"COMPOSICAO","5849","TRATOR DE ESTEIRAS, POTÊNCIA 170 HP, PESO OPERACIONAL 19 T, CAÇAMBA 5,2 M3","CHI","0,0082000","90,40",0.74]
[null,"COMPOSICAO","88316","SERVENTE COM ENCARGOS COMPLEMENTARES","H","0,0131000","19,76",0.25]
[null,"PRODUÇÃO DA EQUIPE",null,null,1,"CUSTO ",null,{"$f":"SUM(H86:H88)","v":2.2000000000000002}]
[null,"TOTAL",{"$nulls":5},{"$f":"H89/E89","v":2.2000000000000002}]
[null,"BDI                %",{"$nulls":5},{"$f":"1+$M$1","v":1.2462}]
[null,"TOTAL DO SERVIÇO - R$",{"$nulls":5},{"$f":"H90*H91","v":2.7416400000000003}]
[]
[7,"CODEVASF",null,null," COMPOSIÇÃO DE PREÇO UNITÁRIO",null,null,null,{"$f":"H104","v":5.22},{"$f":"H106","v":6.5051639999999997}]
[null,"OBRA:  ",{"$f":"$C$2","v":" PAVIMENTAÇÃO ASFÁLTICA EM PMF - VIAS DIVERSAS -  RIO PARDO DE MINAS -MG"},null,null,null,"DATA: ",{"$f":"$H$2","v":" SETEMBRO DE 2023"}]
[null,"SERVIÇO:  ",{"$f":"VLOOKUP(A94,ORÇAMENTO!$A$10:$I$28,3)","v":"CARGA, MANOBRA E DESCARGA DE SOLOS E MATERIAIS GRANULARES EM CAMINHÃO BASCULANTE - DESCARGA LIVRE"},null,"SINAPI",{"$f":"VLOOKUP(A94,ORÇAMENTO!$A$10:$I$28,4)","v":100976},"UNIDADE: ",{"$f":"VLOOKUP(A94,ORÇAMENTO!$A$10:$I$28,5)","v":"M3"}]
[]
[null,"TIPO ITEM","CODIGO ITEM","DESCRIÇÃO ITEM","UNIDADE ITEM","COEFICIENTE","PRECO UNITARIO","CUSTO TOTAL"]
[null,"COMPOSICAO","5940","PÁ CARREGADEIRA SOBRE RODAS, POTÊNCIA LÍQUIDA 128 HP, CAPACIDADE DA CAÇAMBA 1,7 A 2,8 M3, PESO OPERACIONAL 11632 KG","CHP","0,0083000","217,72",{"$f":"ROUNDDOWN(F99*G99,2)","v":1.8}]
[null,"COMPOSICAO","5942","PÁ CARREGADEIRA SOBRE RODAS, POTÊNCIA LÍQUIDA 128 HP, CAPACIDADE DA CAÇAMBA 1,7 A 2,8 M3, PESO OPERACIONAL 11632 KG","CHI","0,0074000","95,85",0.7]
[null,"COMPOSICAO","89883","CAMINHÃO BASCULANTE 18 M3, COM CAVALO MECÂNICO DE CAPACIDADE MÁXIMA DE TRAÇÃO COMBINADO DE 45000 KG, POTÊNCIA 330 CV, INCLUSIVE SEMIREBOQUE COM CAÇAMBA METÁLICA","CHP",5.3E-3,"348,45",1.84]
[null,"COMPOSICAO","89884","CAMINHÃO BASCULANTE 18 M3, COM CAVALO MECÂNICO DE CAPACIDADE MÁXIMA DE TRAÇÃO COMBINADO DE 45000 KG, POTÊNCIA 330 CV, INCLUSIVE SEMIREBOQUE COM CAÇAMBA METÁLICA","CHI","0,0095000","93,65",0.88]
[null,"PRODUÇÃO DA EQUIPE",null,null,1,"CUSTO ",null,{"$f":"SUM(H99:H102)","v":5.22}]
[null,"TOTAL",{"$nulls":5},{"$f":"H103/E103","v":5.22}]
[null,"BDI                %",{"$nulls":5},{"$f":"1+$M$1","v":1.2462}]
[null,"TOTAL DO SERVIÇO - R$",{"$nulls":5},{"$f":"H104*H105","v":6.5051639999999997}]
[]
[8,"CODEVASF",null,null," COMPOSIÇÃO DE PREÇO UNITÁRIO",null,null,null,{"$f":"H122","v":2.57},{"$f":"H124","v":3.2027339999999995}]
[null,"OBRA:  ",{"$f":"$C$2","v":" PAVIMENTAÇÃO ASFÁLTICA EM PMF - VIAS DIVERSAS -  RIO PARDO DE MINAS -MG"},null,null,null,"DATA: ",{"$f":"$H$2","v":" SETEMBRO DE 2023"}]
[null,"SERVIÇO:  ",{"$f":"VLOOKUP(A108,ORÇAMENTO!$A$10:$I$28,3)","v":"REGULARIZAÇÃO E COMPACTAÇÃO DE SUBLEITO"},null,"SICRO",{"$f":"VLOOKUP(A108,ORÇAMENTO!$A$10:$I$28,4)","v":100576},"UNIDADE: ",{"$f":"VLOOKUP(A108,ORÇAMENTO!$A$10:$I$28,5)","v":"M2"}]
[]
[null,"TIPO ITEM","CODIGO ITEM","DESCRIÇÃO ITEM","UNIDADE ITEM","COEFICIENTE","PRECO UNITARIO","CUSTO TOTAL"]
[null,"COMPOSICAO","5901","CAMINHÃO PIPA 10.000 L TRUCADO, PESO BRUTO TOTAL 23.000 KG, CARGA ÚTIL MÁXIMA 15.935 KG, DISTÂNCIA ENTRE EIXOS 4,8 M, POTÊNCIA 230 CV, INCLUSIVE TANQUE DE AÇO PARA TRANSPORTE DE ÁGUA","CHP","0,0010000","294,94",{"$f":"ROUNDDOWN(F113*G113,2)","v":0.28999999999999998}]
[null,"COMPOSICAO","5903","CAMINHÃO PIPA 10.000 L TRUCADO, PESO BRUTO TOTAL 23.000 KG, CARGA ÚTIL MÁXIMA 15.935 KG, DISTÂNCIA ENTRE EIXOS 4,8 M, POTÊNCIA 230 CV, INCLUSIVE TANQUE DE AÇO PARA TRANSPORTE DE ÁGUA","CHI","0,0070000","72,55",0.5]
[null,"COMPOSICAO","5932","MOTONIVELADORA POTÊNCIA BÁSICA LÍQUIDA (PRIMEIRA MARCHA) 125 HP, PESO BRUTO 13032 KG, LARGURA DA LÂMINA DE 3,7 M","CHP","0,0001000","262,71",0.02]
[null,"COMPOSICAO","5934","MOTONIVELADORA POTÊNCIA BÁSICA LÍQUIDA (PRIMEIRA MARCHA) 125 HP, PESO BRUTO 13032 KG, LARGURA DA LÂMINA DE 3,7 M","CHI","0,0080000","109,40",0.87]
[null,"COMPOSICAO","73436","ROLO COMPACTADOR VIBRATÓRIO PÉ DE CARNEIRO PARA SOLOS, POTÊNCIA 80 HP, PESO OPERACIONAL SEM/COM LASTRO 7,4 / 8,8 T, LARGURA DE TRABALHO 1,68 M","CHP","0,0020000","163,19",0.32]
[null,"COMPOSICAO","88316","SERVENTE COM ENCARGOS COMPLEMENTARES","H","0,0080000","19,76",0.15]
[null,"COMPOSICAO","93244","ROLO COMPACTADOR VIBRATÓRIO PÉ DE CARNEIRO PARA SOLOS, POTÊNCIA 80 HP, PESO OPERACIONAL SEM/COM LASTRO 7,4 / 8,8 T, LARGURA DE TRABALHO 1,68 M","CHI","0,0060000","71,18",0.42]
[{"$nulls":7},{"$f":"ROUNDDOWN(F120*G120,2)","v":0}]
[null,"PRODUÇÃO DA EQUIPE",null,null,1,"CUSTO ",null,{"$f":"SUM(H113:H120)","v":2.57}]
[null,"TOTAL",{"$nulls":5},{"$f":"H121/E121","v":2.57}]
[null,"BDI                %",{"$nulls":5},{"$f":"1+$M$1","v":1.2462}]
[null,"TOTAL DO SERVIÇO - R$",{"$nulls":5},{"$f":"H122*H123","v":3.2027339999999995}]
[]
[9,"CODEVASF",null,null," COMPOSIÇÃO DE PREÇO UNITÁRIO",null,null,null,{"$f":"H142","v":12.469999999999999},{"$f":"H144","v":15.540113999999999}]
[null,"OBRA:  ",{"$f":"$C$2","v":" PAVIMENTAÇÃO ASFÁLTICA EM PMF - VIAS DIVERSAS -  RIO PARDO DE MINAS -MG"},null,null,null,"DATA: ",{"$f":"$H$2","v":" SETEMBRO DE 2023"}]
[null,"SERVIÇO:  ",{"$f":"VLOOKUP(A126,ORÇAMENTO!$A$10:$I$28,3)","v":"EXECUÇÃO E COMPACTAÇÃO DE BASE E OU SUB BASE PARA PAVIMENTAÇÃO DE SOLOS DE COMPORTAMENTO LATERÍTICO - EXCLUSIVE SOLO, ESCAVAÇÃO, CARGA E TRANSPORTE"},null,"SINAPI",{"$f":"VLOOKUP(A126,ORÇAMENTO!$A$10:$I$28,4)","v":96388},"UNIDADE: ",{"$f":"VLOOKUP(A126,ORÇAMENTO!$A$10:$I$28,5)","v":"M3"}]
[]
[null,"TIPO ITEM","CODIGO ITEM","DESCRIÇÃO ITEM","UNIDADE ITEM","COEFICIENTE","PRECO UNITARIO","CUSTO TOTAL"]
[null,"COMPOSICAO","5684","ROLO COMPACTADOR VIBRATÓRIO DE UM CILINDRO AÇO LISO, POTÊNCIA 80 HP, PESO OPERACIONAL MÁXIMO 8,1 T, IMPACTO DINÂMICO 16,15 / 9,5 T, LARGURA DE TRABALHO 1,68 M","CHP","0,0030000","159,98",{"$f":"ROUNDDOWN(F131*G131,2)","v":0.47}]
[null,"COMPOSICAO","5685","ROLO COMPACTADOR VIBRATÓRIO DE UM CILINDRO AÇO LISO, POTÊNCIA 80 HP, PESO OPERACIONAL MÁXIMO 8,1 T, IMPACTO DINÂMICO 16,15 / 9,5 T, LARGURA DE TRABALHO 1,68 M","CHI","0,0230000","69,53",1.59]
[null,"COMPOSICAO","5901","CAMINHÃO PIPA 10.000 L TRUCADO, PESO BRUTO TOTAL 23.000 KG, CARGA ÚTIL MÁXIMA 15.935 KG, DISTÂNCIA ENTRE EIXOS 4,8 M, POTÊNCIA 230 CV, INCLUSIVE TANQUE DE AÇO PARA TRANSPORTE DE ÁGUA","CHP","0,0040000","294,94",1.17]
[null,"COMPOSICAO","5903","CAMINHÃO PIPA 10.000 L TRUCADO, PESO BRUTO TOTAL 23.000 KG, CARGA ÚTIL MÁXIMA 15.935 KG, DISTÂNCIA ENTRE EIXOS 4,8 M, POTÊNCIA 230 CV, INCLUSIVE TANQUE DE AÇO PARA TRANSPORTE DE ÁGUA","CHI","0,0220000","72,55",1.59]
[null,"COMPOSICAO","5932","MOTONIVELADORA POTÊNCIA BÁSICA LÍQUIDA (PRIMEIRA MARCHA) 125 HP, PESO BRUTO 13032 KG, LARGURA DA LÂMINA DE 3,7 M","CHP","0,0080000","262,71",2.1]
[null,"COMPOSICAO","5934","MOTONIVELADORA POTÊNCIA BÁSICA LÍQUIDA (PRIMEIRA MARCHA) 125 HP, PESO BRUTO 13032 KG, LARGURA DA LÂMINA DE 3,7 M","CHI","0,0190000","109,40",2.0699999999999998]
[null,"COMPOSICAO","88316","SERVENTE COM ENCARGOS COMPLEMENTARES","H","0,0260000","19,76",0.51]
[null,"COMPOSICAO","96463","ROLO COMPACTADOR DE PNEUS, ESTATICO, PRESSAO VARIAVEL, POTENCIA 110 HP, PESO SEM/COM LASTRO 10,8/27 T, LARGURA DE ROLAGEM 2,30 M","CHP","0,0040000","218,21",0.87]
[null,"COMPOSICAO","96464","ROLO COMPACTADOR DE PNEUS, ESTATICO, PRESSAO VARIAVEL, POTENCIA 110 HP, PESO SEM/COM LASTRO 10,8/27 T, LARGURA DE ROLAGEM 2,30 M","CHI","0,0220000","95,83",2.1]
[{"$nulls":7},0]
[null,"PRODUÇÃO DA EQUIPE",null,null,1,"CUSTO ",null,{"$f":"SUM(H131:H140)","v":12.469999999999999}]
[null,"TOTAL",{"$nulls":5},{"$f":"H141/E141","v":12.469999999999999}]
[null,"BDI                %",{"$nulls":5},{"$f":"1+$M$1","v":1.2462}]
[null,"TOTAL DO SERVIÇO - R$",{"$nulls":5},{"$f":"H142*H143","v":15.540113999999999}]
[]
[10,"CODEVASF",null,null," COMPOSIÇÃO DE PREÇO UNITÁRIO",null,null,null,{"$f":"H161","v":1.23},{"$f":"H163","v":1.532826}]
[null,"OBRA:  ",{"$f":"$C$2","v":" PAVIMENTAÇÃO ASFÁLTICA EM PMF - VIAS DIVERSAS -  RIO PARDO DE MINAS -MG"},null,null,null,"DATA: ",{"$f":"$H$2","v":" SETEMBRO DE 2023"}]
[null,"SERVIÇO:  ",{"$f":"VLOOKUP(A146,ORÇAMENTO!$A$10:$I$28,3)","v":"IMPRIMAÇÃO COM EMULSÃO ASFÁLTICA DE IMPRIMAÇÃO (EAI)"},null,"SINAPI",{"$f":"VLOOKUP(A146,ORÇAMENTO!$A$10:$I$28,4)","v":96401},"UNIDADE: ",{"$f":"VLOOKUP(A146,ORÇAMENTO!$A$10:$I$28,5)","v":"M2"}]
[]
[null,"TIPO ITEM","CODIGO ITEM","DESCRIÇÃO ITEM","UNIDADE ITEM","COEFICIENTE","PRECO UNITARIO","CUSTO TOTAL"]
[null,"COMPOSICAO",5839,"VASSOURA MECÂNICA REBOCÁVEL COM ESCOVA CILÍNDRICA, LARGURA ÚTIL DE VARRIMENTO DE 2,44 M ","CHP","0,0020000",10.3,{"$f":"ROUNDDOWN(F151*G151,2)","v":0.02}]
[null,"COMPOSICAO",5841,"VASSOURA MECÂNICA REBOCÁVEL COM ESCOVA CILÍNDRICA, LARGURA ÚTIL DE VARRIMENTO DE 2,44 M ","CHI","0,0040000",5.18,0.02]
[null,"INSUMO","ANP","EMULSÃO ASFÁLTICA PARA IMPRIMAÇÃO - EAI (FORNECIMENTO COM BDI DIFERENCIADO)","T",{"$f":"1.3/1000","v":1.2999999999999999E-3},null,0]
[null,"COMPOSICAO",83362,"ESPARGIDOR DE ASFALTO PRESSURIZADO, TANQUE 6 M3 COM ISOLAÇÃO TÉRMICA, AQUECIDO COM 2 MAÇARICOS, COM BARRA ESPARGIDORA 3,60 M, MONTADO SOBRE CAMINHÃO  TOCO, PBT 14.300 KG, POTÊNCIA 185 CV","CHP","0,0010000",256.33999999999997,0.25]
[null,"COMPOSICAO",88316,"SERVENTE COM ENCARGOS COMPLEMENTARES","H","0,0060000",19.760000000000002,0.11]
[null,"COMPOSICAO",89035,"TRATOR DE PNEUS, POTÊNCIA 85 CV, TRAÇÃO 4X4, PESO COM LASTRO DE 4.675 KG ","CHP","0,0020000",135.08000000000001,0.27]
[null,"COMPOSICAO",89036,"TRATOR DE PNEUS, POTÊNCIA 85 CV, TRAÇÃO 4X4, PESO COM LASTRO DE 4.675 KG ","CHI","0,0040000",56.48,0.22]
[null,"COMPOSICAO",91486,"ESPARGIDOR DE ASFALTO PRESSURIZADO, TANQUE 6 M3 COM ISOLAÇÃO TÉRMICA, AQUECIDO COM 2 MAÇARICOS, COM BARRA ESPARGIDORA 3,60 M, MONTADO SOBRE CAMINHÃO  TOCO, PBT 14.300 KG, POTÊNCIA 185 CV","CHI","0,0050000",68.430000000000007,0.34]
[{"$nulls":7},{"$f":"ROUNDDOWN(F159*G159,2)","v":0}]
[null,"PRODUÇÃO DA EQUIPE",null,null,1,"CUSTO ",null,{"$f":"SUM(H151:H159)","v":1.23}]
[null,"TOTAL",{"$nulls":5},{"$f":"H160/E160","v":1.23}]
[null,"BDI                %",{"$nulls":5},{"$f":"1+$M$1","v":1.2462}]
[null,"TOTAL DO SERVIÇO - R$",{"$nulls":5},{"$f":"H161*H162","v":1.532826}]
[]
[11,"CODEVASF",null,null," COMPOSIÇÃO DE PREÇO UNITÁRIO",null,null,null,{"$f":"H180","v":1.01},{"$f":"H182","v":1.2586619999999999}]
[null,"OBRA:  ",{"$f":"$C$2","v":" PAVIMENTAÇÃO ASFÁLTICA EM PMF - VIAS DIVERSAS -  RIO PARDO DE MINAS -MG"},null,null,null,"DATA: ",{"$f":"$H$2","v":" SETEMBRO DE 2023"}]
[null,"SERVIÇO:  ",{"$f":"VLOOKUP(A165,ORÇAMENTO!$A$10:$I$28,3)","v":"PINTURA DE LIGAÇÃO COM EMULSÃO ASFÁLTICA RR-1C"},null,"SINAPI",{"$f":"VLOOKUP(A165,ORÇAMENTO!$A$10:$I$28,4)","v":96402},"UNIDADE: ",{"$f":"VLOOKUP(A165,ORÇAMENTO!$A$10:$I$28,5)","v":"M2"}]
[]
[null,"TIPO ITEM","CODIGO ITEM","DESCRIÇÃO ITEM","UNIDADE ITEM","COEFICIENTE","PRECO UNITARIO","CUSTO TOTAL"]
[null,"COMPOSICAO",5839,"VASSOURA MECÂNICA REBOCÁVEL COM ESCOVA CILÍNDRICA, LARGURA ÚTIL DE VARRIMENTO DE 2,44 M","CHP","0,0020000",10.3,{"$f":"ROUNDDOWN(F170*G170,2)","v":0.02}]
[null,"COMPOSICAO",5841,"VASSOURA MECÂNICA REBOCÁVEL COM ESCOVA CILÍNDRICA, LARGURA ÚTIL DE VARRIMENTO DE 2,44 M","CHI","0,0040000",5.18,0.02]
[null,"INSUMO",41903,"EMULSAO ASFALTICA CATIONICA RR-1C PARA USO EM PAVIMENTACAO ASFALTICA (FORNECIMENTO COM BDI DIFERENCIADO)","KG","0,4500000",null,0]
[null,"COMPOSICAO",83362,"ESPARGIDOR DE ASFALTO PRESSURIZADO, TANQUE 6 M3 COM ISOLAÇÃO TÉRMICA, AQUECIDO COM 2 MAÇARICOS, COM BARRA ESPARGIDORA 3,60 M, MONTADO SOBRE CAMINHÃO  TOCO, PBT 14.300 KG, POTÊNCIA 185 CV","CHP","0,0004000",256.33999999999997,0.1]
[null,"COMPOSICAO",88316,"SERVENTE COM ENCARGOS COMPLEMENTARES","H","0,0055000",19.760000000000002,0.1]
[null,"COMPOSICAO",89035,"TRATOR DE PNEUS, POTÊNCIA 85 CV, TRAÇÃO 4X4, PESO COM LASTRO DE 4.675 KG","CHP","0,0017000",135.08000000000001,0.22]
[null,"COMPOSICAO",89036,"TRATOR DE PNEUS, POTÊNCIA 85 CV, TRAÇÃO 4X4, PESO COM LASTRO DE 4.675 KG","CHI","0,0038000",56.48,0.21]
[null,"COMPOSICAO",91486,"ESPARGIDOR DE ASFALTO PRESSURIZADO, TANQUE 6 M3 COM ISOLAÇÃO TÉRMICA, AQUECIDO COM 2 MAÇARICOS, COM BARRA ESPARGIDORA 3,60 M, MONTADO SOBRE CAMINHÃO  TOCO, PBT 14.300 KG, POTÊNCIA 185 CV","CHI","0,0051000",68.430000000000007,0.34]
[{"$nulls":7},{"$f":"ROUNDDOWN(F178*G178,2)","v":0}]
[null,"PRODUÇÃO DA EQUIPE",null,null,1,"CUSTO ",null,{"$f":"SUM(H170:H178)","v":1.01}]
[null,"TOTAL",{"$nulls":5},{"$f":"H179/E179","v":1.01}]
[null,"BDI                %",{"$nulls":5},{"$f":"1+$M$1","v":1.2462}]
[null,"TOTAL DO SERVIÇO - R$",{"$nulls":5},{"$f":"H180*H181","v":1.2586619999999999}]
[]
[12,"CODEVASF",null,null," COMPOSIÇÃO DE PREÇO UNITÁRIO",null,null,null,{"$f":"H202","v":416.59},{"$f":"H204","v":519.15445799999998}]
[null,"OBRA:  ",{"$f":"$C$2","v":" PAVIMENTAÇÃO ASFÁLTICA EM PMF - VIAS DIVERSAS -  RIO PARDO DE MINAS -MG"},null,null,null,"DATA: ",{"$f":"$H$2","v":" SETEMBRO DE 2023"}]
[null,"SERVIÇO:  ",{"$f":"VLOOKUP(A184,ORÇAMENTO!$A$10:$I$28,3)","v":"EXECUÇÃO DE PAVIMENTO COM APLICAÇÃO DE PRÉ-MISTURADO A FRIO, CAMADA DE ROLAMENTO - EXCLUSIVE TRANSPORTE"},null,"SINAPI",{"$f":"VLOOKUP(A184,ORÇAMENTO!$A$10:$I$28,4)","v":100624},"UNIDADE: ",{"$f":"VLOOKUP(A184,ORÇAMENTO!$A$10:$I$28,5)","v":"M3"}]
[]
[null,"TIPO ITEM","CODIGO ITEM","DESCRIÇÃO ITEM","UNIDADE ITEM","COEFICIENTE","PRECO UNITARIO","CUSTO TOTAL"]
[null,"COMPOSICAO","5835","VIBROACABADORA DE ASFALTO SOBRE ESTEIRAS, LARGURA DE PAVIMENTAÇÃO 1,90 M A 5,30 M, POTÊNCIA 105 HP CAPACIDADE 450 T/H","CHP","0,0280000",396.75,{"$f":"ROUNDDOWN(F189*G189,2)","v":11.1}]
[null,"COMPOSICAO","5837","VIBROACABADORA DE ASFALTO SOBRE ESTEIRAS, LARGURA DE PAVIMENTAÇÃO 1,90 M A 5,30 M, POTÊNCIA 105 HP CAPACIDADE 450 T/H ","CHI","0,0580000",165.12,9.57]
[null,"COMPOSICAO","88314","RASTELEIRO COM ENCARGOS COMPLEMENTARES","H","0,6860000",26.52,18.190000000000001]
[null,"COMPOSICAO",91386,"CAMINHÃO BASCULANTE 10 M3, TRUCADO CABINE SIMPLES, PESO BRUTO TOTAL 23.000 KG, CARGA ÚTIL MÁXIMA 15.935 KG, DISTÂNCIA ENTRE EIXOS 4,80 M, POTÊNCIA 230 CV INCLUSIVE CAÇAMBA METÁLICA","CHP","0,0280000",252.13,7.05]
[null,"COMPOSICAO",95631,"ROLO COMPACTADOR VIBRATORIO TANDEM, ACO LISO, POTENCIA 125 HP, PESO SEM/COM LASTRO 10,20/11,65 T, LARGURA DE TRABALHO 1,73 M","CHP","0,0460000",228.02,10.48]
[null,"COMPOSICAO","95632","ROLO COMPACTADOR VIBRATORIO TANDEM, ACO LISO, POTENCIA 125 HP, PESO SEM/COM LASTRO 10,20/11,65 T, LARGURA DE TRABALHO 1,73 M","CHI","0,0400000",89.32,3.57]
[null,"COMPOSICAO",96155,"TRATOR DE PNEUS COM POTÊNCIA DE 85 CV, TRAÇÃO 4X4, COM VASSOURA MECÂNICA ACOPLADA","CHI","0,0520000",61.42,3.19]
[null,"COMPOSICAO",96157,"TRATOR DE PNEUS COM POTÊNCIA DE 85 CV, TRAÇÃO 4X4, COM VASSOURA MECÂNICA ACOPLADA","CHP","0,0340000",144.29,4.9000000000000004]
[null,"COMPOSICAO","96463","ROLO COMPACTADOR DE PNEUS, ESTATICO, PRESSAO VARIAVEL, POTENCIA 110 HP, PESO SEM/COM LASTRO 10,8/27 T, LARGURA DE ROLAGEM 2,30 M ","CHP","0,0260000",218.21,5.67]
[null,"COMPOSICAO","96464","ROLO COMPACTADOR DE PNEUS, ESTATICO, PRESSAO VARIAVEL, POTENCIA 110 HP, PESO SEM/COM LASTRO 10,8/27 T, LARGURA DE ROLAGEM 2,30 M ","CHI","0,0600000",95.83,5.74]
[null,"COMPOSICAO","101027","USINAGEM DE PRÉ MISTURADO A FRIO, PARA CAMADA DE ROLAMENTO, PADRÃO DNIT FAIXA C","T","2,4480000",{"$f":"H227","v":137.72},337.13]
[{"$nulls":7},0]
[null,"PRODUÇÃO DA EQUIPE",null,null,1,"CUSTO ",null,{"$f":"SUM(H189:H200)","v":416.59}]
[null,"TOTAL",{"$nulls":5},{"$f":"H201/E201","v":416.59}]
[null,"BDI                %",{"$nulls":5},{"$f":"1+$M$1","v":1.2462}]
[null,"TOTAL DO SERVIÇO - R$",{"$nulls":5},{"$f":"H202*H203","v":519.15445799999998}]
[]
[null,"CODEVASF",null,null," COMPOSIÇÃO DE PREÇO UNITÁRIO - AUXILIAR"]
[null,"OBRA:  ",{"$f":"$C$2","v":" PAVIMENTAÇÃO ASFÁLTICA EM PMF - VIAS DIVERSAS -  RIO PARDO DE MINAS -MG"},null,null,null,"DATA: ",{"$f":"$H$2","v":" SETEMBRO DE 2023"}]
[null,"SERVIÇO:  ",{"$f":"D199","v":"USINAGEM DE PRÉ MISTURADO A FRIO, PARA CAMADA DE ROLAMENTO, PADRÃO DNIT FAIXA C"},null,"SINAPI",{"$f":"C199","v":"101027"},"UNIDADE: ",{"$f":"E199","v":"T"}]
[]
[null,"TIPO ITEM","CODIGO ITEM","DESCRIÇÃO ITEM","UNIDADE ITEM","COEFICIENTE","PRECO UNITARIO","CUSTO TOTAL"]
[null,"INSUMO","370","AREIA MEDIA - POSTO JAZIDA/FORNECEDOR (RETIRADO NA JAZIDA, SEM TRANSPORTE)","M3","0,1600000",97.5,{"$f":"ROUNDDOWN(F211*G211,2)","v":15.6}]
[null,"INSUMO","1106","CAL HIDRATADA CH-I PARA ARGAMASSAS","KG","36,9275000",1.04,38.4]
[null,"INSUMO","4720","PEDRA BRITADA N. 0, OU PEDRISCO (4,8 A 9,5 MM) POSTO PEDREIRA/FORNECEDOR, SEM FRETE","M3","0,2410000",135.82,32.729999999999997]
[null,"INSUMO","4721","PEDRA BRITADA N. 1 (9,5 a 19 MM) POSTO PEDREIRA/FORNECEDOR, SEM FRETE","M3","0,1897000",117.64,22.31]
[null,"COMPOSICAO",5940,"PÁ CARREGADEIRA SOBRE RODAS, POTÊNCIA LÍQUIDA 128 HP, CAPACIDADE DA CAÇAMBA 1,7 A 2,8 M3, PESO OPERACIONAL 11632 KG","CHP","0,0048000",217.72,1.04]
[null,"COMPOSICAO","5942","PÁ CARREGADEIRA SOBRE RODAS, POTÊNCIA LÍQUIDA 128 HP, CAPACIDADE DA CAÇAMBA 1,7 A 2,8 M3, PESO OPERACIONAL 11632 KG","CHI","0,0253000",95.85,2.42]
[null,"COMPOSICAO",7030,"TANQUE DE ASFALTO ESTACIONÁRIO COM SERPENTINA, CAPACIDADE 30.000 L","CHP","0,0603000",240.88,14.52]
[null,"INSUMO","41904","EMULSAO ASFALTICA CATIONICA RL-1C PARA USO EM PAVIMENTACAO ASFALTICA (FORNECIMENTO COM BDI DIFERENCIADO)","T","0,0769000",null,0,null,{"$f":"F218*2.448","v":0.18825119999999998}]
[null,"COMPOSICAO",88316,"SERVENTE COM ENCARGOS COMPLEMENTARES","H","0,0603000",19.760000000000002,1.19]
[null,"COMPOSICAO",90776,"ENCARREGADO GERAL COM ENCARGOS COMPLEMENTARES","H","0,0301000",57.73,1.73]
[null,"COMPOSICAO","93421","GRUPO GERADOR REBOCÁVEL, POTÊNCIA 66 KVA, MOTOR A DIESEL ","CHP","0,0234000",68.290000000000006,1.59]
[null,"COMPOSICAO","93422","GRUPO GERADOR REBOCÁVEL, POTÊNCIA 66 KVA, MOTOR A DIESEL ","CHI","0,0068000",5.01,0.03]
[null,"COMPOSICAO","93439","USINA DE ASFALTO À FRIO, CAPACIDADE DE 40 A 60 TON/HORA, ELÉTRICA POTÊNCIA 30 CV ","CHP","0,0234000",228.6,5.34]
[null,"COMPOSICAO","93440","USINA DE ASFALTO À FRIO, CAPACIDADE DE 40 A 60 TON/HORA, ELÉTRICA POTÊNCIA 30 CV","CHI","0,0068000",120.93,0.82]
[{"$nulls":7},0]
[null,"PRODUÇÃO DA EQUIPE",null,null,1,"CUSTO ",null,{"$f":"SUM(H211:H225)","v":137.72}]
[null,"TOTAL",{"$nulls":5},{"$f":"H226/E226","v":137.72}]
[]
[13,"CODEVASF",null,null," COMPOSIÇÃO DE PREÇO UNITÁRIO",null,null,null,{"$f":"H238","v":1.94},{"$f":"H240","v":2.4176279999999997}]
[null,"OBRA:  ",{"$f":"$C$2","v":" PAVIMENTAÇÃO ASFÁLTICA EM PMF - VIAS DIVERSAS -  RIO PARDO DE MINAS -MG"},null,null,null,"DATA: ",{"$f":"$H$2","v":" SETEMBRO DE 2023"}]
[null,"SERVIÇO:  ",{"$f":"VLOOKUP(A229,ORÇAMENTO!$A$10:$I$28,3)","v":"TRANSPORTE COM CAMINHÃO BASCULANTE, EM VIA URBANA EM REVESTIMENTO PRIMÁRIO"},null,"SINAPI",{"$f":"VLOOKUP(A229,ORÇAMENTO!$A$10:$I$28,4)","v":95426},"UNIDADE: ",{"$f":"VLOOKUP(A229,ORÇAMENTO!$A$10:$I$28,5)","v":"M3XKM"}]
[]
[null,"TIPO ITEM","CODIGO ITEM","DESCRIÇÃO ITEM","UNIDADE ITEM","COEFICIENTE","PRECO UNITARIO","CUSTO TOTAL"]
[null,"COMPOSICAO","89883","CAMINHÃO BASCULANTE 18 M3, COM CAVALO MECÂNICO DE CAPACIDADE MÁXIMA DE TRAÇÃO COMBINADO DE 45000 KG, POTÊNCIA 330 CV, INCLUSIVE SEMIREBOQUE COM CAÇAMBA METÁLICA","CHP","0,0050000","348,45",{"$f":"ROUNDDOWN(F234*G234,2)","v":1.74}]
[null,"COMPOSICAO","89884","CAMINHÃO BASCULANTE 18 M3, COM CAVALO MECÂNICO DE CAPACIDADE MÁXIMA DE TRAÇÃO COMBINADO DE 45000 KG, POTÊNCIA 330 CV, INCLUSIVE SEMIREBOQUE COM CAÇAMBA METÁLICA","CHI","0,0022000","93,65",0.2]
[{"$nulls":7},0]
[null,"PRODUÇÃO DA EQUIPE",null,null,1,"CUSTO ",null,{"$f":"SUM(H234:H236)","v":1.94}]
[null,"TOTAL",{"$nulls":5},{"$f":"H237/E237","v":1.94}]
[null,"BDI                %",{"$nulls":5},{"$f":"1+$M$1","v":1.2462}]
[null,"TOTAL DO SERVIÇO - R$",{"$nulls":5},{"$f":"H238*H239","v":2.4176279999999997}]
[]
[14,"CODEVASF",null,null," COMPOSIÇÃO DE PREÇO UNITÁRIO",null,null,null,{"$f":"H250","v":0.73},{"$f":"H252","v":0.90972599999999992}]
[null,"OBRA:  ",{"$f":"$C$2","v":" PAVIMENTAÇÃO ASFÁLTICA EM PMF - VIAS DIVERSAS -  RIO PARDO DE MINAS -MG"},null,null,null,"DATA: ",{"$f":"$H$2","v":" SETEMBRO DE 2023"}]
[null,"SERVIÇO:  ",{"$f":"VLOOKUP(A242,ORÇAMENTO!$A$10:$I$41,3,0)","v":"TRANSPORTE COM CAMINHÃO BASCULANTE, EM VIA URBANA PAVIMENTADA"},null,"SINAPI",{"$f":"VLOOKUP(A242,ORÇAMENTO!$A$10:$I$28,4,0)","v":95427},"UNIDADE: ",{"$f":"VLOOKUP(A242,ORÇAMENTO!$A$10:$I$28,5,0)","v":"M3XKM"}]
[]
[null,"TIPO ITEM","CODIGO ITEM","DESCRIÇÃO ITEM","UNIDADE ITEM","COEFICIENTE","PRECO UNITARIO","CUSTO TOTAL"]
[null,"COMPOSICAO","89883","CAMINHÃO BASCULANTE 18 M3, COM CAVALO MECÂNICO DE CAPACIDADE MÁXIMA DE TRAÇÃO COMBINADO DE 45000 KG, POTÊNCIA 330 CV, INCLUSIVE SEMIREBOQUE COM CAÇAMBA METÁLICA","CHP","0,0019000","348,45",{"$f":"ROUNDDOWN(F247*G247,2)","v":0.66}]
[null,"COMPOSICAO","89884","CAMINHÃO BASCULANTE 18 M3, COM CAVALO MECÂNICO DE CAPACIDADE MÁXIMA DE TRAÇÃO COMBINADO DE 45000 KG, POTÊNCIA 330 CV, INCLUSIVE SEMIREBOQUE COM CAÇAMBA METÁLICA","CHI","0,0008000","93,65",7.0000000000000007E-2]
[null,"PRODUÇÃO DA EQUIPE",null,null,1,"CUSTO ",null,{"$f":"SUM(H247:H248)","v":0.73}]
[null,"TOTAL",{"$nulls":5},{"$f":"H249/E249","v":0.73}]
[null,"BDI                %",{"$nulls":5},{"$f":"1+$M$1","v":1.2462}]
[null,"TOTAL DO SERVIÇO - R$",{"$nulls":5},{"$f":"H250*H251","v":0.90972599999999992}]
[]
[15,"CODEVASF",null,null," COMPOSIÇÃO DE PREÇO UNITÁRIO",null,null,null,{"$f":"H268","v":57.319999999999986},{"$f":"H270","v":71.432183999999978}]
[null,"OBRA:  ",{"$f":"$C$2","v":" PAVIMENTAÇÃO ASFÁLTICA EM PMF - VIAS DIVERSAS -  RIO PARDO DE MINAS -MG"},null,null,null,"DATA: ",{"$f":"$H$2","v":" SETEMBRO DE 2023"}]
[null,"SERVIÇO:  ",{"$f":"VLOOKUP(A254,ORÇAMENTO!$A$10:$I$28,3,0)","v":"GUIA (MEIO-FIO) E SARJETA CONJUGADOS DE CONCRETO, MOLDADA  IN LOCO  EM TRECHO RETO COM EXTRUSORA, 45 CM BASE (15 CM BASE DA GUIA + SARJETA (30 X 0,07))X 22 CM ALTURA"},null,"SINAPI",{"$f":"VLOOKUP(A254,ORÇAMENTO!$A$10:$I$28,4,0)","v":94267},"UNIDADE: ",{"$f":"VLOOKUP(A254,ORÇAMENTO!$A$10:$I$28,5,0)","v":"M"}]
[]
[null,"TIPO ITEM","CODIGO ITEM","DESCRIÇÃO ITEM","UNIDADE ITEM","COEFICIENTE","PRECO UNITARIO","CUSTO TOTAL"]
[null,"INSUMO","370","AREIA MEDIA - POSTO JAZIDA/FORNECEDOR (RETIRADO NA JAZIDA, SEM TRANSPORTE)","M3","0,0150000","97,50",{"$f":"ROUNDDOWN(F259*G259,2)","v":1.46}]
[null,"INSUMO","34492","CONCRETO USINADO BOMBEAVEL, CLASSE DE RESISTENCIA C20, COM BRITA 0 E 1","M3","0,0630000","550,00",34.65]
[null,"COMPOSICAO","88243","AJUDANTE ESPECIALIZADO COM ENCARGOS COMPLEMENTARES","H","0,1090000","21,76",2.37]
[null,"COMPOSICAO","88309","PEDREIRO COM ENCARGOS COMPLEMENTARES","H","0,2440000","27,45",6.69]
[null,"COMPOSICAO","88316","SERVENTE COM ENCARGOS COMPLEMENTARES","H","0,4870000","19,76",9.6199999999999992]
[null,"COMPOSICAO","88631","ARGAMASSA TRAÇO 1:4 (EM VOLUME DE CIMENTO E AREIA MÉDIA ÚMIDA), PREPARO MANUAL","M3","0,0030000","575,87",1.72]
[null,"COMPOSICAO","92960","MÁQUINA EXTRUSORA DE CONCRETO PARA GUIAS E SARJETAS, MOTOR A DIESEL, POTÊNCIA 14 CV","CHP","0,0180000","18,46",0.33]
[null,"COMPOSICAO","92961","MÁQUINA EXTRUSORA DE CONCRETO PARA GUIAS E SARJETAS, MOTOR A DIESEL, POTÊNCIA 14 CV","CHI","0,0910000","5,38",0.48]
[null,"PRODUÇÃO DA EQUIPE",null,null,1,"CUSTO ",null,{"$f":"SUM(H259:H266)","v":57.319999999999986}]
[null,"TOTAL",{"$nulls":5},{"$f":"H267/E267","v":57.319999999999986}]
[null,"BDI                %",{"$nulls":5},{"$f":"1+$M$1","v":1.2462}]
[null,"TOTAL DO SERVIÇO - R$",{"$nulls":5},{"$f":"H268*H269","v":71.432183999999978}]
[]
[16,"CODEVASF",null,null," COMPOSIÇÃO DE PREÇO UNITÁRIO",null,null,null,{"$f":"H285","v":482.58000000000004},{"$f":"H287","v":601.39119600000004}]
[null,"OBRA:  ",{"$f":"$C$2","v":" PAVIMENTAÇÃO ASFÁLTICA EM PMF - VIAS DIVERSAS -  RIO PARDO DE MINAS -MG"},null,null,null,"DATA: ",{"$f":"$H$2","v":" SETEMBRO DE 2023"}]
[null,"SERVIÇO:  ",{"$f":"VLOOKUP(A272,ORÇAMENTO!$A$10:$I$40,3,0)","v":"FORNECIMENTO E INSTALAÇÃO DE PLACA DE SINALIZAÇÃO VIÁRIA - REGULAMENTAÇÃO (PARE)"},null,"SINAPI",{"$f":"VLOOKUP(A272,ORÇAMENTO!$A$10:$I$40,4,0)","v":"CPU.4"},"UNIDADE: ",{"$f":"VLOOKUP(A272,ORÇAMENTO!$A$10:$I$40,5,0)","v":"UNID"}]
[]
[null,"TIPO ITEM","CODIGO ITEM","DESCRIÇÃO ITEM","UNIDADE ITEM","COEFICIENTE","PRECO UNITARIO","CUSTO TOTAL"]
[null,"COMPOSICAO",94962,"CONCRETO MAGRO PARA LASTRO, TRAÇO 1:4,5:4,5 (EM MASSA SECA DE CIMENTO/ AREIA/ BRITA 1)","M3",2.4E-2,397.46,{"$f":"ROUNDDOWN(F277*G277,2)","v":9.5299999999999994}]
[null,"COMPOSICAO",93358,"ESCAVAÇÃO MANUAL DE VALA COM PROFUNDIDADE MENOR OU IGUAL A 1,30 M","M3",2.4E-2,78.17,1.87]
[null,"COMPOSICAO",88309,"PEDREIRO COM ENCARGOS COMPLEMENTARES","H",0.2,27.45,5.49]
[null,"COMPOSICAO",88316,"SERVENTE COM ENCARGOS COMPLEMENTARES","H",1,19.760000000000002,19.760000000000002]
[null,"COMPOSICAO",103670,"LANÇAMENTO COM USO DE BALDES, ADENSAMENTO E ACABAMENTO DE CONCRETO EM ESTRUTURAS","M3",2.4E-2,281.66000000000003,6.75]
[null,"INSUMO",34723,"PLACA DE SINALIZACAO EM CHAPA DE ACO NUM 16 COM PINTURA REFLETIVA ","M2",{"$f":"4*0.3*0.25","v":0.3},577.5,173.25]
[null,"INSUMO",21013,"TUBO AÇO GALVANIZADO COM COSTURA, CLASSE LEVE, DN 50 MM ( 2\")E = 3,00 MM, *4,40* KG/M","M",3.5,75.98,265.93]
[null,"PRODUÇÃO DA EQUIPE",null,null,1,"CUSTO ",null,{"$f":"SUM(H277:H283)","v":482.58000000000004}]
[null,"TOTAL",{"$nulls":5},{"$f":"H284/E284","v":482.58000000000004}]
[null,"BDI                %",{"$nulls":5},{"$f":"1+$M$1","v":1.2462}]
[null,"TOTAL DO SERVIÇO - R$",{"$nulls":5},{"$f":"H285*H286","v":601.39119600000004}]
[]
[16.5,"CODEVASF",null,null," COMPOSIÇÃO DE PREÇO UNITÁRIO",null,null,null,{"$f":"H302","v":415.85},{"$f":"H304","v":518.23226999999997}]
[null,"OBRA:  ",{"$f":"$C$2","v":" PAVIMENTAÇÃO ASFÁLTICA EM PMF - VIAS DIVERSAS -  RIO PARDO DE MINAS -MG"},null,null,null,"DATA: ",{"$f":"$H$2","v":" SETEMBRO DE 2023"}]
[null,"SERVIÇO:  ",{"$f":"VLOOKUP(A289,ORÇAMENTO!$A$10:$I$40,3,0)","v":"FORNECIMENTO E INSTALAÇÃO DE PLACA DE SINALIZAÇÃO VIÁRIA - REGULAMENTAÇÃO (FAIXA DE PEDESTRE E OUTROS) - CONFORME PROJETO"},null,"SINAPI",{"$f":"VLOOKUP(A289,ORÇAMENTO!$A$10:$I$40,4,0)","v":"CPU.5"},"UNIDADE: ",{"$f":"VLOOKUP(A289,ORÇAMENTO!$A$10:$I$40,5,0)","v":"UNID"}]
[]
[null,"TIPO ITEM","CODIGO ITEM","DESCRIÇÃO ITEM","UNIDADE ITEM","COEFICIENTE","PRECO UNITARIO","CUSTO TOTAL"]
[null,"COMPOSICAO",94962,"CONCRETO MAGRO PARA LASTRO, TRAÇO 1:4,5:4,5 (EM MASSA SECA DE CIMENTO/ AREIA / BRITA 1)","M3",2.4E-2,402.82,{"$f":"ROUNDDOWN(F294*G294,2)","v":9.66}]
[null,"COMPOSICAO",93358,"ESCAVAÇÃO MANUAL DE VALA COM PROFUNDIDADE MENOR OU IGUAL A 1,30 M","M3",2.4E-2,78.17,1.87]
[null,"COMPOSICAO",88309,"PEDREIRO COM ENCARGOS COMPLEMENTARES","H",0.2,27.45,5.49]
[null,"COMPOSICAO",88316,"SERVENTE COM ENCARGOS COMPLEMENTARES","H",1,19.760000000000002,19.760000000000002]
[null,"COMPOSICAO",103670,"LANÇAMENTO COM USO DE BALDES, ADENSAMENTO E ACABAMENTO DE CONCRETO EM ESTRUTURAS","M3",2.4E-2,281.77999999999997,6.76]
[null,"INSUMO",34723,"PLACA DE SINALIZACAO EM CHAPA DE ACO NUM 16 COM PINTURA REFLETIVA (CIRCULAR - D=50CM) ","M2",{"$f":"0.5*0.5","v":0.25},577.5,144.37]
[null,"INSUMO",21013,"TUBO AÇO GALVANIZADO COM COSTURA, CLASSE LEVE, DN 50 MM ( 2\")E = 3,00 MM, 4,40 KG/M","M",3,75.98,227.94]
[null,"PRODUÇÃO DA EQUIPE",null,null,1,"CUSTO ",null,{"$f":"SUM(H294:H300)","v":415.85}]
[null,"TOTAL",{"$nulls":5},{"$f":"H301/E301","v":415.85}]
[null,"BDI                %",{"$nulls":5},{"$f":"1+$M$1","v":1.2462}]
[null,"TOTAL DO SERVIÇO - R$",{"$nulls":5},{"$f":"H302*H303","v":518.23226999999997}]
[]
[17,"CODEVASF",null,null," COMPOSIÇÃO DE PREÇO UNITÁRIO",null,null,null,{"$f":"H320","v":5.84},{"$f":"H322","v":7.28}]
[null,"OBRA:  ",{"$f":"$C$2","v":" PAVIMENTAÇÃO ASFÁLTICA EM PMF - VIAS DIVERSAS -  RIO PARDO DE MINAS -MG"},null,null,null,"DATA: ",{"$f":"$H$2","v":" SETEMBRO DE 2023"}]
[null,"SERVIÇO:  ",{"$f":"VLOOKUP(A306,ORÇAMENTO!$A$10:$I$40,3,0)","v":"PINTURA DE EIXO VIÁRIO SOBRE ASFALTO COM TINTA RETRORREFLETIVA A BASE DE RESINA ACRÍLICA COM MICROESFERAS DE VIDRO, APLICAÇÃO MECÂNICA COM DEMARCADORA AUTOPROPELIDA - ESPESSURA DE 0,10 MM"},null,"SINAPI",{"$f":"VLOOKUP(A306,ORÇAMENTO!$A$10:$I$40,4,0)","v":102512},"UNIDADE: ",{"$f":"VLOOKUP(A306,ORÇAMENTO!$A$10:$I$40,5,0)","v":"M"}]
[]
[null,"TIPO ITEM","CODIGO ITEM","DESCRIÇÃO ITEM","UNIDADE ITEM","COEFICIENTE","PRECO UNITARIO","CUSTO TOTAL"]
[null,"INSUMO","5318","DILUENTE AGUARRAS","L","0,0020000","25,91",{"$f":"ROUNDDOWN(F311*G311,2)","v":0.05}]
[null,"INSUMO","7343","TINTA ACRILICA A BASE DE SOLVENTE, PARA SINALIZACAO HORIZONTAL VIARIA (NBR 11862)","L","0,0430000","17,82",0.76]
[null,"INSUMO","44477","MICROESFERAS DE VIDRO PARA SINALIZACAO HORIZONTAL VIARIA, TIPO II-A (DROP-ON)","KG","0,0250000","10,74",0.26]
[null,"INSUMO","44478","MICROESFERAS DE VIDRO PARA SINALIZACAO HORIZONTAL VIARIA, TIPO I-B (PREMIX)","KG","0,0110000","10,74",0.11]
[null,"COMPOSICAO","88310","PINTOR COM ENCARGOS COMPLEMENTARES","H","0,0340000","28,66",0.97]
[null,"COMPOSICAO","88316","SERVENTE COM ENCARGOS COMPLEMENTARES","H","0,0140000","19,76",0.27]
[null,"COMPOSICAO","95133","MÁQUINA DEMARCADORA DE FAIXA DE TRÁFEGO À FRIO, AUTOPROPELIDA, POTÊNCIA 38 HP","CHP","0,0003000","186,11",0.05]
[null,"COMPOSICAO","96159","MÁQUINA DEMARCADORA DE FAIXA DE TRÁFEGO À FRIO, AUTOPROPELIDA, POTÊNCIA 38 HP","CHI","0,0334000","100,90",3.37]
[null,"PRODUÇÃO DA EQUIPE",null,null,1,"CUSTO ",null,{"$f":"SUM(H311:H318)","v":5.84}]
[null,"TOTAL",{"$nulls":5},{"$f":"H319/E319","v":5.84}]
[null,"BDI                %",{"$nulls":5},{"$f":"1+$M$1","v":1.2462}]
[null,"TOTAL DO SERVIÇO - R$",{"$nulls":5},{"$f":"ROUND(H320*H321,2)","v":7.28}]
[]
[17.100000000000001,"CODEVASF",null,null," COMPOSIÇÃO DE PREÇO UNITÁRIO",null,null,null,{"$f":"H337","v":25.52},{"$f":"H339","v":31.8}]
[null,"OBRA:  ",{"$f":"$C$2","v":" PAVIMENTAÇÃO ASFÁLTICA EM PMF - VIAS DIVERSAS -  RIO PARDO DE MINAS -MG"},null,null,null,"DATA: ",{"$f":"$H$2","v":" SETEMBRO DE 2023"}]
[null,"SERVIÇO:  ",{"$f":"VLOOKUP(A324,ORÇAMENTO!$A$10:$I$40,3,0)","v":"PINTURA DE FAIXA DE PEDESTRE OU ZEBRADA TINTA RETRORREFLETIVA A BASE DE RESINA ACRÍLICA COM MICROESFERAS DE VIDRO, E = 30 CM, APLICAÇÃO MANUAL"},null,"SINAPI",{"$f":"VLOOKUP(A324,ORÇAMENTO!$A$10:$I$40,4,0)","v":102509},"UNIDADE: ",{"$f":"VLOOKUP(A324,ORÇAMENTO!$A$10:$I$40,5,0)","v":"M2"}]
[]
[null,"TIPO ITEM","CODIGO ITEM","DESCRIÇÃO ITEM","UNIDADE ITEM","COEFICIENTE","PRECO UNITARIO","CUSTO TOTAL"]
[null,"INSUMO","5318","DILUENTE AGUARRAS","L","0,0210000",25.91,{"$f":"ROUNDDOWN(F329*G329,2)","v":0.54}]
[null,"INSUMO","7343","TINTA ACRILICA A BASE DE SOLVENTE, PARA SINALIZACAO HORIZONTAL VIARIA (NBR 11862)","L","0,4270000",17.82,7.6]
[null,"INSUMO","12815","FITA CREPE ROLO DE 25 MM X 50 M","UN","0,0120000","9,31",0.11]
[null,"INSUMO","44477","MICROESFERAS DE VIDRO PARA SINALIZACAO HORIZONTAL VIARIA, TIPO II-A (DROP-ON) - NBR  16184","KG","0,2500000","10,74",2.68]
[null,"INSUMO","44478","MICROESFERAS DE VIDRO PARA SINALIZACAO HORIZONTAL VIARIA, TIPO I-B (PREMIX) - NBR  16184","KG","0,1100000","10,74",1.18]
[null,"COMPOSICAO","88310","PINTOR COM ENCARGOS COMPLEMENTARES","H","0,3640000","28,66",10.43]
[null,"COMPOSICAO","88316","SERVENTE COM ENCARGOS COMPLEMENTARES","H","0,1510000","19,76",2.98]
[null,"PRODUÇÃO DA EQUIPE",null,null,1,"CUSTO ",null,{"$f":"SUM(H329:H335)","v":25.52}]
[null,"TOTAL",{"$nulls":5},{"$f":"H336/E336","v":25.52}]
[null,"BDI                %",{"$nulls":5},{"$f":"1+$M$1","v":1.2462}]
[null,"TOTAL DO SERVIÇO - R$",{"$nulls":5},{"$f":"ROUND(H337*H338,2)","v":31.8}]
[]
[17.2,"CODEVASF",null,null," COMPOSIÇÃO DE PREÇO UNITÁRIO",null,null,null,{"$f":"H354","v":375.29},{"$f":"H356","v":467.69}]
[null,"OBRA:  ",{"$f":"$C$2","v":" PAVIMENTAÇÃO ASFÁLTICA EM PMF - VIAS DIVERSAS -  RIO PARDO DE MINAS -MG"},null,null,null,"DATA: ",{"$f":"$H$2","v":" SETEMBRO DE 2023"}]
[null,"SERVIÇO:  ",{"$f":"VLOOKUP(A341,ORÇAMENTO!$A$10:$I$40,3,0)","v":"FORNECIMENTO E INSTALAÇÃO DE PLACA DE AÇO PARA IDENTIFICACAO DE RUA, *45 CM X 20* CM, INCLUSIVE SUPORTE EM TUBO DE AÇO GALVANIZADO (02 PLACAS POR SUPORTE)                      "},null,"SINAPI",{"$f":"VLOOKUP(A341,ORÇAMENTO!$A$10:$I$40,4,0)","v":"CPU.6"},"UNIDADE: ",{"$f":"VLOOKUP(A341,ORÇAMENTO!$A$10:$I$40,5,0)","v":"UNID."}]
[]
[null,"TIPO ITEM","CODIGO ITEM","DESCRIÇÃO ITEM","UNIDADE ITEM","COEFICIENTE","PRECO UNITARIO","CUSTO TOTAL"]
[null,"COMPOSICAO",94962,"CONCRETO MAGRO PARA LASTRO, TRAÇO 1:4,5:4,5 (EM MASSA SECA DE CIMENTO/ AREIA/ BRITA 1)","M3",2.4E-2,397.46,{"$f":"ROUNDDOWN(F346*G346,2)","v":9.5299999999999994}]
[null,"COMPOSICAO",93358,"ESCAVAÇÃO MANUAL DE VALA COM PROFUNDIDADE MENOR OU IGUAL A 1,30 M","M3",2.4E-2,78.17,1.87]
[null,"COMPOSICAO",88309,"PEDREIRO COM ENCARGOS COMPLEMENTARES","H",0.2,27.45,5.49]
[null,"COMPOSICAO",88316,"SERVENTE COM ENCARGOS COMPLEMENTARES","H",1,19.760000000000002,19.760000000000002]
[null,"COMPOSICAO",103670,"LANÇAMENTO COM USO DE BALDES, ADENSAMENTO E ACABAMENTO DE CONCRETO EM ESTRUTURAS","M3",2.4E-2,281.66000000000003,6.75]
[null,"INSUMO",34723,"PLACA DE SINALIZACAO EM CHAPA DE ACO NUM 16 COM PINTURA REFLETIVA (CIRCULAR - D=50CM) ","M2",{"$f":"0.45*0.2*2","v":0.18000000000000002},577.5,103.95]
[null,"INSUMO",21012,"TUBO AÇO GALVANIZADO COM COSTURA, CLASSE LEVE, DN 40 MM (1.1/2\")E = 3,00 MM, *3,48* KG/M","M",3,75.98,227.94]
[null,"PRODUÇÃO DA EQUIPE",null,null,1,"CUSTO ",null,{"$f":"SUM(H346:H352)","v":375.29}]
[null,"TOTAL",{"$nulls":5},{"$f":"H353/E353","v":375.29}]
[null,"BDI                %",{"$nulls":5},{"$f":"1+$M$1","v":1.2462}]
[null,"TOTAL DO SERVIÇO - R$",{"$nulls":5},{"$f":"ROUND(H354*H355,2)","v":467.69}]
[]
[18,"CODEVASF",null,null," COMPOSIÇÃO DE PREÇO UNITÁRIO",null,null,null,{"$f":"H366","v":0.52},{"$f":"H368","v":0.59799999999999998}]
[null,"OBRA:  ",{"$f":"$C$2","v":" PAVIMENTAÇÃO ASFÁLTICA EM PMF - VIAS DIVERSAS -  RIO PARDO DE MINAS -MG"},null,null,null,"DATA: ",{"$f":"$H$2","v":" SETEMBRO DE 2023"}]
[null,"SERVIÇO:  ",{"$f":"VLOOKUP(A358,ORÇAMENTO!A10:I41,3)","v":"TRANSPORTE COM CAMINHÃO TANQUE DE TRANSPORTE DE MATERIAL ASFÁLTICO DE 30000 L, EM VIA URBANA PAVIMENTADA"},null,"SINAPI",{"$f":"VLOOKUP(A358,ORÇAMENTO!$A$10:$I$41,4)","v":102331},"UNIDADE: ",{"$f":"VLOOKUP(A358,ORÇAMENTO!$A$10:$I$41,5)","v":"TXKM"}]
[]
[null,"TIPO ITEM","CODIGO ITEM","DESCRIÇÃO ITEM","UNIDADE ITEM","COEFICIENTE","PRECO UNITARIO","CUSTO TOTAL"]
[null,"COMPOSICAO","91645","CAMINHÃO DE TRANSPORTE DE MATERIAL ASFÁLTICO 30.000 L, COM CAVALO MECÂNICO DE CAPACIDADE MÁXIMA DE TRAÇÃO COMBINADO DE 66.000 KG, POTÊNCIA 360 CV, INCLUSIVE TANQUE DE ASFALTO COM SERPENTINA ","CHP","0,0011000","442,21",{"$f":"ROUNDDOWN(F363*G363,2)","v":0.48}]
[null,"COMPOSICAO","91646","CAMINHÃO DE TRANSPORTE DE MATERIAL ASFÁLTICO 30.000 L, COM CAVALO MECÂNICO DE CAPACIDADE MÁXIMA DE TRAÇÃO COMBINADO DE 66.000 KG, POTÊNCIA 360 CV, INCLUSIVE TANQUE DE ASFALTO COM SERPENTINA ","CHI","0,0005000","98,91",{"$f":"ROUNDDOWN(F364*G364,2)","v":0.04}]
[null,"PRODUÇÃO DA EQUIPE",null,null,1,"CUSTO ",null,{"$f":"SUM(H363:H364)","v":0.52}]
[null,"TOTAL",{"$nulls":5},{"$f":"H365/E365","v":0.52}]
[null,"BDI                %",{"$nulls":5},{"$f":"1+$M$2","v":1.1499999999999999}]
[null,"TOTAL DO SERVIÇO - R$",{"$nulls":5},{"$f":"H366*H367","v":0.59799999999999998}]
[]
[19,"CODEVASF",null,null," COMPOSIÇÃO DE PREÇO UNITÁRIO",null,null,null,{"$f":"H378","v":0.44999999999999996},{"$f":"H380","v":0.51749999999999996}]
[null,"OBRA:  ",{"$f":"$C$2","v":" PAVIMENTAÇÃO ASFÁLTICA EM PMF - VIAS DIVERSAS -  RIO PARDO DE MINAS -MG"},null,null,null,"DATA: ",{"$f":"$H$2","v":" SETEMBRO DE 2023"}]
[null,"SERVIÇO:  ",{"$f":"VLOOKUP(A370,ORÇAMENTO!$A$10:$I$41,3,0)","v":"TRANSPORTE COM CAMINHÃO BASCULANTE, EM VIA URBANA PAVIMENTADA - MASSA ASFÁLTICA (PMF)"},null,"SINAPI",{"$f":"VLOOKUP(A370,ORÇAMENTO!$A$10:$I$41,4,0)","v":95430},"UNIDADE: ",{"$f":"VLOOKUP(A370,ORÇAMENTO!$A$10:$I$41,5,0)","v":"TXKM"}]
[]
[null,"TIPO ITEM","CODIGO ITEM","DESCRIÇÃO ITEM","UNIDADE ITEM","COEFICIENTE","PRECO UNITARIO","CUSTO TOTAL"]
[null,"COMPOSICAO","89883","CAMINHÃO BASCULANTE 18 M3, COM CAVALO MECÂNICO DE CAPACIDADE MÁXIMA DE TRAÇÃO COMBINADO DE 45000 KG, POTÊNCIA 330 CV, INCLUSIVE SEMIREBOQUE COM CAÇAMBA METÁLICA","CHP","0,0012000","348,45",{"$f":"ROUNDDOWN(F375*G375,2)","v":0.41}]
[null,"COMPOSICAO","89884","CAMINHÃO BASCULANTE 18 M3, COM CAVALO MECÂNICO DE CAPACIDADE MÁXIMA DE TRAÇÃO COMBINADO DE 45000 KG, POTÊNCIA 330 CV, INCLUSIVE SEMIREBOQUE COM CAÇAMBA METÁLICA","CHI","0,0005000","93,65",0.04]
[null,"PRODUÇÃO DA EQUIPE",null,null,1,"CUSTO ",null,{"$f":"SUM(H375:H376)","v":0.44999999999999996}]
[null,"TOTAL",{"$nulls":5},{"$f":"H377/E377","v":0.44999999999999996}]
[null,"BDI                %",{"$nulls":5},{"$f":"1+$M$2","v":1.1499999999999999}]
[null,"TOTAL DO SERVIÇO - R$",{"$nulls":5},{"$f":"H378*H379","v":0.51749999999999996}]
[]
[20,"CODEVASF",null,null," COMPOSIÇÃO DE PREÇO UNITÁRIO",null,null,null,{"$f":"H389","v":2689.76},{"$f":"H391","v":3093.2240000000002}]
[null,"OBRA:  ",{"$f":"$C$2","v":" PAVIMENTAÇÃO ASFÁLTICA EM PMF - VIAS DIVERSAS -  RIO PARDO DE MINAS -MG"},null,null,null,"DATA: ",{"$f":"$H$2","v":" SETEMBRO DE 2023"}]
[null,"SERVIÇO:  ",{"$f":"VLOOKUP(A382,ORÇAMENTO!$A$10:$I$48,3,0)","v":"AQUISIÇÃO DE EMULSÃO ASFÁLTICA PARA IMPRIMAÇÃO (EAI) - EXCLUSIVE TRANSPORTE"},null,"SINAPI",{"$f":"VLOOKUP(A382,ORÇAMENTO!$A$10:$I$48,4,0)","v":"CPU.5"},"UNIDADE: ",{"$f":"VLOOKUP(A382,ORÇAMENTO!$A$10:$I$48,5,0)","v":"T"}]
[]
[null,"TIPO ITEM","CODIGO ITEM","DESCRIÇÃO ITEM","UNIDADE ITEM","COEFICIENTE","PRECO UNITARIO","CUSTO TOTAL"]
[null,"INSUMO","ANP","EMULSÃO ASFÁLTICA PARA SERVIÇO DE IMPRIMAÇÃO-EAI(CUSTO ANP, INCLUSO ICMS 18%)","T",1,{"$f":"2.20561*1000*1.2195122","v":2689.7683034420002},{"$f":"ROUNDDOWN(F387*G387,2)","v":2689.76}]
[null,"PRODUÇÃO DA EQUIPE",null,null,1,"CUSTO ",null,{"$f":"SUM(H387:H387)","v":2689.76}]
[null,"TOTAL",{"$nulls":5},{"$f":"H388/E388","v":2689.76}]
[null,"BDI                %",{"$nulls":5},{"$f":"1+$M$2","v":1.1499999999999999}]
[null,"TOTAL DO SERVIÇO - R$",{"$nulls":5},{"$f":"H389*H390","v":3093.2240000000002}]
[]
[21,"CODEVASF",null,null," COMPOSIÇÃO DE PREÇO UNITÁRIO",null,null,null,{"$f":"H400","v":2706.7},{"$f":"H402","v":3112.7049999999995}]
[null,"OBRA:  ",{"$f":"$C$2","v":" PAVIMENTAÇÃO ASFÁLTICA EM PMF - VIAS DIVERSAS -  RIO PARDO DE MINAS -MG"},null,null,null,"DATA: ",{"$f":"$H$2","v":" SETEMBRO DE 2023"}]
[null,"SERVIÇO:  ",{"$f":"VLOOKUP(A393,ORÇAMENTO!$A$10:$I$48,3,0)","v":"AQUISIÇÃO DE EMULSAO ASFALTICA CATIONICA RR-1C - EXCLUSIVE TRANSPORTE"},null,"SINAPI",{"$f":"VLOOKUP(A393,ORÇAMENTO!$A$10:$I$48,4,0)","v":"CPU.6"},"UNIDADE: ",{"$f":"VLOOKUP(A393,ORÇAMENTO!$A$10:$I$48,5,0)","v":"T"}]
[]
[null,"TIPO ITEM","CODIGO ITEM","DESCRIÇÃO ITEM","UNIDADE ITEM","COEFICIENTE","PRECO UNITARIO","CUSTO TOTAL"]
[null,"INSUMO","ANP","EMULSÃO ASFÁLTICA CATIÔNICA RR-1C (COLETA ANP INCLUINDO ICMS)","T",1,{"$f":"2.2195*1.2195122*1000","v":2706.7073279000001},{"$f":"ROUNDDOWN(F398*G398,2)","v":2706.7}]
[null,"PRODUÇÃO DA EQUIPE",null,null,1,"CUSTO ",null,{"$f":"SUM(H398:H398)","v":2706.7}]
[null,"TOTAL",{"$nulls":5},{"$f":"H399/E399","v":2706.7}]
[null,"BDI                %",{"$nulls":5},{"$f":"1+$M$2","v":1.1499999999999999}]
[null,"TOTAL DO SERVIÇO - R$",{"$nulls":5},{"$f":"H400*H401","v":3112.7049999999995}]
[]
[22,"CODEVASF",null,null," COMPOSIÇÃO DE PREÇO UNITÁRIO",null,null,null,{"$f":"H411","v":3008.98},{"$f":"H413","v":3460.3269999999998}]
[null,"OBRA:  ",{"$f":"$C$2","v":" PAVIMENTAÇÃO ASFÁLTICA EM PMF - VIAS DIVERSAS -  RIO PARDO DE MINAS -MG"},null,null,null,"DATA: ",{"$f":"$H$2","v":" SETEMBRO DE 2023"}]
[null,"SERVIÇO:  ",{"$f":"VLOOKUP(A404,ORÇAMENTO!$A$10:$I$48,3,0)","v":"AQUISIÇÃO DE EMULSAO ASFALTICA CATIONICA RL-1C  - EXCLUSIVE TRANSPORTE"},null,"SINAPI",{"$f":"VLOOKUP(A404,ORÇAMENTO!$A$10:$I$48,4,0)","v":"CPU.7"},"UNIDADE: ",{"$f":"VLOOKUP(A404,ORÇAMENTO!$A$10:$I$48,5,0)","v":"T"}]
[]
[null,"TIPO ITEM","CODIGO ITEM","DESCRIÇÃO ITEM","UNIDADE ITEM","COEFICIENTE","PRECO UNITARIO","CUSTO TOTAL"]
[null,"INSUMO","ANP","EMULSAO ASFALTICA CATIONICA RL-1C PARA USO EM PAVIMENTACAO ASFALTICA (COLETADO ANP ACRESCIDO DE ICMS)","T",1,{"$f":"2.46737*1.2195122*1000","v":3008.9878169139997},{"$f":"ROUNDDOWN(F409*G409,2)","v":3008.98}]
[null,"PRODUÇÃO DA EQUIPE",null,null,1,"CUSTO ",null,{"$f":"SUM(H409:H409)","v":3008.98}]
[null,"TOTAL",{"$nulls":5},{"$f":"H410/E410","v":3008.98}]
[null,"BDI                %",{"$nulls":5},{"$f":"1+$M$2","v":1.1499999999999999}]
[null,"TOTAL DO SERVIÇO - R$",{"$nulls":5},{"$f":"H411*H412","v":3460.3269999999998}]

{"sheet":"BDI SERV","index":2,"n_rows":37,"n_cols":5,"rows_kept":37,"cut":false,"hidden":false,"merged":[[36,0,36,5],[3,1,4,1],[3,2,4,2],[0,1,2,4],[32,0,34,5],[28,0,28,5],[30,1,30,2],[31,1,31,2]]}
[null,"DETALHAMENTO DO BDI - SERVIÇOS"]
[]
[]
[null,"Item","Descrição dos Serviços","%","%"]
[null,null,null,"PV","CD"]
[]
[null,1,"ADMINISTRAÇÃO CENTRAL"," ",4.01]
[null,"1.1","ESCRITÓRIO CENTRAL"," "," "]
[null,"1.2","VIAGENS"," "," "]
[null,"1.3","OUTROS"," "," "]
[null," "," "," "," "]
[null,2,"IMPOSTOS E TAXAS",{"$f":"SUM(D13:D16)","v":8.65},{"$f":"SUM(E13:E16)","v":10.82}]
[null,"2.1","ISS (*)",5,{"$f":"ROUND(D13*1.2515,2)","v":6.26}]
[null,"2.2","PIS",0.65,0.81]
[null,"2.3","Cofins",3,3.75]
[null,"2.4","CONTRIBUIÇÃO PREVIDENCIÁRIA SOBRE A RENDA BRUTA",0,0]
[]
[null,3,"TAXA DE RISCO"," ",{"$f":"SUM(E19:E22)","v":0.82000000000000006}]
[null,"3.1","SEGURO",null,0.16]
[null,"3.2","RISCO",null,0.5]
[null,"3.3","GARANTIA",null,0.16]
[]
[null,4,"DESPESAS FINANCEIRAS"," ",1.02]
[]
[null,5,"LUCRO",null,7.5]
[]
[null," ","BDI - CALCULADO"," ",{"$f":"ROUND((((1+(E7+E18)/100)*(1+E23/100)*(1+E25/100)/(1-D12/100)-1)*100),2)","v":24.62}]
[]
["BDI = ((1+((AC+S+R+G)/100))x(1+DF/100)x(1+L/100)/(1-I/100)-1)*100"]
[]
[null,"BDI (CALCULADO):",null,{"$f":"ROUND((((1+((E7+E18)/100))*(1+E23/100)*(1+E25/100))/(1-D12/100)-1)*100,2)","v":24.62},"%"]
[null," "]
["(*) ISS CONFORME LEI COMPLEMENTAR Nº 006/2003 E LEI COMPLEMENTAR Nº 59/2009 QUE ALTEROU A ALÍQUOTA PARA ITENS 7 A 7.05 (ART. 9º ) - QUANT. ESTIMADA DE MATERIAIS = 30%"]
[]
[]
[]
["BDI EM CONFORMIDADE COM OS ACÓRDÃOS Nº 2369/2011 e ACÓRDÃO Nº 2.622/2013 - TCU - PLENÁRIO"]

{"sheet":"BDI FORN","index":3,"n_rows":37,"n_cols":5,"rows_kept":37,"cut":false,"hidden":false,"merged":[[32,0,34,5],[36,0,36,5],[0,1,2,4],[3,1,4,1],[3,2,4,2],[28,0,28,5],[30,1,30,2],[31,1,31,2]]}
[null,"DETALHAMENTO DO BDI - FORNECIMENTO \n(MATERIAL ASFÁLTICO)"]
[]
[]
[null,"Item","Descrição dos Serviços","%","%"]
[null,null,null,"PV","CD"]
[]
[null,1,"ADMINISTRAÇÃO CENTRAL"," ",3.72]
[null,"1.1","ESCRITÓRIO CENTRAL"," "," "]
[null,"1.2","VIAGENS"," "," "]
[null,"1.3","OUTROS"," "," "]
[null," "," "," "," "]
[null,2,"IMPOSTOS E TAXAS",{"$f":"SUM(D13:D16)","v":3.65},{"$f":"SUM(E13:E16)","v":4.5600000000000005}]
[null,"2.1","ISS (*)",null,{"$f":"ROUND(D13*1.2515,2)","v":0}]
[null,"2.2","PIS",0.65,0.81]
[null,"2.3","Cofins",3,3.75]
[null,"2.4","CONTRIBUIÇÃO PREVIDENCIÁRIA SOBRE A RENDA BRUTA",0,0]
[]
[null,3,"TAXA DE RISCO"," ",{"$f":"SUM(E19:E22)","v":0.92}]
[null,"3.1","SEGURO",null,0.16]
[null,"3.2","RISCO",null,0.6]
[null,"3.3","GARANTIA",null,0.16]
[]
[null,4,"DESPESAS FINANCEIRAS"," ",0.85]
[]
[null,5,"LUCRO",null,5]
[]
[null," ","BDI - CALCULADO"," ",{"$f":"ROUND((((1+(E7+E18)/100)*(1+E23/100)*(1+E25/100)/(1-D12/100)-1)*100),2)","v":15}]
[]
["BDI = ((1+((AC+S+R+G)/100))x(1+DF/100)x(1+L/100)/(1-I/100)-1)*100"]
[]
[null,"BDI (CALCULADO):",null,{"$f":"ROUND((((1+((E7+E18)/100))*(1+E23/100)*(1+E25/100))/(1-D12/100)-1)*100,2)","v":15},"%"]
[null," "]
[]
[]
[]
[]
["BDI EM CONFORMIDADE COM OS ACÓRDÃOS Nº 2369/2011 e ACÓRDÃO Nº 2.622/2013 - TCU - PLENÁRIO"]

{"sheet":"CRONOGRAMA","index":4,"n_rows":21,"n_cols":11,"rows_kept":21,"cut":false,"hidden":false,"merged":[[15,0,16,0],[13,1,14,1],[13,0,14,0],[13,2,14,2],[17,1,18,2],[20,1,24,10],[9,1,10,1],[11,1,12,1],[15,1,16,1],[15,2,16,2],[7,0,8,0],[9,0,10,0],[11,0,12,0],[0,1,0,10],[1,6,1,10],[2,6,2,10],[3,1,3,6],[5,0,6,0],[5,2,6,2],[1,1,2,1],[5,1,6,1],[1,2,2,4],[7,2,8,2],[9,2,10,2],[11,2,12,2],[7,1,8,1]]}
[null,"CRONOGRAMA FÍSICO-FINANCEIRO"]
[null,"OBRA: ",{"$f":"ORÇAMENTO!C5","v":" PAVIMENTAÇÃO ASFÁLTICA EM PMF - VIAS DIVERSAS -  RIO PARDO DE MINAS -MG"},null,null,"VALOR:",{"$f":"ORÇAMENTO!I41","v":1651665.18}]
[{"$nulls":5},"PRAZO: ","150 DIAS "]
[]
[null,"ITEM","ETAPAS/DESCRIÇAO","FISICO/  FINANCEIRO","TOTAL    ETAPAS","MÊS 1","MÊS 2","MÊS 3","MÊS 4","MÊS 5","TOTAL"]
["A",{"$f":"VLOOKUP(A6,ORÇAMENTO!$A$9:$I$41,2)","v":1},{"$f":"VLOOKUP(A6,ORÇAMENTO!$A$9:$I$41,3)","v":"SERVIÇOS PRELIMINARES "},"FISICO ",{"$f":"ROUND(E7/$G$2,4)","v":7.0900000000000005E-2},0.2,0.2,0.2,0.2,0.2,{"$f":"SUM(F6:J6)","v":1}]
[null,null,null,"FINANCEIRO",{"$f":"ORÇAMENTO!I9","v":117122.68000000001},{"$f":"ROUND($E$7*F6,2)","v":23424.54},{"$f":"ROUND($E$7*G6,2)","v":23424.54},{"$f":"ROUND($E$7*H6,2)","v":23424.54},23424.54,23424.54,{"$f":"SUM(F7:J7)-0.01","v":117122.69000000002}]
["B",{"$f":"VLOOKUP(A8,ORÇAMENTO!$A$9:$I$41,2)","v":2},{"$f":"VLOOKUP(A8,ORÇAMENTO!$A$9:$I$41,3)","v":"PAVIMENTAÇÃO"},"FISICO ",{"$f":"ROUND(E9/$G$2,4)","v":0.29830000000000001},0.25,0.25,0.25,0.25,0,{"$f":"SUM(F8:J8)","v":1}]
[null,null,null,"FINANCEIRO",{"$f":"ORÇAMENTO!I15","v":492750.48},{"$f":"ROUND($E$9*F8,2)","v":123187.62},{"$f":"ROUND($E$9*G8,2)","v":123187.62},{"$f":"ROUND($E$9*H8,2)","v":123187.62},123187.62,0,492750.48]
["C",{"$f":"VLOOKUP(A10,ORÇAMENTO!$A$9:$I$41,2)","v":3},{"$f":"VLOOKUP(A10,ORÇAMENTO!$A$9:$I$41,3)","v":"TRANSPORTE DE MATERIAIS"},"FISICO ",{"$f":"ROUND(E11/$G$2,4)","v":7.8799999999999995E-2},0.2,0.2,0.2,0.2,0.2,1]
[null,null,null,"FINANCEIRO",{"$f":"ORÇAMENTO!I24","v":130178.06},{"$f":"ROUND($E$11*F10,2)","v":26035.61},{"$f":"ROUND($E$11*G10,2)","v":26035.61},{"$f":"ROUND($E$11*H10,2)","v":26035.61},26035.61,26035.61,130178.05]
["E",{"$f":"VLOOKUP(A12,ORÇAMENTO!$A$9:$I$41,2)","v":4},{"$f":"VLOOKUP(A12,ORÇAMENTO!$A$9:$I$41,3)","v":"OBRAS COMPLEMENTARES"},"FISICO ",{"$f":"ROUND(E13/$G$2,4)","v":0.24310000000000001},null,0.25,0.25,0.25,0.25,1]
[null,null,null,"FINANCEIRO",{"$f":"ORÇAMENTO!I27","v":401514.94},{"$f":"ROUND($E$13*F12,2)","v":0},{"$f":"ROUND($E$13*G12,2)","v":100378.74},{"$f":"ROUND($E$13*H12,2)","v":100378.74},100378.74,100378.74,401514.96]
["F",{"$f":"VLOOKUP(A14,ORÇAMENTO!$A$9:$I$41,2)","v":5},{"$f":"VLOOKUP(A14,ORÇAMENTO!$A$9:$I$41,3)","v":"TRANSPORTE DE MATERIAL ASFÁLTICO (BDI DIFERENCIADO)"},"FISICO ",{"$f":"ROUND(E15/$G$2,4)","v":3.5200000000000002E-2},0.25,0.25,0.25,0.25,0,1]
[null,null,null,"FINANCEIRO",{"$f":"ORÇAMENTO!I34","v":58121},{"$f":"ROUND($E$15*F14,2)","v":14530.25},{"$f":"ROUND($E$15*G14,2)","v":14530.25},{"$f":"ROUND($E$15*H14,2)","v":14530.25},14530.25,0,58121]
["G",{"$f":"VLOOKUP(A16,ORÇAMENTO!$A$9:$I$41,2)","v":6},{"$f":"VLOOKUP(A16,ORÇAMENTO!$A$9:$I$41,3)","v":"FORNECIMENTOS - MATERIAL ASFÁLTICO (BDI DIFERENCIADO)"},"FISICO ",{"$f":"ROUND(E17/$G$2,4)","v":0.27360000000000001},0.25,0.25,0.25,0.25,0,1]
[null,null,null,"FINANCEIRO",{"$f":"ORÇAMENTO!I37","v":451978.02},{"$f":"ROUND($E$17*F16,2)","v":112994.51},{"$f":"ROUND($E$17*G16,2)","v":112994.51},{"$f":"ROUND($E$17*H16,2)","v":112994.51},112994.51,0,451978.04]
[null,"TOTAL",null,"FISICO ",{"$f":"SUM(F18:J18)","v":1.0000000060544958},{"$f":"F19/E19","v":0.18173933411855298},{"$f":"G19/E19","v":0.24251359467419417},{"$f":"H19/E19","v":0.24251359467419417},{"$f":"I19/E19","v":0.24251359467419417},{"$f":"J19/E19","v":9.0719887913360261E-2},1.0000000060544958]
[null,null,null,"FINANCEIRO",{"$f":"E11+E9+E7+E13+E17+E15","v":1651665.1800000002},{"$f":"F11+F9+F7+F13+F17+F15","v":300172.52999999997},{"$f":"G11+G9+G7+G13+G17+G15-0.01","v":400551.26},{"$f":"H11+H9+H7+H13+H17+H15-0.01","v":400551.26},400551.26,149838.88,{"$f":"SUM(F19:J19)-0.01","v":1651665.18}]
[]
[null,"OBSERVAÇÕES:"]