{"text_format":"2","workbook":"xlsx","n_sheets":5,"sheets":["ORÇAMENTO","CPU","BDI SERV","BDI FORN","CRONOGRAMA"],"not_rendered":{"charts":0,"images":2,"macros":0,"external_links":0,"defined_names":5,"comments":1,"pivot_tables":0},"unopened":[],"bounds":{"document_bytes":16777216,"sheet_cells":100000,"run_cost":"one","rows_first":2000,"rows_last":500,"rows_between":2000,"halvings":0,"cell_chars":16384,"cell_head_chars":4096},"cells_cut":0,"cells_raw":0,"read":"whole","date_system":"1900"}

{"sheet":"ORÇAMENTO","index":0,"n_rows":37,"n_cols":14,"rows_kept":37,"cut":false,"hidden":false,"merged":[[6,6,6,7],[33,1,33,2],[0,0,7,0],[0,2,0,8],[1,2,1,8],[2,2,2,8],[4,2,4,8],[5,6,5,7],[6,1,6,2]]}
["<---- NUMERAR SERVIÇOS PARA CPU",null,"Ministério da Integração e do Desenvolvimento Regional - MIDR"]
[null,null,"Companhia de Desenvolvimento dos Vales do São Francisco e do Parnaíba"]
[null,null,"1ª Superintendência Regional"]
[]
[null,"OBRA: "," PAVIMENTAÇÃO ASFÁLTICA EM PMF (PRE-MIST. A FRIO) - RECAPEAMENTO - DISTRITO DE ITAPIRU - (RUBIM-MG)"]
[null,"DATA:"," SETEMBRO DE 2023",null,null,null,"BDI Serviços:",null,{"$f":"'BDI SERV'!D31/100","v":0.2122},{"$nulls":4},"."]
[null,"PRAZO DE EXECUÇÃO:    90 DIAS",{"$nulls":4},"BDI Fornecimento:",null,{"$f":"'BDI FORN'!D31/100","v":0.15}]
[null,"ITEM","DISCRIMINAÇÃO","REFER.","UNID.","QUANT.","P. UNITÁRIO","P.UNIT.C/ BDI","P. TOTAL",{"$f":"I34","v":682870.24}]
["A",1,"SERVIÇOS PRELIMINARES ",{"$nulls":5},{"$f":"SUM(I10:I13)","v":54421.53},{"$f":"I9/I34","v":7.9695272706568676E-2}]
[1,"1.1","MOBILIZAÇÃO E DESMOBILIZAÇÃO","CPU.1","GL",1,{"$f":"VLOOKUP(A10,CPU!$A$1:$N$4616,9)","v":10697.46},{"$f":"VLOOKUP(A10,CPU!$A$1:$N$4616,10)","v":12967.461011999998},{"$f":"ROUND(F10*H10,2)","v":12967.46},{"$f":"I10/$I$34","v":1.898963996439499E-2},{"$f":"G10*(1+I$6)-H10","v":0}]
[2,"1.2","ADMINISTRAÇÃO LOCAL","CPU.2","GL",1,{"$f":"VLOOKUP(A11,CPU!$A$1:$N$4616,9)","v":25714.890000000003},{"$f":"VLOOKUP(A11,CPU!$A$1:$N$4616,10)","v":31171.589658000001},{"$f":"ROUND(F11*H11,2)","v":31171.59},{"$f":"I11/$I$34","v":4.5647896443693319E-2},{"$f":"G11*(1+I$6)-H11","v":0}]
[3,"1.3","CANTEIRO DE OBRAS","CPU.3","GL",1,{"$f":"VLOOKUP(A12,CPU!$A$1:$N$4616,9)","v":6950.25},{"$f":"VLOOKUP(A12,CPU!$A$1:$N$4616,10)","v":8425.0930499999995},{"$f":"ROUND(F12*H12,2)","v":8425.09},{"$f":"I12/$I$34","v":1.2337761270721068E-2},0]
[4,"1.4","PLACA DE OBRA EM CHAPA DE AÇO GALVANIZADO","74209/001","M2",4.5,{"$f":"VLOOKUP(A13,CPU!$A$1:$N$4616,9)","v":340.5},{"$f":"VLOOKUP(A13,CPU!$A$1:$N$4616,10)","v":412.75409999999999},{"$f":"ROUND(F13*H13,2)","v":1857.39},{"$f":"I13/$I$34","v":2.7199750277593004E-3},0]
["B",2,"PAVIMENTAÇÃO",{"$nulls":5},{"$f":"SUM(I15:I17)","v":174473.65},{"$f":"I14/I34","v":0.25550044471113575}]
[10,"2.1","RECOMPOSIÇÃO DE BASE E OU SUB-BASE PARA REMENDO PROFUNDO DE BICA CORRIDA - INCLUSO RETIRADA E COLOCAÇÃO DO MATERIAL",101835,"M3",30,{"$f":"VLOOKUP(A15,CPU!$A$1:$N$4616,9)","v":241.27999999999997},{"$f":"VLOOKUP(A15,CPU!$A$1:$N$4616,10)","v":292.47961599999996},{"$f":"ROUND(F15*H15,2)","v":8774.39},{"$f":"I15/$I$34","v":1.2849278656513131E-2},0]
[11,"2.2","PINTURA DE LIGAÇÃO COM EMULSÃO ASFÁLTICA RR-1C",96402,"M2",11600,{"$f":"VLOOKUP(A16,CPU!$A$1:$N$4616,9)","v":1.01},{"$f":"VLOOKUP(A16,CPU!$A$1:$N$4616,10)","v":1.2243219999999999},{"$f":"ROUND(F16*H16,2)","v":14202.14},{"$f":"I16/$I$34","v":2.0797714072295786E-2},0]
[12,"2.3","EXECUÇÃO DE PAVIMENTO COM APLICAÇÃO DE PRÉ-MISTURADO A FRIO, CAMADA DE ROLAMENTO - EXCLUSIVE TRANSPORTE",100624,"M3",300,{"$f":"VLOOKUP(A17,CPU!$A$1:$N$4616,9)","v":416.59},{"$f":"VLOOKUP(A17,CPU!$A$1:$N$4616,10)","v":504.99039799999997},151497.12,{"$f":"I17/$I$34","v":0.22185345198232684},0]
["C",3,"TRANSPORTE DE MATERIAIS",{"$nulls":5},{"$f":"SUM(I19:I20)","v":40099.589999999997},{"$f":"I18/I34","v":5.8722122668576092E-2}]
[14,"3.1","TRANSPORTE COM CAMINHÃO BASCULANTE, EM VIA URBANA PAVIMENTADA",95427,"M3XKM",17000.004879999997,{"$f":"VLOOKUP(A19,CPU!$A$1:$N$4616,9,0)","v":0.73},{"$f":"VLOOKUP(A19,CPU!$A$1:$N$4616,10,0)","v":0.88490599999999997},{"$f":"ROUND(F19*H19,2)","v":15043.41},{"$f":"I19/$I$34","v":2.2029675799021493E-2},0]
[14.5,"3.2","TRANSPORTE COM CAMINHÃO BASCULANTE, EM VIA DE REVESTIMENTO PRIMÁRIO",95426,"M3XKM",13000.000852799996,{"$f":"VLOOKUP(A20,CPU!$A$1:$N$4616,9,0)","v":1.5899999999999999},{"$f":"VLOOKUP(A20,CPU!$A$1:$N$4616,10,0)","v":1.9273979999999997},{"$f":"ROUND(F20*H20,2)","v":25056.18},{"$f":"I20/$I$34","v":3.6692446869554605E-2}]
["E",4,"OBRAS COMPLEMENTARES",{"$nulls":5},{"$f":"SUM(I22:I27)","v":131208.49},{"$f":"I21/I34","v":0.19214263898804551}]
[15,"4.1","EXECUÇÃO DE SARJETA DE CONCRETO USINADO, MOLDADA  IN LOCO  EM TRECHO RETO, 30 CM BASE X 5 CM ALTURA","94287a","M",1800,{"$f":"VLOOKUP(A22,CPU!$A$1:$N$4616,9,0)","v":34.83},{"$f":"VLOOKUP(A22,CPU!$A$1:$N$4616,10,0)","v":42.220925999999999},{"$f":"ROUND(F22*H22,2)","v":75997.67},{"$f":"I22/$I$34","v":0.11129152443369036},0]
[16,"4.2","FORNECIMENTO E INSTALAÇÃO DE PLACA DE SINALIZAÇÃO VIÁRIA - REGULAMENTAÇÃO (FAIXA DE PEDESTRE E OUTROS) - CONFORME PROJETO","CPU.4","UNID",18,{"$f":"VLOOKUP(A23,CPU!$A$1:$N$4616,9,0)","v":488.04},{"$f":"VLOOKUP(A23,CPU!$A$1:$N$4616,10,0)","v":591.60208799999998},{"$f":"ROUND(F23*H23,2)","v":10648.84},{"$f":"I23/$I$34","v":1.5594236468703044E-2},0]
[17,"4.3","FORNECIMENTO E INSTALAÇÃO DE PLACA DE SINALIZAÇÃO VIÁRIA - REGULAMENTAÇÃO (PARE)","CPU.5","UNID",16,{"$f":"VLOOKUP(A24,CPU!$A$1:$N$4616,9,0)","v":482.58000000000004},{"$f":"VLOOKUP(A24,CPU!$A$1:$N$4616,10,0)","v":584.98},{"$f":"ROUND(F24*H24,2)","v":9359.68},{"$f":"I24/$I$34","v":1.3706381464214931E-2}]
[18,"4.4","PINTURA DE EIXO VIÁRIO SOBRE ASFALTO COM TINTA RETRORREFLETIVA A BASE DE RESINA ACRÍLICA COM MICROESFERAS DE VIDRO, APLICAÇÃO MECÂNICA COM DEMARCADORA AUTOPROPELIDA - ESPESSURA DE 0,10 MM",102512,"M",2800,{"$f":"VLOOKUP(A25,CPU!$A$1:$N$4616,9,0)","v":5.84},{"$f":"VLOOKUP(A25,CPU!$A$1:$N$4616,10,0)","v":7.08},{"$f":"ROUND(F25*H25,2)","v":19824},2.9030405542347256E-2,-7.5200000000030798E-4]
[19,"4.5","PINTURA DE FAIXA DE PEDESTRE OU ZEBRADA TINTA RETRORREFLETIVA A BASE DE RESINA ACRÍLICA COM MICROESFERAS DE VIDRO, E = 30 CM, APLICAÇÃO MANUAL",102509,"M2",350,{"$f":"VLOOKUP(A26,CPU!$A$1:$N$4616,9,0)","v":25.52},{"$f":"VLOOKUP(A26,CPU!$A$1:$N$4616,10,0)","v":30.94},{"$f":"ROUND(F26*H26,2)","v":10829},1.5858064044495482E-2,-4.6560000000042123E-3]
[20,"4.6","FORNECIMENTO E INSTALAÇÃO DE PLACA DE AÇO PARA IDENTIFICACAO DE RUA, *45 CM X 20* CM, INCLUSIVE SUPORTE EM TUBO DE AÇO GALVANIZADO (02 PLACAS POR SUPORTE)                      ","CPU.6","UN.",10,{"$f":"VLOOKUP(A27,CPU!$A$1:$N$4616,9,0)","v":375.29},{"$f":"VLOOKUP(A27,CPU!$A$1:$N$4616,10,0)","v":454.93},4549.3,6.6620270345944498E-3,-3.4620000000131768E-3]
["F",5,"TRANSPORTE DE MATERIAL ASFÁLTICO (BDI DIFERENCIADO)",{"$nulls":5},{"$f":"SUM(I29:I30)","v":68931},{"$f":"I28/I34","v":0.10094304300038028}]
[21,"5.1","TRANSPORTE COM CAMINHÃO TANQUE DE TRANSPORTE DE MATERIAL ASFÁLTICO DE 30000 L, EM VIA URBANA PAVIMENTADA",102331,"TXKM",48000,{"$f":"VLOOKUP(A29,CPU!$A$1:$N$4616,9,0)","v":0.52},{"$f":"VLOOKUP(A29,CPU!$A$1:$N$4616,10,0)","v":0.59799999999999998},{"$f":"ROUND(F29*H29,2)","v":28704},{"$f":"I29/$I$34","v":4.2034340228386584E-2},{"$f":"G29*(1+I$7)-H29","v":0}]
[22,"5.2","TRANSPORTE COM CAMINHÃO BASCULANTE, EM VIA DE REVESTIMENTO PRIMÁRIO - MASSA ASFÁLTICA (PMF)",95430,"TXKM",22000,{"$f":"VLOOKUP(A30,CPU!$A$1:$N$4616,9,0)","v":1.5899999999999999},{"$f":"VLOOKUP(A30,CPU!$A$1:$N$4616,10,0)","v":1.8284999999999998},{"$f":"ROUND(F30*H30,2)","v":40227},{"$f":"I30/$I$34","v":5.8908702771993698E-2},{"$f":"G30*(1+I$7)-H30","v":0}]
["G",6,"FORNECIMENTOS - MATERIAL ASFÁLTICO (BDI DIFERENCIADO)",{"$nulls":5},{"$f":"SUM(I32:I33)","v":213735.98},{"$f":"I31/I34","v":0.31299647792529373}]
[23,"6.2","AQUISIÇÃO DE EMULSAO ASFALTICA CATIONICA RR-1C - EXCLUSIVE TRANSPORTE","CPU.7","T",5.3,{"$f":"VLOOKUP(A32,CPU!$A$1:$N$4616,9,0)","v":2706.7},{"$f":"VLOOKUP(A32,CPU!$A$1:$N$4616,10,0)","v":3112.7049999999995},{"$f":"ROUND(F32*H32,2)","v":16497.34},{"$f":"I32/$I$34","v":2.4158821154660365E-2},0]
[24,"6.3","AQUISIÇÃO DE EMULSAO ASFALTICA CATIONICA RL-1C  - EXCLUSIVE TRANSPORTE","CPU.8","T",57,{"$f":"VLOOKUP(A33,CPU!$A$1:$N$4616,9,0)","v":3008.98},{"$f":"VLOOKUP(A33,CPU!$A$1:$N$4616,10,0)","v":3460.3269999999998},{"$f":"ROUND(F33*H33,2)","v":197238.64},{"$f":"I33/$I$34","v":0.28883765677063333},0]
[null,"TOTAL GERAL DA OBRA COM BDI ",{"$nulls":6},{"$f":"SUM(I9,I14,I18,I21,I28,I31)","v":682870.24},{"$f":"I34/F16*2","v":117.73624827586207}," / m²"]
[]
[]
[{"$nulls":11},"Pavimentação em Distrito - Transporte em Terra"]

{"sheet":"CPU","index":1,"n_rows":313,"n_cols":13,"rows_kept":313,"cut":false,"hidden":false,"merged":[[161,5,161,6],[162,1,162,6],[163,1,163,6],[164,1,164,6],[154,1,154,3],[154,4,154,7],[182,0,198,0],[197,1,197,6],[182,1,182,3],[182,4,182,7],[183,2,183,5],[154,0,165,0],[155,2,155,5],[156,2,156,3],[157,1,157,7],[161,1,161,3],[216,4,216,7],[184,2,184,3],[185,1,185,7],[194,1,194,3],[194,5,194,6],[195,1,195,6],[196,1,196,6],[199,1,199,3],[199,4,199,7],[200,2,200,5],[201,2,201,3],[202,1,202,7],[211,1,211,3],[211,5,211,6],[212,1,212,6],[213,1,213,6],[214,1,214,6],[199,0,215,0],[216,0,232,0],[281,2,281,5],[282,2,282,3],[283,1,283,7],[287,1,287,3],[301,1,301,6],[275,1,275,3],[299,1,299,6],[300,1,300,6],[292,0,301,0],[292,1,292,3],[292,4,292,7],[293,2,293,5],[294,2,294,3],[295,1,295,7],[298,1,298,3],[298,5,298,6],[287,5,287,6],[288,1,288,6],[289,1,289,6],[290,1,290,6],[268,1,268,3],[269,2,269,5],[270,2,270,3],[271,1,271,7],[303,0,312,0],[303,1,303,3],[303,4,303,7],[304,2,304,5],[305,2,305,3],[306,1,306,7],[309,1,309,3],[309,5,309,6],[310,1,310,6],[311,1,311,6],[312,1,312,6],[275,5,275,6],[268,4,268,7],[277,1,277,6],[278,1,278,6],[276,1,276,6],[268,0,278,0],[280,0,290,0],[280,1,280,3],[280,4,280,7],[166,0,180,0],[168,2,168,3],[169,1,169,7],[177,1,177,3],[177,5,177,6],[178,1,178,6],[179,1,179,6],[167,2,167,5],[216,1,216,3],[232,1,232,6],[217,2,217,5],[218,2,218,3],[219,1,219,7],[229,1,229,3],[229,5,229,6],[230,1,230,6],[142,0,152,0],[142,1,142,3],[142,4,142,7],[143,2,143,5],[144,2,144,3],[145,1,145,7],[152,1,152,6],[149,1,149,3],[149,5,149,6],[150,1,150,6],[151,1,151,6],[0,0,13,0],[14,0,31,0],[32,0,45,0],[46,0,62,0],[63,0,77,0],[78,0,96,0],[48,2,48,3],[81,1,81,7],[65,2,65,3],[66,1,66,7],[73,1,73,3],[73,5,73,6],[74,1,74,6],[75,1,75,6],[76,1,76,6],[0,1,0,3],[0,4,0,7],[12,1,12,6],[14,1,14,3],[14,4,14,7],[42,1,42,6],[43,1,43,6],[58,5,58,6],[59,1,59,6],[60,1,60,6],[61,1,61,6],[63,10,63,11],[64,2,64,5],[63,1,63,3],[63,4,63,7],[97,0,117,0],[98,2,98,5],[99,2,99,3],[100,1,100,7],[92,1,92,3],[92,5,92,6],[93,1,93,6],[94,1,94,6],[95,1,95,6],[115,1,115,6],[97,1,97,3],[80,2,80,3],[79,2,79,5],[0,10,0,11],[1,2,1,5],[2,2,2,3],[3,1,3,7],[9,1,9,3],[9,5,9,6],[10,1,10,6],[1,10,1,11],[11,1,11,6],[14,10,14,11],[15,2,15,5],[16,2,16,3],[17,1,17,7],[27,1,27,3],[27,5,27,6],[15,8,16,9],[46,10,46,11],[47,2,47,5],[28,1,28,6],[29,1,29,6],[30,1,30,6],[32,1,32,3],[32,4,32,7],[44,1,44,6],[46,1,46,3],[46,4,46,7],[32,10,32,11],[33,2,33,5],[34,2,34,3],[35,1,35,7],[33,8,34,9],[41,1,41,3],[41,5,41,6],[49,1,49,7],[166,10,166,11],[166,1,166,3],[166,4,166,7],[180,1,180,6],[116,1,116,6],[117,1,117,6],[139,1,139,3],[119,1,119,3],[119,4,119,7],[120,2,120,5],[121,2,121,3],[122,1,122,7],[97,10,97,11],[139,5,139,6],[140,1,140,6],[114,1,114,3],[114,5,114,6],[97,4,97,7],[102,8,102,9],[78,10,78,11],[78,1,78,3],[78,4,78,7],[58,1,58,3],[231,1,231,6],[264,1,264,6],[265,1,265,6],[266,1,266,6],[251,0,267,0],[234,0,250,0],[248,1,248,6],[249,1,249,6],[251,1,251,3],[251,4,251,7],[252,2,252,5],[253,2,253,3],[254,1,254,7],[263,1,263,3],[263,5,263,6],[234,1,234,3],[234,4,234,7],[235,2,235,5],[236,2,236,3],[237,1,237,7],[246,1,246,3],[246,5,246,6],[247,1,247,6]]}
[1,"CODEVASF",null,null," COMPOSIÇÃO DE PREÇO UNITÁRIO",null,null,null,{"$f":"H11","v":10697.46},{"$f":"H13","v":12967.461011999998},"BDI CALCULADO:",null,{"$f":"ORÇAMENTO!I6","v":0.2122}]
[null,"OBRA:  ",{"$f":"ORÇAMENTO!C5","v":" PAVIMENTAÇÃO ASFÁLTICA EM PMF (PRE-MIST. A FRIO) - RECAPEAMENTO - DISTRITO DE ITAPIRU - (RUBIM-MG)"},null,null,null,"DATA: ",{"$f":"ORÇAMENTO!C6","v":" SETEMBRO DE 2023"},null,null,"BDI DIFERENCIADO:",null,{"$f":"'BDI FORN'!D31/100","v":0.15}]
[null,"SERVIÇO:  ",{"$f":"VLOOKUP(A1,ORÇAMENTO!A10:I22,3)","v":"MOBILIZAÇÃO E DESMOBILIZAÇÃO"},null,"Referência:",{"$f":"VLOOKUP(A1,ORÇAMENTO!A10:I22,4)","v":"CPU.1"},"UNIDADE: ",{"$f":"VLOOKUP(A1,ORÇAMENTO!A10:I22,5)","v":"GL"}]
[]
[null,"TIPO ITEM","CODIGO ITEM","DESCRIÇÃO ITEM","UNIDADE ITEM","COEFICIENTE","PRECO UNITARIO","CUSTO TOTAL"]
[null,"COMPOSICAO",89876,"CAMINHÃO BASCULANTE 14 M3, COM CAVALO MECÂNICO DE CAPACIDADE MÁXIMA DE TRAÇÃO COMBINADO DE 36000 KG, POTÊNCIA 286 CV, INCLUSIVE SEMIREBOQUE COM CAÇAMBA METÁLICA","CHP DIURNO.",16,316.13,{"$f":"ROUNDDOWN(F6*G6,2)","v":5058.08}]
[null,"COMPOSICAO",89877,"CAMINHÃO BASCULANTE 14 M3, COM CAVALO MECÂNICO DE CAPACIDADE MÁXIMA DE TRAÇÃO COMBINADO DE 36000 KG, POTÊNCIA 286 CV, INCLUSIVE SEMIREBOQUE COM CAÇAMBA METÁLICA","CHI DIURNO.",16,89.75,{"$f":"ROUNDDOWN(F7*G7,2)","v":1436}]
[null,"COMPOSICAO",5914640,"TRANSPORTE COM CAVALO MECÂNICO COM SEMIRREBOQUE COM CAPACIDADE DE 30 T - RODOVIA PAVIMENTADA","T.KM",6157,0.57999999999999996,{"$f":"ROUNDDOWN(F8*G8,2)","v":3571.06}]
[null,"COMPOSIÇÃO",88316,"SERVENTE COM ENCARGOS COMPLEMENTARES","H",32,19.760000000000002,{"$f":"ROUNDDOWN(F9*G9,2)","v":632.32000000000005}]
[null,"PRODUÇÃO DA EQUIPE",null,null,1,"CUSTO ",null,{"$f":"SUM(H6:H9)","v":10697.46}]
[null,"TOTAL",{"$nulls":5},{"$f":"H10/E10","v":10697.46}]
[null,"BDI                %",{"$nulls":5},{"$f":"1+$M$1","v":1.2121999999999999}]
[null,"TOTAL DO SERVIÇO - R$",{"$nulls":5},{"$f":"H11*H12","v":12967.461011999998}]
[]
[{"$f":"A1+1","v":2},"CODEVASF",null,null," COMPOSIÇÃO DE PREÇO UNITÁRIO",null,null,null,{"$f":"H29","v":25714.890000000003},{"$f":"H31","v":31171.589658000001}]
[null,"OBRA:  ",{"$f":"$C$2","v":" PAVIMENTAÇÃO ASFÁLTICA EM PMF (PRE-MIST. A FRIO) - RECAPEAMENTO - DISTRITO DE ITAPIRU - (RUBIM-MG)"},null,null,null,"DATA: ",{"$f":"$H$2","v":" SETEMBRO DE 2023"}]
[null,"SERVIÇO:  ",{"$f":"VLOOKUP(A15,ORÇAMENTO!$A$10:$I$22,3)","v":"ADMINISTRAÇÃO LOCAL"},null,"SINAPI","CPU","UNIDADE: ",{"$f":"VLOOKUP(A15,ORÇAMENTO!$A$10:$I$22,5)","v":"GL"}]
[]
[null,"TIPO ITEM","CODIGO ITEM","DESCRIÇÃO ITEM","UNIDADE ITEM","COEFICIENTE","PRECO UNITARIO","CUSTO TOTAL"]
[null,"INSUMO",14250,"ENERGIA ELÉTRICA","kwh",60,0.94,{"$f":"ROUNDDOWN(F20*G20,2)","v":56.4}]
[null,"INSUMO",44480,"TARIFA \"A\" - ÁGUA/ESGOTO ","m³",6,17.78,106.68]
[null,"COTAÇÃO","MERC.","TELEFONE (PLANO CONTROLE)","UNID",2,59.9,119.8]
[null,"INSUMO","ED-50155 SEINFRA","BANHEIRO QUÍMICO 110 X 120 X 230 CM COM MANUTENÇÃO (CONSIDERANDO OBRAS SIMULTÂNEAS)","MÊS",1,820,820]
[null,"COMPOSICAO",90777,"Engenheiro Civil Júnior com encargos complementares","H",25,114.12,2853]
[null,"COMPOSICAO",90776,"Encarregado Geral com encargos complementares","H",50,57.73,2886.5]
[null,"COMPOSICAO",88321,"Tecnico de Laboratório com encargos complementares","H",25,45.45,1136.25]
[null,"COMPOSICAO",90772,"Auxiliar de escritório com encargos complementares","H",25,23.72,593]
[null,"PRODUÇÃO DA EQUIPE",null,null,{"$f":"1/3","v":0.33333333333333331},"CUSTO ",null,{"$f":"SUM(H20:H27)","v":8571.630000000001}]
[null,"TOTAL",{"$nulls":5},{"$f":"H28/E28","v":25714.890000000003}]
[null,"BDI                %",{"$nulls":5},{"$f":"1+$M$1","v":1.2121999999999999}]
[null,"TOTAL DO SERVIÇO - R$",{"$nulls":5},{"$f":"H29*H30","v":31171.589658000001}]
[]
[{"$f":"A15+1","v":3},"CODEVASF",null,null," COMPOSIÇÃO DE PREÇO UNITÁRIO",null,null,null,{"$f":"H43","v":6950.25},{"$f":"H45","v":8425.0930499999995}]
[null,"OBRA:  ",{"$f":"$C$2","v":" PAVIMENTAÇÃO ASFÁLTICA EM PMF (PRE-MIST. A FRIO) - RECAPEAMENTO - DISTRITO DE ITAPIRU - (RUBIM-MG)"},null,null,null,"DATA: ",{"$f":"$H$2","v":" SETEMBRO DE 2023"}]
[null,"SERVIÇO:  ",{"$f":"VLOOKUP(A33,ORÇAMENTO!$A$10:$I$22,3)","v":"CANTEIRO DE OBRAS"},null,"SINAPI",{"$f":"VLOOKUP(A33,ORÇAMENTO!$A$10:$I$22,4)","v":"CPU.3"},"UNIDADE: ",{"$f":"VLOOKUP(A33,ORÇAMENTO!$A$10:$I$22,5)","v":"GL"}]
[]
[null,"TIPO ITEM","CODIGO ITEM","DESCRIÇÃO ITEM","UNIDADE ITEM","COEFICIENTE","PRECO UNITARIO","CUSTO TOTAL"]
[null,"INSUMO",10775,"ALUGUEL DE IMÓVEL OU CONTEINER QUE ATENDA AOS REQUISITOS MÍNIMOS PARA INSTALAÇÃO DO CANTEIRO DE OBRAS","MÊS",3,975,{"$f":"ROUNDDOWN(F38*G38,2)","v":2925}]
[null,"INSUMO",10779,"LOCACAO DE CONTAINER 2,30 X 4,30 M, ALT. 2,50 M, P/ SANITARIO, C/ 5 BACIAS, 1 LAVATORIO E 4 MICTORIOS","MÊS",3,1218.75,{"$f":"ROUNDDOWN(F39*G39,2)","v":3656.25}]
[null,"INSUMO","37525","TELA PLASTICA TECIDA LISTRADA BRANCA E LARANJA, TIPO GUARDA CORPO, EM POLIETILENO MONOFILADO, ROLO 1,20 X 50 M (L X C)","M",100,3.69,{"$f":"ROUNDDOWN(F40*G40,2)","v":369}]
[{"$nulls":7},{"$f":"ROUNDDOWN(F41*G41,2)","v":0}]
[null,"PRODUÇÃO DA EQUIPE",null,null,1,"CUSTO ",null,{"$f":"SUM(H38:H41)","v":6950.25}]
[null,"TOTAL",{"$nulls":5},{"$f":"H42/E42","v":6950.25}]
[null,"BDI                %",{"$nulls":5},{"$f":"1+$M$1","v":1.2121999999999999}]
[null,"TOTAL DO SERVIÇO - R$",{"$nulls":5},{"$f":"H43*H44","v":8425.0930499999995}]
[]
[{"$f":"A33+1","v":4},"CODEVASF",null,null," COMPOSIÇÃO DE PREÇO UNITÁRIO",null,null,null,{"$f":"H60","v":340.5},{"$f":"H62","v":412.75409999999999}]
[null,"OBRA:  ",{"$f":"$C$2","v":" PAVIMENTAÇÃO ASFÁLTICA EM PMF (PRE-MIST. A FRIO) - RECAPEAMENTO - DISTRITO DE ITAPIRU - (RUBIM-MG)"},null,null,null,"DATA: ",{"$f":"$H$2","v":" SETEMBRO DE 2023"}]
[null,"SERVIÇO:  ",{"$f":"VLOOKUP(A47,ORÇAMENTO!$A$10:$I$22,3)","v":"PLACA DE OBRA EM CHAPA DE AÇO GALVANIZADO"},null,"SINAPI",{"$f":"VLOOKUP(A47,ORÇAMENTO!$A$10:$I$22,4)","v":"74209/001"},"UNIDADE: ",{"$f":"VLOOKUP(A47,ORÇAMENTO!$A$10:$I$22,5)","v":"M2"}]
[]
[null,"TIPO ITEM","CODIGO ITEM","DESCRIÇÃO ITEM","UNIDADE ITEM","COEFICIENTE","PRECO UNITARIO","CUSTO TOTAL"]
[null,"INSUMO","4509","SARRAFO *2,5 X 10* CM EM PINUS, MISTA OU EQUIVALENTE DA REGIAO - BRUTA","M","3,2083000","4,41",{"$f":"ROUNDDOWN(F52*G52,2)","v":14.14}]
[null,"INSUMO","4813","PLACA DE OBRA (PARA CONSTRUCAO CIVIL) EM CHAPA GALVANIZADA *N. 22*, ADESIVADA, DE *2,4 X 1,2* M (SEM POSTES PARA FIXACAO)","M2","1,0000000","250,00",250]
[null,"INSUMO","5065","PREGO DE ACO POLIDO COM CABECA 10 X 10 (7/8 X 17)","KG","0,0113000","36,57",0.41]
[null,"INSUMO","5069","PREGO DE ACO POLIDO COM CABECA 17 X 27 (2 1/2 X 11)","KG","0,0132000","19,59",0.25]
[null,"COMPOSICAO","88262","CARPINTEIRO DE FORMAS COM ENCARGOS COMPLEMENTARES","H","0,3729000","27,05",10.08]
[null,"COMPOSICAO","88316","SERVENTE COM ENCARGOS COMPLEMENTARES","H","1,1186000","19,76",22.1]
[null,"INSUMO",4115,"MADEIRA ROLICA TRATADA, D = 12 A 15 CM, H = 3,00 M, EM EUCALIPTO OU EQUIVALENTE","M",2,21.76,43.52]
[null,"PRODUÇÃO DA EQUIPE",null,null,1,"CUSTO ",null,{"$f":"SUM(H52:H58)","v":340.5}]
[null,"TOTAL",{"$nulls":5},{"$f":"H59/E59","v":340.5}]
{"$rows_left_out":254}
{"sheet":"BDI SERV","index":2,"n_rows":37,"n_cols":5,"rows_kept":37,"cut":false,"hidden":false,"merged":[[36,0,36,5],[3,1,4,1],[3,2,4,2],[0,1,2,4],[32,0,34,5],[28,0,28,5],[30,1,30,2],[31,1,31,2]]}
[null,"DETALHAMENTO DO BDI - SERVIÇOS"]
[]
[]
[null,"Item","Descrição dos Serviços","%","%"]
[null,null,null,"PV","CD"]
[]
[null,1,"ADMINISTRAÇÃO CENTRAL"," ",4.01]
[null,"1.1","ESCRITÓRIO CENTRAL"," "," "]
[null,"1.2","VIAGENS"," "," "]
[null,"1.3","OUTROS"," "," "]
[null," "," "," "," "]
[null,2,"IMPOSTOS E TAXAS",{"$f":"SUM(D13:D16)","v":5.65},{"$f":"SUM(E13:E16)","v":7.0600000000000005}]
[null,"2.1","ISS (*)",2,{"$f":"ROUND(D13*1.2515,2)","v":2.5}]
[null,"2.2","PIS",0.65,0.81]
[null,"2.3","Cofins",3,3.75]
[null,"2.4","CONTRIBUIÇÃO PREVIDENCIÁRIA SOBRE A RENDA BRUTA",0,0]
[]
[null,3,"TAXA DE RISCO"," ",{"$f":"SUM(E19:E22)","v":0.82000000000000006}]
[null,"3.1","SEGURO",null,0.16]
[null,"3.2","RISCO",null,0.5]
[null,"3.3","GARANTIA",null,0.16]
[]
[null,4,"DESPESAS FINANCEIRAS"," ",1.02]
[]
[null,5,"LUCRO",null,8]
[]
[null," ","BDI - CALCULADO"," ",{"$f":"ROUND((((1+(E7+E18)/100)*(1+E23/100)*(1+E25/100)/(1-D12/100)-1)*100),2)","v":21.22}]
[]
["BDI = ((1+((AC+S+R+G)/100))x(1+DF/100)x(1+L/100)/(1-I/100)-1)*100"]
[]
[null,"BDI (CALCULADO):",null,{"$f":"ROUND((((1+((E7+E18)/100))*(1+E23/100)*(1+E25/100))/(1-D12/100)-1)*100,2)","v":21.22},"%"]
[null," "]
["(*) ISS CONFORME LEI COMPLEMENTAR Nº 006/2003 E LEI COMPLEMENTAR Nº 59/2009 QUE ALTEROU A ALÍQUOTA PARA ITENS 7 A 7.05 (ART. 9º ) - QUANT. ESTIMADA DE MATERIAIS = 30%"]
[]
[]
[]
["BDI EM CONFORMIDADE COM OS ACÓRDÃOS Nº 2369/2011 e ACÓRDÃO Nº 2.622/2013 - TCU - PLENÁRIO"]

{"sheet":"BDI FORN","index":3,"n_rows":37,"n_cols":5,"rows_kept":37,"cut":false,"hidden":false,"merged":[[32,0,34,5],[36,0,36,5],[0,1,2,4],[3,1,4,1],[3,2,4,2],[28,0,28,5],[30,1,30,2],[31,1,31,2]]}
[null,"DETALHAMENTO DO BDI - FORNECIMENTO \n(MATERIAL ASFÁLTICO)"]
[]
[]
[null,"Item","Descrição dos Serviços","%","%"]
[null,null,null,"PV","CD"]
[]
[null,1,"ADMINISTRAÇÃO CENTRAL"," ",3.72]
[null,"1.1","ESCRITÓRIO CENTRAL"," "," "]
[null,"1.2","VIAGENS"," "," "]
[null,"1.3","OUTROS"," "," "]
[null," "," "," "," "]
[null,2,"IMPOSTOS E TAXAS",{"$f":"SUM(D13:D16)","v":3.65},{"$f":"SUM(E13:E16)","v":4.5600000000000005}]
[null,"2.1","ISS (*)",null,{"$f":"ROUND(D13*1.2515,2)","v":0}]
[null,"2.2","PIS",0.65,0.81]
[null,"2.3","Cofins",3,3.75]
[null,"2.4","CONTRIBUIÇÃO PREVIDENCIÁRIA SOBRE A RENDA BRUTA",0,0]
[]
[null,3,"TAXA DE RISCO"," ",{"$f":"SUM(E19:E22)","v":0.92}]
[null,"3.1","SEGURO",null,0.16]
[null,"3.2","RISCO",null,0.6]
[null,"3.3","GARANTIA",null,0.16]
[]
[null,4,"DESPESAS FINANCEIRAS"," ",0.85]
[]
[null,5,"LUCRO",null,5]
[]
[null," ","BDI - CALCULADO"," ",{"$f":"ROUND((((1+(E7+E18)/100)*(1+E23/100)*(1+E25/100)/(1-D12/100)-1)*100),2)","v":15}]
[]
["BDI = ((1+((AC+S+R+G)/100))x(1+DF/100)x(1+L/100)/(1-I/100)-1)*100"]
[]
[null,"BDI (CALCULADO):",null,{"$f":"ROUND((((1+((E7+E18)/100))*(1+E23/100)*(1+E25/100))/(1-D12/100)-1)*100,2)","v":15},"%"]
[null," "]
[]
[]
[]
[]
["BDI EM CONFORMIDADE COM OS ACÓRDÃOS Nº 2369/2011 e ACÓRDÃO Nº 2.622/2013 - TCU - PLENÁRIO"]

{"sheet":"CRONOGRAMA","index":4,"n_rows":21,"n_cols":9,"rows_kept":21,"cut":false,"hidden":false,"merged":[[15,0,16,0],[13,1,14,1],[13,0,14,0],[13,2,14,2],[17,1,18,2],[20,1,24,8],[9,1,10,1],[11,1,12,1],[15,1,16,1],[15,2,16,2],[7,0,8,0],[9,0,10,0],[11,0,12,0],[0,1,0,8],[1,6,1,8],[2,6,2,8],[3,1,3,6],[5,0,6,0],[5,2,6,2],[1,1,2,1],[5,1,6,1],[1,2,2,4],[7,2,8,2],[9,2,10,2],[11,2,12,2],[7,1,8,1]]}
[null,"CRONOGRAMA FÍSICO-FINANCEIRO"]
[null,"OBRA: ",{"$f":"ORÇAMENTO!C5","v":" PAVIMENTAÇÃO ASFÁLTICA EM PMF (PRE-MIST. A FRIO) - RECAPEAMENTO - DISTRITO DE ITAPIRU - (RUBIM-MG)"},null,null,"VALOR:",{"$f":"ORÇAMENTO!I34","v":682870.24}]
[{"$nulls":5},"PRAZO: ","90 DIAS "]
[]
[null,"ITEM","ETAPAS/DESCRIÇAO","FISICO/  FINANCEIRO","TOTAL    ETAPAS","MÊS 1","MÊS 2","MÊS 3","TOTAL"]
["A",{"$f":"VLOOKUP(A6,ORÇAMENTO!$A$9:$I$34,2)","v":1},{"$f":"VLOOKUP(A6,ORÇAMENTO!$A$9:$I$34,3)","v":"SERVIÇOS PRELIMINARES "},"FISICO ",{"$f":"ROUND(E7/$G$2,4)","v":7.9699999999999993E-2},0.25,0.45,0.3,{"$f":"SUM(F6:H6)","v":1}]
[null,null,null,"FINANCEIRO",{"$f":"ORÇAMENTO!I9","v":54421.53},{"$f":"ROUND($E$7*F6,2)","v":13605.38},{"$f":"ROUND($E$7*G6,2)","v":24489.69},{"$f":"ROUND($E$7*H6,2)","v":16326.46},{"$f":"SUM(F7:H7)-0.01","v":54421.52}]
["B",{"$f":"VLOOKUP(A8,ORÇAMENTO!$A$9:$I$34,2)","v":2},{"$f":"VLOOKUP(A8,ORÇAMENTO!$A$9:$I$34,3)","v":"PAVIMENTAÇÃO"},"FISICO ",{"$f":"ROUND(E9/$G$2,4)","v":0.2555},0.25,0.45,0.3,{"$f":"SUM(F8:H8)","v":1}]
[null,null,null,"FINANCEIRO",{"$f":"ORÇAMENTO!I14","v":174473.65},{"$f":"ROUND($E$9*F8,2)","v":43618.41},{"$f":"ROUND($E$9*G8,2)","v":78513.14},{"$f":"ROUND($E$9*H8,2)","v":52342.1},174473.65]
["C",{"$f":"VLOOKUP(A10,ORÇAMENTO!$A$9:$I$34,2)","v":3},{"$f":"VLOOKUP(A10,ORÇAMENTO!$A$9:$I$34,3)","v":"TRANSPORTE DE MATERIAIS"},"FISICO ",{"$f":"ROUND(E11/$G$2,4)","v":5.8700000000000002E-2},0.25,0.4,0.35,1]
[null,null,null,"FINANCEIRO",{"$f":"ORÇAMENTO!I18","v":40099.589999999997},{"$f":"ROUND($E$11*F10,2)","v":10024.9},{"$f":"ROUND($E$11*G10,2)","v":16039.84},{"$f":"ROUND($E$11*H10,2)","v":14034.86},40099.599999999999]
["E",{"$f":"VLOOKUP(A12,ORÇAMENTO!$A$9:$I$34,2)","v":4},{"$f":"VLOOKUP(A12,ORÇAMENTO!$A$9:$I$34,3)","v":"OBRAS COMPLEMENTARES"},"FISICO ",{"$f":"ROUND(E13/$G$2,4)","v":0.19209999999999999},null,0.4,0.6,1]
[null,null,null,"FINANCEIRO",{"$f":"ORÇAMENTO!I21","v":131208.49},{"$f":"ROUND($E$13*F12,2)","v":0},{"$f":"ROUND($E$13*G12,2)","v":52483.4},{"$f":"ROUND($E$13*H12,2)","v":78725.09},131208.49]
["F",{"$f":"VLOOKUP(A14,ORÇAMENTO!$A$9:$I$34,2)","v":5},{"$f":"VLOOKUP(A14,ORÇAMENTO!$A$9:$I$34,3)","v":"TRANSPORTE DE MATERIAL ASFÁLTICO (BDI DIFERENCIADO)"},"FISICO ",{"$f":"ROUND(E15/$G$2,4)","v":0.1009},0.25,0.45,0.3,1]
[null,null,null,"FINANCEIRO",{"$f":"ORÇAMENTO!I28","v":68931},{"$f":"ROUND($E$15*F14,2)","v":17232.75},{"$f":"ROUND($E$15*G14,2)","v":31018.95},{"$f":"ROUND($E$15*H14,2)","v":20679.3},68931]
["G",{"$f":"VLOOKUP(A16,ORÇAMENTO!$A$9:$I$34,2)","v":6},{"$f":"VLOOKUP(A16,ORÇAMENTO!$A$9:$I$34,3)","v":"FORNECIMENTOS - MATERIAL ASFÁLTICO (BDI DIFERENCIADO)"},"FISICO ",{"$f":"ROUND(E17/$G$2,4)","v":0.313},0.25,0.45,0.3,1]
[null,null,null,"FINANCEIRO",{"$f":"ORÇAMENTO!I31","v":213735.98},{"$f":"ROUND($E$17*F16,2)","v":53434},{"$f":"ROUND($E$17*G16,2)","v":96181.19},{"$f":"ROUND($E$17*H16,2)","v":64120.79},213735.98]
[null,"TOTAL",null,"FISICO ",{"$f":"SUM(F18:H18)","v":1.0000000146440706},{"$f":"F19/E19","v":0.20196434391400628},{"$f":"G19/E19","v":0.43745677070361133},{"$f":"H19/E19","v":0.36057890002645304},1.0000000146440706]
[null,null,null,"FINANCEIRO",{"$f":"E11+E9+E7+E13+E17+E15","v":682870.24},{"$f":"F11+F9+F7+F13+F17+F15","v":137915.44},{"$f":"G11+G9+G7+G13+G17+G15","v":298726.21000000002},{"$f":"H11+H9+H7+H13+H17+H15","v":246228.59999999998},{"$f":"SUM(F19:H19)-0.01","v":682870.24}]
[]
[null,"OBSERVAÇÕES:"]