{"text_format":"2","workbook":"xlsx","n_sheets":5,"sheets":["ORÇAMENTO","CPU","BDI SERV","BDI FORN","CRONOGRAMA"],"not_rendered":{"charts":0,"images":7,"macros":0,"external_links":0,"defined_names":5,"comments":1,"pivot_tables":0},"unopened":[],"bounds":{"document_bytes":16777216,"sheet_cells":100000,"run_cost":"one","rows_first":2000,"rows_last":500,"rows_between":2000,"halvings":0,"cell_chars":16384,"cell_head_chars":4096},"cells_cut":0,"cells_raw":0,"read":"whole","date_system":"1900"}

{"sheet":"ORÇAMENTO","index":0,"n_rows":53,"n_cols":10,"rows_kept":53,"cut":false,"hidden":false,"merged":[[6,6,6,7],[52,1,52,2],[0,0,7,0],[0,2,0,8],[1,2,1,8],[2,2,2,8],[4,2,4,8],[5,6,5,7]]}
["<---- NUMERAR SERVIÇOS PARA CPU",null,"Ministério do Desenvolvimento Regional"]
[null,null,"Companhia de Desenvolvimento dos Vales do São Francisco e do Parnaíba"]
[null,null,"1ª Superintendência Regional"]
[]
[null,"OBRA: ","DRENAGEM E PAVIMENTAÇÃO - PARQUE DE EXPOSIÇÕES - SERRO/MG (ITEM 1)"]
[null,"DATA:","OUTUBRO/2023",null,null,null,"BDI Serviços:",null,{"$f":"'BDI SERV'!D30/100","v":0.21489999999999998}]
[null,"PRAZO DE EXECUÇÃO:    180 DIAS",{"$nulls":4},"BDI Fornecimentos:",null,{"$f":"'BDI FORN'!D30/100","v":0.15}]
[null,"ITEM","DISCRIMINAÇÃO","REFER.","UNID.","QUANT.","P. UNITÁRIO","P.UNIT.C/ BDI","P. TOTAL",{"$f":"I53","v":3027243.89}]
["A",1,"SERVIÇOS PRELIMINARES ",{"$nulls":5},{"$f":"SUM(I10:I14)","v":202428.59999999998},{"$f":"I9/I53","v":6.6868943288213217E-2}]
[1,"1.1","MOBILIZAÇÃO E DESMOBILIZAÇÃO","CPU.1","GL",1,{"$f":"VLOOKUP(A10,CPU!$A$1:$N$4921,9)","v":14753.36},{"$f":"VLOOKUP(A10,CPU!$A$1:$N$4921,10)","v":17923.857064000003},{"$f":"ROUND(F10*H10,2)","v":17923.86},{"$f":"I10/$I$53","v":5.9208509955899196E-3}]
[2,"1.2","ADMINISTRAÇÃO LOCAL","CPU.2","GL",1,{"$f":"VLOOKUP(A11,CPU!$A$1:$N$4921,9)","v":130204.49999999999},{"$f":"VLOOKUP(A11,CPU!$A$1:$N$4921,10)","v":158185.44704999999},{"$f":"ROUND(F11*H11,2)","v":158185.45000000001},{"$f":"I11/I53","v":5.2253949713975643E-2}]
[3,"1.3","CANTEIRO DE OBRAS","CPU.3","GL",1,{"$f":"VLOOKUP(A12,CPU!$A$1:$N$4921,9)","v":13531.5},{"$f":"VLOOKUP(A12,CPU!$A$1:$N$4921,10)","v":16439.41935},{"$f":"ROUND(F12*H12,2)","v":16439.419999999998},{"$f":"I12/$I$53","v":5.4304907689482519E-3}]
[4,"1.4","PLACA DE OBRA EM CHAPA DE AÇO GALVANIZADO",103689,"M2",4.5,{"$f":"VLOOKUP(A13,CPU!$A$1:$N$4921,9)","v":340.5},{"$f":"VLOOKUP(A13,CPU!$A$1:$N$4921,10)","v":413.67345},{"$f":"ROUND(F13*H13,2)","v":1861.53},6.149256774947194E-4]
[5,"1.5","SERVIÇOS TOPOGRÁFICOS PARA PAVIMENTAÇÃO, INCLUSIVE NOTA DE SERVIÇO, ACOMPANHAMENTO E GREIDE",99064,"M2",20000,{"$f":"VLOOKUP(A14,CPU!$A$1:$N$4921,9)","v":0.32999999999999996},{"$f":"VLOOKUP(A14,CPU!$A$1:$N$4921,10)","v":0.40091699999999997},{"$f":"ROUND(F14*H14,2)","v":8018.34},2.6487261322046965E-3]
["B",2,"TERRAPLANAGEM E PAVIMENTAÇÃO",{"$nulls":5},{"$f":"SUM(I16:I24)","v":979031.87000000011},0.32340700173979048]
[6,"2.1","ESCAVAÇÃO HORIZONTAL EM SOLO DE 1A CATEGORIA COM TRATOR DE ESTEIRAS",101116,"M3",4200,{"$f":"VLOOKUP(A16,CPU!$A$1:$N$4921,9)","v":2.2000000000000002},{"$f":"VLOOKUP(A16,CPU!$A$1:$N$4921,10)","v":2.6727800000000004},{"$f":"ROUND(F16*H16,2)","v":11225.68},3.7082179064204831E-3]
[7,"2.2","CARGA, MANOBRA E DESCARGA DE SOLOS E MATERIAIS GRANULARES EM CAMINHÃO BASCULANTE - CARGA COM PÁ CARREGADEIRA E DESCARGA LIVRE",100976,"M3",4200,{"$f":"VLOOKUP(A17,CPU!$A$1:$N$4921,9)","v":8.7100000000000009},{"$f":"VLOOKUP(A17,CPU!$A$1:$N$4921,10)","v":10.581779000000003},{"$f":"ROUND(F17*H17,2)","v":44443.47},1.4681165976356136E-2]
[7.5,"2.3","EXECUÇÃO E COMPACTAÇÃO DE ATERRO COM SOLO PREDOMINANTEMENTE ARGILOSO - EXCLUSIVE SOLO, ESCAVAÇÃO, CARGA E TRANSPORTE",96385,"M3",2700,{"$f":"VLOOKUP(A18,CPU!$A$1:$N$4921,9)","v":11.77},{"$f":"VLOOKUP(A18,CPU!$A$1:$N$4921,10)","v":14.299373000000001},{"$f":"ROUND(F18*H18,2)","v":38608.31},1.2753617284532696E-2]
[8,"2.4","REGULARIZAÇÃO E COMPACTAÇÃO DE SUBLEITO",100576,"M2",20000,{"$f":"VLOOKUP(A19,CPU!$A$1:$N$4921,9)","v":2.57},{"$f":"VLOOKUP(A19,CPU!$A$1:$N$4921,10)","v":3.122293},{"$f":"ROUND(F19*H19,2)","v":62445.86},2.0627958059897183E-2]
[8.1,"2.4","EXECUÇÃO E COMPACTAÇÃO DE BASE E OU SUB BASE PARA PAVIMENTAÇÃO DE SOLO DE COMPORTAMENTO LATERÍTICO - EXCLUSIVE SOLO, ESCAVAÇÃO, CARGA E TRANSPORTE",96388,"M3",3600,{"$f":"VLOOKUP(A20,CPU!$A$1:$N$4921,9)","v":12.469999999999999},{"$f":"VLOOKUP(A20,CPU!$A$1:$N$4921,10)","v":15.149803},{"$f":"ROUND(F20*H20,2)","v":54539.29},1.8016153300420071E-2]
[8.1999999999999993,"2.5","IMPRIMAÇÃO COM EMULSÃO ASFÁLTICA (EAI)",96401,"M2",6300,{"$f":"VLOOKUP(A21,CPU!$A$1:$N$4921,9)","v":1.23},{"$f":"VLOOKUP(A21,CPU!$A$1:$N$4921,10)","v":1.49},{"$f":"ROUND(F21*H21,2)","v":9387},3.1008403488758879E-3]
[8.3000000000000007,"2.6","PINTURA DE LIGAÇÃO COM EMULSÃO ASFÁLTICA RR-2C",96402,"M2",6300,{"$f":"VLOOKUP(A22,CPU!$A$1:$N$4921,9)","v":1.01},{"$f":"VLOOKUP(A22,CPU!$A$1:$N$4921,10)","v":1.23},7749,2.5597541135015719E-3]
[8.4,"2.7","EXECUÇÃO DE PAVIMENTO COM APLICAÇÃO DE CONCRETO ASFÁLTICO, CAMADA DE ROLAMENTO - EXCLUSIVE CARGA E TRANSPORTE",95995,"M3",200,{"$f":"VLOOKUP(A23,CPU!$A$1:$N$4921,9)","v":129.6},{"$f":"VLOOKUP(A23,CPU!$A$1:$N$4921,10)","v":157.45104000000001},{"$f":"ROUND(F23*H23,2)","v":31490.21},1.0402270561689034E-2]
[9,"2.8","EXECUÇÃO DE PAVIMENTO EM PISO INTERTRAVADO, COM BLOCO DE CONCRETO DO TIPO 16 FACES DE 22 X 11CM, ESPESSURA 8 CM",92394,"M2",9600,{"$f":"VLOOKUP(A24,CPU!$A$1:$N$4921,9)","v":61.66},{"$f":"VLOOKUP(A24,CPU!$A$1:$N$4921,10)","v":74.910734000000005},{"$f":"ROUND(F24*H24,2)","v":719143.05},0.23755702418809738]
["C",3,"TRANSPORTE DE MATERIAIS",{"$nulls":5},{"$f":"SUM(I26:I27)","v":263511.81},{"$f":"I25/I53","v":8.7046772435636161E-2}]
[10,"3.1","TRANSPORTE COM CAMINHÃO BASCULANTE, EM VIA URBANA PAVIMENTADA",95427,"M3XKM",89999.995100000015,{"$f":"VLOOKUP(A26,CPU!$A$1:$N$4921,9)","v":0.73},{"$f":"VLOOKUP(A26,CPU!$A$1:$N$4921,10)","v":0.88687700000000003},{"$f":"ROUND(F26*H26,2)","v":79818.929999999993},{"$f":"I26/$I$53","v":2.6366864679674022E-2}]
[11,"3.2","TRANSPORTE COM CAMINHÃO CARROCERIA, EM VIA URBANA PAVIMENTADA",100948,"TXKM",179999.99957984002,{"$f":"VLOOKUP(A27,CPU!$A$1:$N$4921,9)","v":0.84},{"$f":"VLOOKUP(A27,CPU!$A$1:$N$4921,10)","v":1.020516},{"$f":"ROUND(F27*H27,2)","v":183692.88},{"$f":"I27/$I$53","v":6.0679907755962138E-2}]
["D",4,"DRENAGEM E OBRAS COMPLEMENTARES",{"$nulls":5},{"$f":"SUM(I29:I48)","v":1204486.55},{"$f":"I28/I53","v":0.39788223009676305}]
[12,"4.1","EXECUÇÃO DE PASSEIO (CALÇADA) OU PISO DE CONCRETO COM CONCRETO MOLDADO IN LOCO, FEITO EM OBRA, ACABAMENTO CONVENCIONAL, NÃO ARMADO.",94990,"M3",110,{"$f":"VLOOKUP(A29,CPU!$A$1:$N$4921,9)","v":773.45},{"$f":"VLOOKUP(A29,CPU!$A$1:$N$4921,10)","v":939.6644050000001},{"$f":"ROUND(F29*H29,2)","v":103363.08},{"$f":"I29/$I$53","v":3.4144285612878057E-2}]
[13,"4.2","GUIA (MEIO-FIO) E SARJETA CONJUGADOS DE CONCRETO, MOLDADA  IN LOCO  EM TRECHO RETO COM EXTRUSORA, 45 CM BASE (15 CM BASE DA GUIA + SARJETA (30 X 0,05))X 22 CM ALTURA",94267,"M",3300,{"$f":"VLOOKUP(A30,CPU!$A$1:$N$4921,9)","v":47.749999999999993},{"$f":"VLOOKUP(A30,CPU!$A$1:$N$4921,10)","v":58.011474999999997},{"$f":"ROUND(F30*H30,2)","v":191437.87},6.3238337232220818E-2]
{"$rows_left_out":24}
{"sheet":"CPU","index":1,"n_rows":690,"n_cols":13,"rows_kept":690,"cut":false,"hidden":false,"merged":[[109,0,124,0],[109,1,109,3],[109,4,109,7],[109,10,109,11],[110,2,110,5],[111,2,111,3],[112,1,112,7],[121,1,121,3],[121,5,121,6],[122,1,122,6],[123,1,123,6],[124,1,124,6],[621,1,621,6],[622,1,622,6],[602,0,623,0],[602,1,602,3],[602,4,602,7],[602,10,602,11],[603,2,603,5],[604,2,604,3],[605,1,605,7],[619,1,619,3],[619,5,619,6],[620,1,620,6],[583,0,601,0],[583,1,583,3],[583,4,583,7],[584,2,584,5],[585,2,585,3],[586,1,586,7],[597,1,597,3],[597,5,597,6],[598,1,598,6],[599,1,599,6],[600,1,600,6],[568,0,582,0],[568,1,568,3],[568,4,568,7],[569,2,569,5],[570,2,570,3],[571,1,571,7],[578,1,578,3],[578,5,578,6],[579,1,579,6],[580,1,580,6],[581,1,581,6],[553,0,567,0],[553,1,553,3],[553,4,553,7],[554,2,554,5],[555,2,555,3],[556,1,556,7],[563,1,563,3],[563,5,563,6],[564,1,564,6],[565,1,565,6],[566,1,566,6],[539,0,552,0],[539,1,539,3],[539,4,539,7],[540,2,540,5],[541,2,541,3],[542,1,542,7],[548,1,548,3],[548,5,548,6],[549,1,549,6],[550,1,550,6],[551,1,551,6],[505,0,538,0],[505,1,505,3],[505,4,505,7],[506,2,506,5],[507,2,507,3],[508,1,508,7],[534,1,534,3],[534,5,534,6],[535,1,535,6],[536,1,536,6],[537,1,537,6],[471,0,504,0],[471,1,471,3],[471,4,471,7],[472,2,472,5],[473,2,473,3],[474,1,474,7],[500,1,500,3],[500,5,500,6],[501,1,501,6],[502,1,502,6],[503,1,503,6],[438,0,470,0],[438,1,438,3],[438,4,438,7],[439,2,439,5],[440,2,440,3],[441,1,441,7],[466,1,466,3],[466,5,466,6],[467,1,467,6],[468,1,468,6],[469,1,469,6],[421,0,437,0],[421,1,421,3],[421,4,421,7],[422,2,422,5],[423,2,423,3],[424,1,424,7],[433,1,433,3],[433,5,433,6],[434,1,434,6],[435,1,435,6],[436,1,436,6],[404,0,420,0],[404,1,404,3],[404,4,404,7],[405,2,405,5],[406,2,406,3],[407,1,407,7],[416,1,416,3],[416,5,416,6],[417,1,417,6],[418,1,418,6],[419,1,419,6],[387,0,403,0],[387,1,387,3],[387,4,387,7],[388,2,388,5],[389,2,389,3],[390,1,390,7],[399,1,399,3],[399,5,399,6],[400,1,400,6],[401,1,401,6],[402,1,402,6],[371,0,386,0],[371,1,371,3],[371,4,371,7],[372,2,372,5],[373,2,373,3],[374,1,374,7],[382,1,382,3],[382,5,382,6],[383,1,383,6],[384,1,384,6],[385,1,385,6],[355,0,370,0],[355,1,355,3],[355,4,355,7],[356,2,356,5],[357,2,357,3],[358,1,358,7],[366,1,366,3],[366,5,366,6],[367,1,367,6],[368,1,368,6],[369,1,369,6],[341,0,354,0],[341,1,341,3],[341,4,341,7],[342,2,342,5],[343,2,343,3],[344,1,344,7],[350,1,350,3],[350,5,350,6],[351,1,351,6],[352,1,352,6],[353,1,353,6],[322,0,340,0],[322,1,322,3],[322,4,322,7],[323,2,323,5],[324,2,324,3],[325,1,325,7],[336,1,336,3],[336,5,336,6],[337,1,337,6],[338,1,338,6],[339,1,339,6],[303,0,321,0],[303,1,303,3],[303,4,303,7],[304,2,304,5],[305,2,305,3],[306,1,306,7],[317,1,317,3],[317,5,317,6],[318,1,318,6],[319,1,319,6],[320,1,320,6],[126,0,141,0],[241,2,241,3],[242,1,242,7],[252,1,252,3],[252,4,252,7],[252,10,252,11],[253,2,253,5],[254,2,254,3],[255,1,255,7],[143,0,159,0],[252,0,264,0],[199,0,219,0],[178,1,178,6],[179,1,179,6],[163,0,180,0],[163,1,163,3],[163,4,163,7],[163,10,163,11],[164,2,164,5],[165,2,165,3],[166,1,166,7],[176,1,176,3],[176,5,176,6],[177,1,177,6],[95,0,107,0],[95,1,95,3],[95,4,95,7],[96,2,96,5],[97,2,97,3],[98,1,98,7],[104,1,104,3],[104,5,104,6],[105,1,105,6],[106,1,106,6],[265,10,265,11],[266,2,266,5],[267,2,267,3],[268,1,268,7],[279,1,279,3],[279,5,279,6],[280,1,280,6],[281,1,281,6],[282,1,282,6],[0,0,14,0],[15,0,33,0],[34,0,47,0],[48,0,65,0],[66,0,81,0],[220,0,238,0],[247,1,247,3],[236,1,236,6],[237,1,237,6],[239,1,239,3],[239,4,239,7],[220,1,220,3],[220,4,220,7],[84,2,84,3],[85,1,85,7],[90,1,90,3],[0,1,0,3],[0,4,0,7],[239,0,251,0],[45,1,45,6],[46,1,46,6],[68,2,68,3],[107,1,107,6],[82,0,93,0],[239,10,239,11],[240,2,240,5],[143,1,143,3],[143,4,143,7],[143,10,143,11],[144,2,144,5],[145,2,145,3],[146,1,146,7],[158,1,158,3],[158,5,158,6],[159,1,159,6],[160,1,160,6],[161,1,161,6],[199,1,199,3],[199,4,199,7],[199,10,199,11],[200,2,200,5],[201,2,201,3],[202,1,202,7],[215,1,215,3],[215,5,215,6],[216,1,216,6],[217,1,217,6],[218,1,218,6],[0,10,0,11],[1,2,1,5],[2,2,2,3],[3,1,3,7],[10,1,10,3],[10,5,10,6],[11,1,11,6],[12,1,12,6],[13,1,13,6],[1,10,1,11],[15,1,15,3],[15,4,15,7],[15,10,15,11],[16,2,16,5],[17,2,17,3],[18,1,18,7],[29,1,29,3],[29,5,29,6],[61,5,61,6],[34,10,34,11],[35,2,35,5],[36,2,36,3],[37,1,37,7],[43,1,43,3],[30,1,30,6],[31,1,31,6],[32,1,32,6],[34,1,34,3],[34,4,34,7],[48,1,48,3],[48,4,48,7],[82,10,82,11],[83,2,83,5],[62,1,62,6],[63,1,63,6],[64,1,64,6],[66,1,66,3],[66,4,66,7],[66,10,66,11],[67,2,67,5],[43,5,43,6],[44,1,44,6],[247,5,247,6],[248,1,248,6],[249,1,249,6],[250,1,250,6],[48,10,48,11],[49,2,49,5],[50,2,50,3],[51,1,51,7],[61,1,61,3],[69,1,69,7],[77,1,77,3],[220,10,220,11],[221,2,221,5],[222,2,222,3],[223,1,223,7],[234,1,234,3],[234,5,234,6],[235,1,235,6],[126,10,126,11],[127,2,127,5],[128,2,128,3],[129,1,129,7],[300,1,300,6],[301,1,301,6],[90,5,90,6],[91,1,91,6],[77,5,77,6],[78,1,78,6],[79,1,79,6],[80,1,80,6],[82,1,82,3],[82,4,82,7],[262,1,262,6],[263,1,263,6],[92,1,92,6],[93,1,93,6],[138,1,138,3],[138,5,138,6],[139,1,139,6],[140,1,140,6],[141,1,141,6],[126,1,126,3],[126,4,126,7],[260,1,260,3],[260,5,260,6],[261,1,261,6],[265,0,283,0],[284,1,284,3],[284,4,284,7],[285,2,285,5],[286,2,286,3],[287,1,287,7],[298,1,298,3],[298,5,298,6],[299,1,299,6],[181,10,181,11],[181,4,181,7],[181,1,181,3],[656,1,656,6],[639,0,656,0],[639,1,639,3],[639,4,639,7],[640,2,640,5],[641,2,641,3],[642,1,642,7],[653,1,653,3],[653,5,653,6],[654,1,654,6],[655,1,655,6],[624,0,638,0],[624,1,624,3],[624,4,624,7],[625,2,625,5],[626,2,626,3],[627,1,627,7],[634,1,634,3],[634,5,634,6],[635,1,635,6],[636,1,636,6],[181,0,197,0],[658,0,667,0],[658,1,658,3],[658,4,658,7],[659,2,659,5],[660,2,660,3],[661,1,661,7],[664,1,664,3],[664,5,664,6],[665,1,665,6],[666,1,666,6],[667,1,667,6],[197,1,197,6],[196,1,196,6],[195,1,195,6],[194,5,194,6],[194,1,194,3],[184,1,184,7],[183,2,183,3],[182,2,182,5],[637,1,637,6],[284,0,302,0],[265,1,265,3],[265,4,265,7],[669,0,678,0],[669,1,669,3],[669,4,669,7],[670,2,670,5],[671,2,671,3],[672,1,672,7],[675,1,675,3],[675,5,675,6],[676,1,676,6],[677,1,677,6],[678,1,678,6],[680,0,689,0],[680,1,680,3],[680,4,680,7],[681,2,681,5],[682,2,682,3],[683,1,683,7],[686,1,686,3],[686,5,686,6],[687,1,687,6],[688,1,688,6],[689,1,689,6]]}
[1,"CODEVASF",null,null," COMPOSIÇÃO DE PREÇO UNITÁRIO",null,null,null,{"$f":"H12","v":14753.36},{"$f":"H14","v":17923.857064000003},"BDI CALCULADO:",null,{"$f":"ORÇAMENTO!I6","v":0.21489999999999998}]
[null,"OBRA:  ",{"$f":"ORÇAMENTO!C5","v":"DRENAGEM E PAVIMENTAÇÃO - PARQUE DE EXPOSIÇÕES - SERRO/MG (ITEM 1)"},null,null,null,"DATA: ",{"$f":"ORÇAMENTO!C6","v":"OUTUBRO/2023"},null,null,"BDI FORNECIMENTO:",null,{"$f":"ORÇAMENTO!I7","v":0.15}]
[null,"SERVIÇO:  ",{"$f":"VLOOKUP(A1,ORÇAMENTO!A10:I30,3)","v":"MOBILIZAÇÃO E DESMOBILIZAÇÃO"},null,"Referência:",{"$f":"VLOOKUP(A1,ORÇAMENTO!A10:I30,4)","v":"CPU.1"},"UNIDADE: ",{"$f":"VLOOKUP(A1,ORÇAMENTO!A10:I30,5)","v":"GL"}]
[]
[null,"TIPO ITEM","CODIGO ITEM","DESCRIÇÃO ITEM","UNIDADE ITEM","COEFICIENTE","PRECO UNITARIO","CUSTO TOTAL"]
[null,"COMPOSICAO",5824,"CAMINHÃO TOCO, PBT 16.000 KG, CARGA ÚTIL MÁX. 10.685 KG, DIST. ENTRE EIXOS 4,8 M, POTÊNCIA 189 CV, INCLUSIVE CARROCERIA FIXA ABERTA DE MADEIRA P/ TRANSPORTE GERAL DE CARGA SECA ","CHP",16,202.74,{"$f":"ROUNDDOWN(F6*G6,2)","v":3243.84},{"$nulls":4},"."]
[null,"COMPOSICAO",5826,"CAMINHÃO TOCO, PBT 16.000 KG, CARGA ÚTIL MÁX. 10.685 KG, DIST. ENTRE EIXOS 4,8 M, POTÊNCIA 189 CV, INCLUSIVE CARROCERIA FIXA ABERTA DE MADEIRA P/ TRANSPORTE GERAL DE CARGA SECA ","CHI",16,60.95,{"$f":"ROUNDDOWN(F7*G7,2)","v":975.2}]
[null,"COMPOSICAO",5914640,"TRANSPORTE COM CAVALO MECÂNICO COM SEMIRREBOQUE COM CAPACIDADE DE 30 T - RODOVIA PAVIMENTADA","T.KM",4354,0.57999999999999996,{"$f":"ROUNDDOWN(F8*G8,2)","v":2525.3200000000002}]
[null,"COMPOSIÇÃO",88316,"SERVENTE COM ENCARGOS COMPLEMENTARES","H",32,19.760000000000002,{"$f":"ROUNDDOWN(F9*G9,2)","v":632.32000000000005}]
[{"$nulls":7},{"$f":"ROUNDDOWN(F10*G10,2)","v":0}]
[null,"PRODUÇÃO DA EQUIPE",null,null,0.5,"CUSTO ",null,{"$f":"SUM(H6:H10)","v":7376.68}]
[null,"TOTAL",{"$nulls":5},{"$f":"H11/E11","v":14753.36},"OK"]
[null,"BDI                %",{"$nulls":5},{"$f":"1+$M$1","v":1.2149000000000001}]
[null,"TOTAL DO SERVIÇO - R$",{"$nulls":5},{"$f":"H12*H13","v":17923.857064000003}]
[]
[{"$f":"A1+1","v":2},"CODEVASF",null,null," COMPOSIÇÃO DE PREÇO UNITÁRIO",null,null,null,{"$f":"H31","v":130204.49999999999},{"$f":"H33","v":158185.44704999999}]
[null,"OBRA:  ",{"$f":"$C$2","v":"DRENAGEM E PAVIMENTAÇÃO - PARQUE DE EXPOSIÇÕES - SERRO/MG (ITEM 1)"},null,null,null,"DATA: ",{"$f":"$H$2","v":"OUTUBRO/2023"}]
[null,"SERVIÇO:  ",{"$f":"VLOOKUP(A16,ORÇAMENTO!$A$10:$I$30,3)","v":"ADMINISTRAÇÃO LOCAL"},null,"SINAPI","CPU","UNIDADE: ",{"$f":"VLOOKUP(A16,ORÇAMENTO!$A$10:$I$30,5)","v":"GL"},{"$f":"ORÇAMENTO!J11","v":5.2253949713975643E-2}]
[]
[null,"TIPO ITEM","CODIGO ITEM","DESCRIÇÃO ITEM","UNIDADE ITEM","COEFICIENTE","PRECO UNITARIO","CUSTO TOTAL"]
[null,"INSUMO",14250,"ENERGIA ELÉTRICA","kwh",50,0.94,{"$f":"ROUNDDOWN(F21*G21,2)","v":47}]
[null,"INSUMO",44480,"TARIFA FORNECIMENTO DE ÁGUA/ESGOTO ","M3",5,17.78,{"$f":"ROUNDDOWN(F22*G22,2)","v":88.9}]
[null,"COTAÇÃO","MERC.","TELEFONE (PLANO CONTROLE)","UNID",2,59.9,119.8]
[null,"COMPOSICAO",90777,"Engenheiro Civil Júnior com encargos complementares","H",55,114.12,6276.6]
[null,"COMPOSICAO",90776,"Encarregado Geral com encargos complementares","H",110,57.73,{"$f":"ROUNDDOWN(F25*G25,2)","v":6350.3}]
[null,"COMPOSICAO",88321,"Tecnico de Laboratório com encargos complementares","H",110,45.45,{"$f":"ROUNDDOWN(F26*G26,2)","v":4999.5}]
[null,"COMPOSICAO",100309,"Tecnico em Segurança do Trabalho com encargos complementares","H",55,45.71,{"$f":"ROUNDDOWN(F27*G27,2)","v":2514.0500000000002}]
[null,"COMPOSICAO",90772,"Auxiliar de escritório com encargos complementares","H",55,23.72,1304.5999999999999]
[{"$nulls":7},0]
[null,"PRODUÇÃO DA EQUIPE",null,null,{"$f":"1/6","v":0.16666666666666666},"CUSTO ",null,{"$f":"SUM(H21:H29)","v":21700.749999999996}]
{"$rows_left_out":661}
{"sheet":"BDI SERV","index":2,"n_rows":36,"n_cols":5,"rows_kept":36,"cut":false,"hidden":false,"merged":[[7,7,17,12],[35,0,35,5],[3,1,4,1],[3,2,4,2],[0,1,2,4],[31,0,33,5],[27,0,27,5],[29,1,29,2],[30,1,30,2]]}
[null,"DETALHAMENTO DO BDI - SERVIÇOS"]
[]
[]
[null,"Item","Descrição dos Serviços","%","%"]
[null,null,null,"PV","CD"]
[]
[null,1,"ADMINISTRAÇÃO CENTRAL"," ",4.01]
[null,"1.1","ESCRITÓRIO CENTRAL"," "," "]
[null,"1.2","VIAGENS"," "," "]
[null,"1.3","OUTROS"," "," "]
[null," "," "," "," "]
[null,2,"IMPOSTOS E TAXAS",{"$f":"SUM(D13:D15)","v":5.65},{"$f":"SUM(E13:E15)","v":7.0600000000000005}]
[null,"2.1","ISS (*)",{"$f":"4*0.5","v":2},{"$f":"ROUND(D13*1.2515,2)","v":2.5}]
[null,"2.2","PIS",0.65,{"$f":"ROUND(D14*1.2515,2)","v":0.81}]
[null,"2.3","Cofins",3,{"$f":"ROUND(D15*1.2515,2)","v":3.75}]
[]
[null,3,"TAXA DE RISCO"," ",{"$f":"SUM(E18:E21)","v":0.96}]
[null,"3.1","SEGURO",null,0.2]
[null,"3.2","RISCO",null,0.56000000000000005]
[null,"3.3","GARANTIA",null,0.2]
[]
[null,4,"DESPESAS FINANCEIRAS"," ",1.1100000000000001]
[]
[null,5,"LUCRO",null,8]
[]
[null," ","BDI - CALCULADO"," ",{"$f":"ROUND((((1+(E7+E17)/100)*(1+E22/100)*(1+E24/100)/(1-D12/100)-1)*100),2)","v":21.49}]
[]
["BDI = ((1+((AC+S+R+G)/100))x(1+DF/100)x(1+L/100)/(1-I/100)-1)*100"]
[]
[null,"BDI (CALCULADO):",null,{"$f":"ROUND((((1+((E7+E17)/100))*(1+E22/100)*(1+E24/100))/(1-D12/100)-1)*100,2)","v":21.49},"%"]
{"$rows_left_out":7}
{"sheet":"BDI FORN","index":3,"n_rows":36,"n_cols":5,"rows_kept":36,"cut":false,"hidden":false,"merged":[[7,7,17,12],[27,0,27,5],[29,1,29,2],[30,1,30,2],[31,0,33,5],[35,0,35,5],[0,1,2,4],[3,1,4,1],[3,2,4,2]]}
[null,"DETALHAMENTO DO BDI - FORNECIMENTOS"]
[]
[]
[null,"Item","Descrição dos Serviços","%","%"]
[null,null,null,"PV","CD"]
[]
[null,1,"ADMINISTRAÇÃO CENTRAL"," ",3.72]
[null,"1.1","ESCRITÓRIO CENTRAL"," "," "]
[null,"1.2","VIAGENS"," "," "]
[null,"1.3","OUTROS"," "," "]
[null," "," "," "," "]
[null,2,"IMPOSTOS E TAXAS",{"$f":"SUM(D13:D15)","v":3.65},{"$f":"SUM(E13:E15)","v":4.5600000000000005}]
[null,"2.1","ISS (*)",null,{"$f":"ROUND(D13*1.2515,2)","v":0}]
[null,"2.2","PIS",0.65,{"$f":"ROUND(D14*1.2515,2)","v":0.81}]
[null,"2.3","Cofins",3,{"$f":"ROUND(D15*1.2515,2)","v":3.75}]
[]
[null,3,"TAXA DE RISCO"," ",{"$f":"SUM(E18:E21)","v":0.82000000000000006}]
[null,"3.1","SEGURO",null,0.16]
[null,"3.2","RISCO",null,0.5]
[null,"3.3","GARANTIA",null,0.16]
[]
[null,4,"DESPESAS FINANCEIRAS"," ",0.94]
[]
[null,5,"LUCRO",null,5]
[]
[null," ","BDI - CALCULADO"," ",{"$f":"ROUND((((1+(E7+E17)/100)*(1+E22/100)*(1+E24/100)/(1-D12/100)-1)*100),2)","v":15}]
[]
["BDI = ((1+((AC+S+R+G)/100))x(1+DF/100)x(1+L/100)/(1-I/100)-1)*100"]
[]
[null,"BDI (CALCULADO):",null,{"$f":"ROUND((((1+((E7+E17)/100))*(1+E22/100)*(1+E24/100))/(1-D12/100)-1)*100,2)","v":15},"%"]
{"$rows_left_out":7}
{"sheet":"CRONOGRAMA","index":4,"n_rows":19,"n_cols":12,"rows_kept":19,"cut":false,"hidden":false,"merged":[[15,1,16,2],[18,1,22,11],[7,2,8,2],[9,2,10,2],[11,2,12,2],[7,1,8,1],[9,1,10,1],[11,1,12,1],[0,1,0,11],[1,6,1,11],[2,6,2,11],[3,1,3,6],[5,0,6,0],[5,2,6,2],[1,1,2,1],[5,1,6,1],[1,2,2,4],[13,0,14,0],[13,1,14,1],[13,2,14,2],[7,0,8,0],[9,0,10,0],[11,0,12,0]]}
[null,"CRONOGRAMA FÍSICO-FINANCEIRO"]
[null,"OBRA: ",{"$f":"ORÇAMENTO!C5","v":"DRENAGEM E PAVIMENTAÇÃO - PARQUE DE EXPOSIÇÕES - SERRO/MG (ITEM 1)"},null,null,"VALOR:",{"$f":"ORÇAMENTO!I53","v":3027243.89}]
[{"$nulls":5},"PRAZO: ","180 DIAS "]
[]
[null,"ITEM","ETAPAS/DESCRIÇAO","FISICO/  FINANCEIRO","TOTAL    ETAPAS","MÊS 1","MÊS 2","MÊS 3","MÊS 4","MÊS 5","MÊS 6","TOTAL"]
["A",{"$f":"VLOOKUP(A6,ORÇAMENTO!$A$9:$I$53,2)","v":1},{"$f":"VLOOKUP(A6,ORÇAMENTO!$A$9:$I$53,3)","v":"SERVIÇOS PRELIMINARES "},"FISICO ",{"$f":"ROUND(E7/$G$2,4)","v":6.6900000000000001E-2},0.15,0.2,0.2,0.2,0.2,0.05,{"$f":"SUM(F6:K6)","v":1}]
[null,null,null,"FINANCEIRO",{"$f":"ORÇAMENTO!I9","v":202428.59999999998},{"$f":"ROUND($E$7*F6,2)","v":30364.29},{"$f":"ROUND($E$7*G6,2)","v":40485.72},{"$f":"ROUND($E$7*H6,2)","v":40485.72},{"$f":"ROUND($E$7*I6,2)","v":40485.72},40485.72,10121.43,202428.6]
["B",{"$f":"VLOOKUP(A8,ORÇAMENTO!$A$9:$I$53,2)","v":2},{"$f":"VLOOKUP(A8,ORÇAMENTO!$A$9:$I$53,3)","v":"TERRAPLANAGEM E PAVIMENTAÇÃO"},"FISICO ",{"$f":"ROUND(E9/$G$2,4)","v":0.32340000000000002},0.2,0.2,0.2,0.2,0.2,0,1]
[null,null,null,"FINANCEIRO",{"$f":"ORÇAMENTO!I15","v":979031.87000000011},{"$f":"ROUND($E$9*F8,2)","v":195806.37},{"$f":"ROUND($E$9*G8,2)","v":195806.37},{"$f":"ROUND($E$9*H8,2)","v":195806.37},{"$f":"ROUND($E$9*I8,2)","v":195806.37},195806.37,0,979031.85]
["C",{"$f":"VLOOKUP(A10,ORÇAMENTO!$A$9:$I$53,2)","v":3},{"$f":"VLOOKUP(A10,ORÇAMENTO!$A$9:$I$53,3)","v":"TRANSPORTE DE MATERIAIS"},"FISICO ",{"$f":"ROUND(E11/$G$2,4)","v":8.6999999999999994E-2},0.2,0.2,0.2,0.2,0.2,0,1]
[null,null,null,"FINANCEIRO",{"$f":"ORÇAMENTO!I25","v":263511.81},{"$f":"ROUND($E$11*F10,2)","v":52702.36},{"$f":"ROUND($E$11*G10,2)","v":52702.36},{"$f":"ROUND($E$11*H10,2)","v":52702.36},{"$f":"ROUND($E$11*I10,2)","v":52702.36},52702.36,0,263511.8]
["D",{"$f":"VLOOKUP(A12,ORÇAMENTO!$A$9:$I$53,2)","v":4},{"$f":"VLOOKUP(A12,ORÇAMENTO!$A$9:$I$53,3)","v":"DRENAGEM E OBRAS COMPLEMENTARES"},"FISICO ",{"$f":"ROUND(E13/$G$2,4)","v":0.39789999999999998},0.2,0.2,0.2,0.2,0.1,0.1,1]
[null,null,null,"FINANCEIRO",{"$f":"ORÇAMENTO!I28","v":1204486.55},{"$f":"ROUND($E$13*F12,2)","v":240897.31},{"$f":"ROUND($E$13*G12,2)","v":240897.31},{"$f":"ROUND($E$13*H12,2)","v":240897.31},{"$f":"ROUND($E$13*I12,2)","v":240897.31},120448.66,120448.66,1204486.5599999998]
["E",{"$f":"VLOOKUP(A14,ORÇAMENTO!$A$9:$I$53,2)","v":5},{"$f":"VLOOKUP(A14,ORÇAMENTO!$A$9:$I$53,3)","v":"FORNECIMENTOS - MATERIAL ASFÁLTICO (BDI DIFERENCIADO)"},"FISICO ",{"$f":"ROUND(E15/$G$2,4)","v":0.12479999999999999},0.2,0.2,0.2,0.2,0.1,0.1,{"$f":"SUM(F14:K14)","v":1}]
[null,null,null,"FINANCEIRO",{"$f":"ORÇAMENTO!I49","v":377785.06},{"$f":"ROUND($E$15*F14,2)","v":75557.009999999995},75557.009999999995,75557.009999999995,75557.009999999995,37778.51,37778.51,377785.06]
[null,"TOTAL",null,"FISICO ",{"$f":"SUM(F16:K16)","v":0.99999999339333057},{"$f":"F17/E17","v":0.1966565501929215},{"$f":"G17/$E$17","v":0.19999999735733218},{"$f":"H17/$E$17","v":0.19999999735733218},{"$f":"I17/$E$17","v":0.19999999735733218},0.14773227273736442,5.5611178391047969E-2,0.99999999339333057]
[null,null,null,"FINANCEIRO",{"$f":"E11+E9+E7+E13+E15","v":3027243.89},{"$f":"F11+F9+F7+F13+F15","v":595327.34},{"$f":"G11+G9+G7+G13+G15","v":605448.77},{"$f":"H11+H9+H7+H13+H15","v":605448.77},605448.77,447221.62,168348.6,{"$f":"ROUNDUP(SUM(F17:K17),2)+0.02","v":3027243.89}]
[]
[null,"OBSERVAÇÕES:"]