{"text_format":"2","workbook":"xlsx","n_sheets":5,"sheets":["ORÇAMENTO","CPU","BDI SERV","BDI FORN","CRONOGRAMA"],"not_rendered":{"charts":0,"images":7,"macros":0,"external_links":0,"defined_names":5,"comments":1,"pivot_tables":0},"unopened":[],"bounds":{"document_bytes":16777216,"sheet_cells":100000,"run_cost":"one","rows_first":2000,"rows_last":500,"rows_between":2000,"halvings":0,"cell_chars":16384,"cell_head_chars":4096},"cells_cut":0,"cells_raw":0,"read":"whole","date_system":"1900"}

{"sheet":"ORÇAMENTO","index":0,"n_rows":53,"n_cols":10,"rows_kept":53,"cut":false,"hidden":false,"merged":[[6,6,6,7],[52,1,52,2],[0,0,7,0],[0,2,0,8],[1,2,1,8],[2,2,2,8],[4,2,4,8],[5,6,5,7]]}
["<---- NUMERAR SERVIÇOS PARA CPU",null,"Ministério do Desenvolvimento Regional"]
[null,null,"Companhia de Desenvolvimento dos Vales do São Francisco e do Parnaíba"]
[null,null,"1ª Superintendência Regional"]
[]
[null,"OBRA: ","DRENAGEM E PAVIMENTAÇÃO - PARQUE DE EXPOSIÇÕES - SERRO/MG (ITEM 1)"]
[null,"DATA:","OUTUBRO/2023",null,null,null,"BDI Serviços:",null,{"$f":"'BDI SERV'!D30/100","v":0.21489999999999998}]
[null,"PRAZO DE EXECUÇÃO:    180 DIAS",{"$nulls":4},"BDI Fornecimentos:",null,{"$f":"'BDI FORN'!D30/100","v":0.15}]
[null,"ITEM","DISCRIMINAÇÃO","REFER.","UNID.","QUANT.","P. UNITÁRIO","P.UNIT.C/ BDI","P. TOTAL",{"$f":"I53","v":3027243.89}]
["A",1,"SERVIÇOS PRELIMINARES ",{"$nulls":5},{"$f":"SUM(I10:I14)","v":202428.59999999998},{"$f":"I9/I53","v":6.6868943288213217E-2}]
[1,"1.1","MOBILIZAÇÃO E DESMOBILIZAÇÃO","CPU.1","GL",1,{"$f":"VLOOKUP(A10,CPU!$A$1:$N$4921,9)","v":14753.36},{"$f":"VLOOKUP(A10,CPU!$A$1:$N$4921,10)","v":17923.857064000003},{"$f":"ROUND(F10*H10,2)","v":17923.86},{"$f":"I10/$I$53","v":5.9208509955899196E-3}]
[2,"1.2","ADMINISTRAÇÃO LOCAL","CPU.2","GL",1,{"$f":"VLOOKUP(A11,CPU!$A$1:$N$4921,9)","v":130204.49999999999},{"$f":"VLOOKUP(A11,CPU!$A$1:$N$4921,10)","v":158185.44704999999},{"$f":"ROUND(F11*H11,2)","v":158185.45000000001},{"$f":"I11/I53","v":5.2253949713975643E-2}]
[3,"1.3","CANTEIRO DE OBRAS","CPU.3","GL",1,{"$f":"VLOOKUP(A12,CPU!$A$1:$N$4921,9)","v":13531.5},{"$f":"VLOOKUP(A12,CPU!$A$1:$N$4921,10)","v":16439.41935},{"$f":"ROUND(F12*H12,2)","v":16439.419999999998},{"$f":"I12/$I$53","v":5.4304907689482519E-3}]
[4,"1.4","PLACA DE OBRA EM CHAPA DE AÇO GALVANIZADO",103689,"M2",4.5,{"$f":"VLOOKUP(A13,CPU!$A$1:$N$4921,9)","v":340.5},{"$f":"VLOOKUP(A13,CPU!$A$1:$N$4921,10)","v":413.67345},{"$f":"ROUND(F13*H13,2)","v":1861.53},6.149256774947194E-4]
[5,"1.5","SERVIÇOS TOPOGRÁFICOS PARA PAVIMENTAÇÃO, INCLUSIVE NOTA DE SERVIÇO, ACOMPANHAMENTO E GREIDE",99064,"M2",20000,{"$f":"VLOOKUP(A14,CPU!$A$1:$N$4921,9)","v":0.32999999999999996},{"$f":"VLOOKUP(A14,CPU!$A$1:$N$4921,10)","v":0.40091699999999997},{"$f":"ROUND(F14*H14,2)","v":8018.34},2.6487261322046965E-3]
["B",2,"TERRAPLANAGEM E PAVIMENTAÇÃO",{"$nulls":5},{"$f":"SUM(I16:I24)","v":979031.87000000011},0.32340700173979048]
[6,"2.1","ESCAVAÇÃO HORIZONTAL EM SOLO DE 1A CATEGORIA COM TRATOR DE ESTEIRAS",101116,"M3",4200,{"$f":"VLOOKUP(A16,CPU!$A$1:$N$4921,9)","v":2.2000000000000002},{"$f":"VLOOKUP(A16,CPU!$A$1:$N$4921,10)","v":2.6727800000000004},{"$f":"ROUND(F16*H16,2)","v":11225.68},3.7082179064204831E-3]
[7,"2.2","CARGA, MANOBRA E DESCARGA DE SOLOS E MATERIAIS GRANULARES EM CAMINHÃO BASCULANTE - CARGA COM PÁ CARREGADEIRA E DESCARGA LIVRE",100976,"M3",4200,{"$f":"VLOOKUP(A17,CPU!$A$1:$N$4921,9)","v":8.7100000000000009},{"$f":"VLOOKUP(A17,CPU!$A$1:$N$4921,10)","v":10.581779000000003},{"$f":"ROUND(F17*H17,2)","v":44443.47},1.4681165976356136E-2]
[7.5,"2.3","EXECUÇÃO E COMPACTAÇÃO DE ATERRO COM SOLO PREDOMINANTEMENTE ARGILOSO - EXCLUSIVE SOLO, ESCAVAÇÃO, CARGA E TRANSPORTE",96385,"M3",2700,{"$f":"VLOOKUP(A18,CPU!$A$1:$N$4921,9)","v":11.77},{"$f":"VLOOKUP(A18,CPU!$A$1:$N$4921,10)","v":14.299373000000001},{"$f":"ROUND(F18*H18,2)","v":38608.31},1.2753617284532696E-2]
[8,"2.4","REGULARIZAÇÃO E COMPACTAÇÃO DE SUBLEITO",100576,"M2",20000,{"$f":"VLOOKUP(A19,CPU!$A$1:$N$4921,9)","v":2.57},{"$f":"VLOOKUP(A19,CPU!$A$1:$N$4921,10)","v":3.122293},{"$f":"ROUND(F19*H19,2)","v":62445.86},2.0627958059897183E-2]
[8.1,"2.4","EXECUÇÃO E COMPACTAÇÃO DE BASE E OU SUB BASE PARA PAVIMENTAÇÃO DE SOLO DE COMPORTAMENTO LATERÍTICO - EXCLUSIVE SOLO, ESCAVAÇÃO, CARGA E TRANSPORTE",96388,"M3",3600,{"$f":"VLOOKUP(A20,CPU!$A$1:$N$4921,9)","v":12.469999999999999},{"$f":"VLOOKUP(A20,CPU!$A$1:$N$4921,10)","v":15.149803},{"$f":"ROUND(F20*H20,2)","v":54539.29},1.8016153300420071E-2]
[8.1999999999999993,"2.5","IMPRIMAÇÃO COM EMULSÃO ASFÁLTICA (EAI)",96401,"M2",6300,{"$f":"VLOOKUP(A21,CPU!$A$1:$N$4921,9)","v":1.23},{"$f":"VLOOKUP(A21,CPU!$A$1:$N$4921,10)","v":1.49},{"$f":"ROUND(F21*H21,2)","v":9387},3.1008403488758879E-3]
[8.3000000000000007,"2.6","PINTURA DE LIGAÇÃO COM EMULSÃO ASFÁLTICA RR-2C",96402,"M2",6300,{"$f":"VLOOKUP(A22,CPU!$A$1:$N$4921,9)","v":1.01},{"$f":"VLOOKUP(A22,CPU!$A$1:$N$4921,10)","v":1.23},7749,2.5597541135015719E-3]
[8.4,"2.7","EXECUÇÃO DE PAVIMENTO COM APLICAÇÃO DE CONCRETO ASFÁLTICO, CAMADA DE ROLAMENTO - EXCLUSIVE CARGA E TRANSPORTE",95995,"M3",200,{"$f":"VLOOKUP(A23,CPU!$A$1:$N$4921,9)","v":129.6},{"$f":"VLOOKUP(A23,CPU!$A$1:$N$4921,10)","v":157.45104000000001},{"$f":"ROUND(F23*H23,2)","v":31490.21},1.0402270561689034E-2]
[9,"2.8","EXECUÇÃO DE PAVIMENTO EM PISO INTERTRAVADO, COM BLOCO DE CONCRETO DO TIPO 16 FACES DE 22 X 11CM, ESPESSURA 8 CM",92394,"M2",9600,{"$f":"VLOOKUP(A24,CPU!$A$1:$N$4921,9)","v":61.66},{"$f":"VLOOKUP(A24,CPU!$A$1:$N$4921,10)","v":74.910734000000005},{"$f":"ROUND(F24*H24,2)","v":719143.05},0.23755702418809738]
["C",3,"TRANSPORTE DE MATERIAIS",{"$nulls":5},{"$f":"SUM(I26:I27)","v":263511.81},{"$f":"I25/I53","v":8.7046772435636161E-2}]
[10,"3.1","TRANSPORTE COM CAMINHÃO BASCULANTE, EM VIA URBANA PAVIMENTADA",95427,"M3XKM",89999.995100000015,{"$f":"VLOOKUP(A26,CPU!$A$1:$N$4921,9)","v":0.73},{"$f":"VLOOKUP(A26,CPU!$A$1:$N$4921,10)","v":0.88687700000000003},{"$f":"ROUND(F26*H26,2)","v":79818.929999999993},{"$f":"I26/$I$53","v":2.6366864679674022E-2}]
[11,"3.2","TRANSPORTE COM CAMINHÃO CARROCERIA, EM VIA URBANA PAVIMENTADA",100948,"TXKM",179999.99957984002,{"$f":"VLOOKUP(A27,CPU!$A$1:$N$4921,9)","v":0.84},{"$f":"VLOOKUP(A27,CPU!$A$1:$N$4921,10)","v":1.020516},{"$f":"ROUND(F27*H27,2)","v":183692.88},{"$f":"I27/$I$53","v":6.0679907755962138E-2}]
["D",4,"DRENAGEM E OBRAS COMPLEMENTARES",{"$nulls":5},{"$f":"SUM(I29:I48)","v":1204486.55},{"$f":"I28/I53","v":0.39788223009676305}]
[12,"4.1","EXECUÇÃO DE PASSEIO (CALÇADA) OU PISO DE CONCRETO COM CONCRETO MOLDADO IN LOCO, FEITO EM OBRA, ACABAMENTO CONVENCIONAL, NÃO ARMADO.",94990,"M3",110,{"$f":"VLOOKUP(A29,CPU!$A$1:$N$4921,9)","v":773.45},{"$f":"VLOOKUP(A29,CPU!$A$1:$N$4921,10)","v":939.6644050000001},{"$f":"ROUND(F29*H29,2)","v":103363.08},{"$f":"I29/$I$53","v":3.4144285612878057E-2}]
[13,"4.2","GUIA (MEIO-FIO) E SARJETA CONJUGADOS DE CONCRETO, MOLDADA  IN LOCO  EM TRECHO RETO COM EXTRUSORA, 45 CM BASE (15 CM BASE DA GUIA + SARJETA (30 X 0,05))X 22 CM ALTURA",94267,"M",3300,{"$f":"VLOOKUP(A30,CPU!$A$1:$N$4921,9)","v":47.749999999999993},{"$f":"VLOOKUP(A30,CPU!$A$1:$N$4921,10)","v":58.011474999999997},{"$f":"ROUND(F30*H30,2)","v":191437.87},6.3238337232220818E-2]
[14,"4.3","GUIA (MEIO-FIO) CONCRETO, MOLDADA IN LOCO EM TRECHO RETO COM EXTRUSORA, 13 CM BASE X 22 CM ALTURA - PARA TRAVAMENTO",94263,"M",100,{"$f":"VLOOKUP(A31,CPU!$A$1:$N$4921,9)","v":35.590000000000003},{"$f":"VLOOKUP(A31,CPU!$A$1:$N$4921,10)","v":43.238291000000011},{"$f":"ROUND(F31*H31,2)","v":4323.83},1.4283057979844497E-3]
[15,"4.4","LOCAÇÃO DE REDE DE ÁGUA OU ESGOTO",99063,"M",900,{"$f":"VLOOKUP(A32,CPU!$A$1:$N$4921,9)","v":5.92},{"$f":"VLOOKUP(A32,CPU!$A$1:$N$4921,10)","v":7.1922080000000008},{"$f":"ROUND(F32*H32,2)","v":6472.99},2.1382452934771631E-3]
[16,"4.5","ESCAVAÇÃO MECANIZADA DE VALA COM PROFUNDIDADE ATÉ 1,5 M, EM SOLO DE 1A CATEGORIA",90105,"M3",1600,{"$f":"VLOOKUP(A33,CPU!$A$1:$N$4921,9)","v":9.34},{"$f":"VLOOKUP(A33,CPU!$A$1:$N$4921,10)","v":11.347166000000001},18155.47,5.9973595322047211E-3]
[17,"4.6","PREPARO DE FUNDO DE VALA COM LARGURA MENOR QUE 1,5 M (ACERTO DO SOLO NATURAL), INCLUSIVE LASTRO DE CONCRETO MAGRO PARA BERÇO","101616+\n95240","M2",1100,{"$f":"VLOOKUP(A34,CPU!$A$1:$N$4921,9)","v":59.33},{"$f":"VLOOKUP(A34,CPU!$A$1:$N$4921,10)","v":72.080016999999998},79288.02,2.6191487333384295E-2]
[18,"4.7","ESCORAMENTO DE VALA, TIPO PONTALETEAMENTO",101570,"M2",2700,{"$f":"VLOOKUP(A35,CPU!$A$1:$N$4921,9)","v":26.27},{"$f":"VLOOKUP(A35,CPU!$A$1:$N$4921,10)","v":31.915423000000001},86171.64,2.8465377462534081E-2]
[19,"4.8","TUBO DE CONCRETO PARA REDES COLETORAS DE ÁGUAS PLUVIAIS, DIÂMETRO DE 400 MM, JUNTA RÍGIDA - FORNECIMENTO E ASSENTAMENTO",92210,"M",450,{"$f":"VLOOKUP(A36,CPU!$A$1:$N$4921,9)","v":186.66999999999996},{"$f":"VLOOKUP(A36,CPU!$A$1:$N$4921,10)","v":226.78538299999997},102053.42,3.3711661071351602E-2]
[20,"4.9","TUBO DE CONCRETO PARA REDES COLETORAS DE ÁGUAS PLUVIAIS, DIÂMETRO DE 600 MM, JUNTA RÍGIDA - FORNECIMENTO E ASSENTAMENTO",92212,"M",320,{"$f":"VLOOKUP(A37,CPU!$A$1:$N$4921,9)","v":337.5100000000001},{"$f":"VLOOKUP(A37,CPU!$A$1:$N$4921,10)","v":410.04089900000014},{"$f":"ROUND(F37*H37,2)","v":131213.09},4.3344076251484315E-2]
[21,"4.10","TUBO DE CONCRETO PARA REDES COLETORAS DE ÁGUAS PLUVIAIS, DIÂMETRO DE 800 MM, JUNTA RÍGIDA - FORNECIMENTO E ASSENTAMENTO",92214,"M",130,{"$f":"VLOOKUP(A38,CPU!$A$1:$N$4921,9)","v":348.86},{"$f":"VLOOKUP(A38,CPU!$A$1:$N$4921,10)","v":423.83001400000006},55097.9,1.8200680884023521E-2]
[22,"4.11","CAIXA PARA BOCA DE LOBO COMBINADA COM GRELHA RETANGULAR, EM ALVENARIA COM BLOCOS DE CONCRETO, DIMENSÕES INTERNAS: 1,3X1X1,2 M.",97961,"UNID.",36,{"$f":"VLOOKUP(A39,CPU!$A$1:$N$4921,9)","v":2438.16},{"$f":"VLOOKUP(A39,CPU!$A$1:$N$4921,10)","v":2962.1205840000002},{"$f":"ROUND(F39*H39,2)","v":106636.34},3.5225552969899626E-2]
[23,"4.12","CAIXA PARA BOCA DE LOBO DUPLA COMBINADA COM GRELHA RETANGULAR, EM ALVENARIA COM BLOCOS DE CONCRETO, DIMENSÕES INTERNAS: 1,3X2,2X1,2 M",97973,"UNID.",12,{"$f":"VLOOKUP(A40,CPU!$A$1:$N$4921,9)","v":4583.45},{"$f":"VLOOKUP(A40,CPU!$A$1:$N$4921,10)","v":5568.4334049999998},{"$f":"ROUND(F40*H40,2)","v":66821.2},2.207327933528342E-2]
[24,"4.13","POÇO DE VISITA RETANGULAR PARA DRENAGEM, EM ALVENARIA COM BLOCOS DE CONCRETO, DIMENSÕES INTERNAS = 1X1 M, PROFUNDIDADE = 1,40 M, INCLUSIVE TAMPÃO EM FERRO FUNDIDO D = 600MM",99252,"UNID.",15,{"$f":"VLOOKUP(A41,CPU!$A$1:$N$4921,9)","v":2811.2100000000005},{"$f":"VLOOKUP(A41,CPU!$A$1:$N$4921,10)","v":3415.3390290000007},{"$f":"ROUND(F41*H41,2)","v":51230.09},1.692301375823406E-2]
[25,"4.14","BACIA DE DISSIPAÇÃO, TIPO BACIA EM PEDRA DE MÃO FIXADA COM CONCRETO (DEB 01, 02), COM PREPARO MANUAL, FCK = 20 MPA, LANÇADO MANUALMENTE, INCLUINDO MATERIAIS E FÔRMAS",103930,"M3",7.9999999999999991,{"$f":"VLOOKUP(A42,CPU!$A$1:$N$4921,9)","v":781.01},{"$f":"VLOOKUP(A42,CPU!$A$1:$N$4921,10)","v":948.84904900000004},{"$f":"ROUND(F42*H42,2)","v":7590.79},2.5074920541007352E-3]
[26,"4.15","ESCADA HIDRÁULICA, LARGURA ATÉ 1M, TIPO DESCIDA DÁGUA DE CORTE OU ATERRO EM DEGRAUS (DCD 02, 04 E DAD 02), EM CONCRETO USINADO, FCK = 20 MPA, INCLUINDO ARMAÇÃO, MATERIAIS E FÔRMAS",103925,"M3",15,{"$f":"VLOOKUP(A43,CPU!$A$1:$N$4921,9)","v":1523.0700000000002},{"$f":"VLOOKUP(A43,CPU!$A$1:$N$4921,10)","v":1850.3777430000002},27755.67,9.1686269783832972E-3]
[27,"4.16","REATERRO MANUAL DE VALAS COM COMPACTAÇÃO MECANIZADA",93382,"M3",1600,{"$f":"VLOOKUP(A44,CPU!$A$1:$N$4921,9)","v":25.169999999999998},{"$f":"VLOOKUP(A44,CPU!$A$1:$N$4921,10)","v":30.579032999999999},{"$f":"ROUND(F44*H44,2)","v":48926.45},1.6162044347209831E-2]
[28,"4.17","BOCA PARA BUEIRO SIMPLES TUBULAR D = 80 CM EM CONCRETO, ALAS COM ESCONSIDADE DE 0°, INCLUINDO FÔRMAS E MATERIAIS",102739,"UNID.",5,{"$f":"VLOOKUP(A45,CPU!$A$1:$N$4921,9)","v":3650.96},{"$f":"VLOOKUP(A45,CPU!$A$1:$N$4921,10)","v":4435.5513040000005},{"$f":"ROUND(F45*H45,2)","v":22177.759999999998},7.3260565735256957E-3]
[29,"4.18","FAIXA ELEVADA PARA TRAVESSIA DE PEDESTRES - CONF. PROJETO, INCLUSIVE PINTURA DE SINALIZAÇÃO","CPU.4","UNID.",7,{"$f":"VLOOKUP(A46,CPU!$A$1:$N$4921,9)","v":6466.73},{"$f":"VLOOKUP(A46,CPU!$A$1:$N$4921,10)","v":7856.4302770000004},{"$f":"ROUND(F46*H46,2)","v":54995.01},1.8166692872571954E-2]
[30,"4.19","ESTACA BROCA DE CONCRETO, DIÂMETRO DE 30CM, ESCAVAÇÃO MANUAL COM TRADO CONCHA, COM ARMADURA DE ARRANQUE",101175,"M",100,{"$f":"VLOOKUP(A47,CPU!$A$1:$N$4921,9)","v":113.27000000000001},{"$f":"VLOOKUP(A47,CPU!$A$1:$N$4921,10)","v":137.61172300000001},{"$f":"ROUND(F47*H47,2)","v":13761.17},4.5457751340940026E-3]
[31,"4.20","CONTENÇÃO EM CORTINA COM ESTACAS ESPAÇADAS COM 30 CM DE DIÂMETRO E PROFUNDIDADE MENOR OU IGUAL A 10 M.",98615,"M2",140,{"$f":"VLOOKUP(A48,CPU!$A$1:$N$4921,9)","v":158.82999999999998},{"$f":"VLOOKUP(A48,CPU!$A$1:$N$4921,10)","v":192.96256700000001},27014.76,8.9238796019173727E-3]
["E",5,"FORNECIMENTOS - MATERIAL ASFÁLTICO (BDI DIFERENCIADO)",{"$nulls":5},{"$f":"SUM(I50:I52)","v":377785.06},{"$f":"I49/I76","v":{"$error":"#DIV/0!"}}]
[34,"5.1","AQUISIÇÃO DE EMULSÃO ASFÁLTICA PARA IMPRIMAÇÃO (EAI) - EXCLUSIVE TRANSPORTE","CPU.7","T",8.1999999999999993,{"$f":"VLOOKUP(A50,CPU!$A$1:$N$4921,9)","v":2689.76},{"$f":"VLOOKUP(A50,CPU!$A$1:$N$4921,10)","v":3093.22},{"$f":"ROUND(F50*H50,2)","v":25364.400000000001},{"$f":"I50/$I$53","v":8.3787104447669725E-3}]
[35,"5.2","AQUISIÇÃO DE EMULSAO ASFALTICA CATIONICA RR-1C - EXCLUSIVE TRANSPORTE","CPU.8","T",2.8449999999999998,{"$f":"VLOOKUP(A51,CPU!$A$1:$N$4921,9)","v":2706.7},{"$f":"VLOOKUP(A51,CPU!$A$1:$N$4921,10)","v":3112.71},8855.66,2.9253209591910347E-3]
[36,"5.3","AQUISIÇÃO DE CONCRETO BETUMINOSO USINADO A QUENTE (CBUQ) PARA PAVIMENTACAO ASFALTICA, PADRAO DNIT, FAIXA C, COM CAP 50/70 - EXCLUSIVE TRANSPORTE","CPU.9","T",500.00000000000006,{"$f":"VLOOKUP(A52,CPU!$A$1:$N$4921,9)","v":597.5},{"$f":"VLOOKUP(A52,CPU!$A$1:$N$4921,10)","v":687.13},343565,0.11349102103563911]
[null,"TOTAL GERAL DA OBRA COM BDI ",{"$nulls":6},{"$f":"SUM(I9,I15,I25,I28,I49)","v":3027243.89},{"$f":"I53/F19","v":151.36219450000002}]

{"sheet":"CPU","index":1,"n_rows":690,"n_cols":13,"rows_kept":690,"cut":false,"hidden":false,"merged":[[109,0,124,0],[109,1,109,3],[109,4,109,7],[109,10,109,11],[110,2,110,5],[111,2,111,3],[112,1,112,7],[121,1,121,3],[121,5,121,6],[122,1,122,6],[123,1,123,6],[124,1,124,6],[621,1,621,6],[622,1,622,6],[602,0,623,0],[602,1,602,3],[602,4,602,7],[602,10,602,11],[603,2,603,5],[604,2,604,3],[605,1,605,7],[619,1,619,3],[619,5,619,6],[620,1,620,6],[583,0,601,0],[583,1,583,3],[583,4,583,7],[584,2,584,5],[585,2,585,3],[586,1,586,7],[597,1,597,3],[597,5,597,6],[598,1,598,6],[599,1,599,6],[600,1,600,6],[568,0,582,0],[568,1,568,3],[568,4,568,7],[569,2,569,5],[570,2,570,3],[571,1,571,7],[578,1,578,3],[578,5,578,6],[579,1,579,6],[580,1,580,6],[581,1,581,6],[553,0,567,0],[553,1,553,3],[553,4,553,7],[554,2,554,5],[555,2,555,3],[556,1,556,7],[563,1,563,3],[563,5,563,6],[564,1,564,6],[565,1,565,6],[566,1,566,6],[539,0,552,0],[539,1,539,3],[539,4,539,7],[540,2,540,5],[541,2,541,3],[542,1,542,7],[548,1,548,3],[548,5,548,6],[549,1,549,6],[550,1,550,6],[551,1,551,6],[505,0,538,0],[505,1,505,3],[505,4,505,7],[506,2,506,5],[507,2,507,3],[508,1,508,7],[534,1,534,3],[534,5,534,6],[535,1,535,6],[536,1,536,6],[537,1,537,6],[471,0,504,0],[471,1,471,3],[471,4,471,7],[472,2,472,5],[473,2,473,3],[474,1,474,7],[500,1,500,3],[500,5,500,6],[501,1,501,6],[502,1,502,6],[503,1,503,6],[438,0,470,0],[438,1,438,3],[438,4,438,7],[439,2,439,5],[440,2,440,3],[441,1,441,7],[466,1,466,3],[466,5,466,6],[467,1,467,6],[468,1,468,6],[469,1,469,6],[421,0,437,0],[421,1,421,3],[421,4,421,7],[422,2,422,5],[423,2,423,3],[424,1,424,7],[433,1,433,3],[433,5,433,6],[434,1,434,6],[435,1,435,6],[436,1,436,6],[404,0,420,0],[404,1,404,3],[404,4,404,7],[405,2,405,5],[406,2,406,3],[407,1,407,7],[416,1,416,3],[416,5,416,6],[417,1,417,6],[418,1,418,6],[419,1,419,6],[387,0,403,0],[387,1,387,3],[387,4,387,7],[388,2,388,5],[389,2,389,3],[390,1,390,7],[399,1,399,3],[399,5,399,6],[400,1,400,6],[401,1,401,6],[402,1,402,6],[371,0,386,0],[371,1,371,3],[371,4,371,7],[372,2,372,5],[373,2,373,3],[374,1,374,7],[382,1,382,3],[382,5,382,6],[383,1,383,6],[384,1,384,6],[385,1,385,6],[355,0,370,0],[355,1,355,3],[355,4,355,7],[356,2,356,5],[357,2,357,3],[358,1,358,7],[366,1,366,3],[366,5,366,6],[367,1,367,6],[368,1,368,6],[369,1,369,6],[341,0,354,0],[341,1,341,3],[341,4,341,7],[342,2,342,5],[343,2,343,3],[344,1,344,7],[350,1,350,3],[350,5,350,6],[351,1,351,6],[352,1,352,6],[353,1,353,6],[322,0,340,0],[322,1,322,3],[322,4,322,7],[323,2,323,5],[324,2,324,3],[325,1,325,7],[336,1,336,3],[336,5,336,6],[337,1,337,6],[338,1,338,6],[339,1,339,6],[303,0,321,0],[303,1,303,3],[303,4,303,7],[304,2,304,5],[305,2,305,3],[306,1,306,7],[317,1,317,3],[317,5,317,6],[318,1,318,6],[319,1,319,6],[320,1,320,6],[126,0,141,0],[241,2,241,3],[242,1,242,7],[252,1,252,3],[252,4,252,7],[252,10,252,11],[253,2,253,5],[254,2,254,3],[255,1,255,7],[143,0,159,0],[252,0,264,0],[199,0,219,0],[178,1,178,6],[179,1,179,6],[163,0,180,0],[163,1,163,3],[163,4,163,7],[163,10,163,11],[164,2,164,5],[165,2,165,3],[166,1,166,7],[176,1,176,3],[176,5,176,6],[177,1,177,6],[95,0,107,0],[95,1,95,3],[95,4,95,7],[96,2,96,5],[97,2,97,3],[98,1,98,7],[104,1,104,3],[104,5,104,6],[105,1,105,6],[106,1,106,6],[265,10,265,11],[266,2,266,5],[267,2,267,3],[268,1,268,7],[279,1,279,3],[279,5,279,6],[280,1,280,6],[281,1,281,6],[282,1,282,6],[0,0,14,0],[15,0,33,0],[34,0,47,0],[48,0,65,0],[66,0,81,0],[220,0,238,0],[247,1,247,3],[236,1,236,6],[237,1,237,6],[239,1,239,3],[239,4,239,7],[220,1,220,3],[220,4,220,7],[84,2,84,3],[85,1,85,7],[90,1,90,3],[0,1,0,3],[0,4,0,7],[239,0,251,0],[45,1,45,6],[46,1,46,6],[68,2,68,3],[107,1,107,6],[82,0,93,0],[239,10,239,11],[240,2,240,5],[143,1,143,3],[143,4,143,7],[143,10,143,11],[144,2,144,5],[145,2,145,3],[146,1,146,7],[158,1,158,3],[158,5,158,6],[159,1,159,6],[160,1,160,6],[161,1,161,6],[199,1,199,3],[199,4,199,7],[199,10,199,11],[200,2,200,5],[201,2,201,3],[202,1,202,7],[215,1,215,3],[215,5,215,6],[216,1,216,6],[217,1,217,6],[218,1,218,6],[0,10,0,11],[1,2,1,5],[2,2,2,3],[3,1,3,7],[10,1,10,3],[10,5,10,6],[11,1,11,6],[12,1,12,6],[13,1,13,6],[1,10,1,11],[15,1,15,3],[15,4,15,7],[15,10,15,11],[16,2,16,5],[17,2,17,3],[18,1,18,7],[29,1,29,3],[29,5,29,6],[61,5,61,6],[34,10,34,11],[35,2,35,5],[36,2,36,3],[37,1,37,7],[43,1,43,3],[30,1,30,6],[31,1,31,6],[32,1,32,6],[34,1,34,3],[34,4,34,7],[48,1,48,3],[48,4,48,7],[82,10,82,11],[83,2,83,5],[62,1,62,6],[63,1,63,6],[64,1,64,6],[66,1,66,3],[66,4,66,7],[66,10,66,11],[67,2,67,5],[43,5,43,6],[44,1,44,6],[247,5,247,6],[248,1,248,6],[249,1,249,6],[250,1,250,6],[48,10,48,11],[49,2,49,5],[50,2,50,3],[51,1,51,7],[61,1,61,3],[69,1,69,7],[77,1,77,3],[220,10,220,11],[221,2,221,5],[222,2,222,3],[223,1,223,7],[234,1,234,3],[234,5,234,6],[235,1,235,6],[126,10,126,11],[127,2,127,5],[128,2,128,3],[129,1,129,7],[300,1,300,6],[301,1,301,6],[90,5,90,6],[91,1,91,6],[77,5,77,6],[78,1,78,6],[79,1,79,6],[80,1,80,6],[82,1,82,3],[82,4,82,7],[262,1,262,6],[263,1,263,6],[92,1,92,6],[93,1,93,6],[138,1,138,3],[138,5,138,6],[139,1,139,6],[140,1,140,6],[141,1,141,6],[126,1,126,3],[126,4,126,7],[260,1,260,3],[260,5,260,6],[261,1,261,6],[265,0,283,0],[284,1,284,3],[284,4,284,7],[285,2,285,5],[286,2,286,3],[287,1,287,7],[298,1,298,3],[298,5,298,6],[299,1,299,6],[181,10,181,11],[181,4,181,7],[181,1,181,3],[656,1,656,6],[639,0,656,0],[639,1,639,3],[639,4,639,7],[640,2,640,5],[641,2,641,3],[642,1,642,7],[653,1,653,3],[653,5,653,6],[654,1,654,6],[655,1,655,6],[624,0,638,0],[624,1,624,3],[624,4,624,7],[625,2,625,5],[626,2,626,3],[627,1,627,7],[634,1,634,3],[634,5,634,6],[635,1,635,6],[636,1,636,6],[181,0,197,0],[658,0,667,0],[658,1,658,3],[658,4,658,7],[659,2,659,5],[660,2,660,3],[661,1,661,7],[664,1,664,3],[664,5,664,6],[665,1,665,6],[666,1,666,6],[667,1,667,6],[197,1,197,6],[196,1,196,6],[195,1,195,6],[194,5,194,6],[194,1,194,3],[184,1,184,7],[183,2,183,3],[182,2,182,5],[637,1,637,6],[284,0,302,0],[265,1,265,3],[265,4,265,7],[669,0,678,0],[669,1,669,3],[669,4,669,7],[670,2,670,5],[671,2,671,3],[672,1,672,7],[675,1,675,3],[675,5,675,6],[676,1,676,6],[677,1,677,6],[678,1,678,6],[680,0,689,0],[680,1,680,3],[680,4,680,7],[681,2,681,5],[682,2,682,3],[683,1,683,7],[686,1,686,3],[686,5,686,6],[687,1,687,6],[688,1,688,6],[689,1,689,6]]}
[1,"CODEVASF",null,null," COMPOSIÇÃO DE PREÇO UNITÁRIO",null,null,null,{"$f":"H12","v":14753.36},{"$f":"H14","v":17923.857064000003},"BDI CALCULADO:",null,{"$f":"ORÇAMENTO!I6","v":0.21489999999999998}]
[null,"OBRA:  ",{"$f":"ORÇAMENTO!C5","v":"DRENAGEM E PAVIMENTAÇÃO - PARQUE DE EXPOSIÇÕES - SERRO/MG (ITEM 1)"},null,null,null,"DATA: ",{"$f":"ORÇAMENTO!C6","v":"OUTUBRO/2023"},null,null,"BDI FORNECIMENTO:",null,{"$f":"ORÇAMENTO!I7","v":0.15}]
[null,"SERVIÇO:  ",{"$f":"VLOOKUP(A1,ORÇAMENTO!A10:I30,3)","v":"MOBILIZAÇÃO E DESMOBILIZAÇÃO"},null,"Referência:",{"$f":"VLOOKUP(A1,ORÇAMENTO!A10:I30,4)","v":"CPU.1"},"UNIDADE: ",{"$f":"VLOOKUP(A1,ORÇAMENTO!A10:I30,5)","v":"GL"}]
[]
[null,"TIPO ITEM","CODIGO ITEM","DESCRIÇÃO ITEM","UNIDADE ITEM","COEFICIENTE","PRECO UNITARIO","CUSTO TOTAL"]
[null,"COMPOSICAO",5824,"CAMINHÃO TOCO, PBT 16.000 KG, CARGA ÚTIL MÁX. 10.685 KG, DIST. ENTRE EIXOS 4,8 M, POTÊNCIA 189 CV, INCLUSIVE CARROCERIA FIXA ABERTA DE MADEIRA P/ TRANSPORTE GERAL DE CARGA SECA ","CHP",16,202.74,{"$f":"ROUNDDOWN(F6*G6,2)","v":3243.84},{"$nulls":4},"."]
[null,"COMPOSICAO",5826,"CAMINHÃO TOCO, PBT 16.000 KG, CARGA ÚTIL MÁX. 10.685 KG, DIST. ENTRE EIXOS 4,8 M, POTÊNCIA 189 CV, INCLUSIVE CARROCERIA FIXA ABERTA DE MADEIRA P/ TRANSPORTE GERAL DE CARGA SECA ","CHI",16,60.95,{"$f":"ROUNDDOWN(F7*G7,2)","v":975.2}]
[null,"COMPOSICAO",5914640,"TRANSPORTE COM CAVALO MECÂNICO COM SEMIRREBOQUE COM CAPACIDADE DE 30 T - RODOVIA PAVIMENTADA","T.KM",4354,0.57999999999999996,{"$f":"ROUNDDOWN(F8*G8,2)","v":2525.3200000000002}]
[null,"COMPOSIÇÃO",88316,"SERVENTE COM ENCARGOS COMPLEMENTARES","H",32,19.760000000000002,{"$f":"ROUNDDOWN(F9*G9,2)","v":632.32000000000005}]
[{"$nulls":7},{"$f":"ROUNDDOWN(F10*G10,2)","v":0}]
[null,"PRODUÇÃO DA EQUIPE",null,null,0.5,"CUSTO ",null,{"$f":"SUM(H6:H10)","v":7376.68}]
[null,"TOTAL",{"$nulls":5},{"$f":"H11/E11","v":14753.36},"OK"]
[null,"BDI                %",{"$nulls":5},{"$f":"1+$M$1","v":1.2149000000000001}]
[null,"TOTAL DO SERVIÇO - R$",{"$nulls":5},{"$f":"H12*H13","v":17923.857064000003}]
[]
[{"$f":"A1+1","v":2},"CODEVASF",null,null," COMPOSIÇÃO DE PREÇO UNITÁRIO",null,null,null,{"$f":"H31","v":130204.49999999999},{"$f":"H33","v":158185.44704999999}]
[null,"OBRA:  ",{"$f":"$C$2","v":"DRENAGEM E PAVIMENTAÇÃO - PARQUE DE EXPOSIÇÕES - SERRO/MG (ITEM 1)"},null,null,null,"DATA: ",{"$f":"$H$2","v":"OUTUBRO/2023"}]
[null,"SERVIÇO:  ",{"$f":"VLOOKUP(A16,ORÇAMENTO!$A$10:$I$30,3)","v":"ADMINISTRAÇÃO LOCAL"},null,"SINAPI","CPU","UNIDADE: ",{"$f":"VLOOKUP(A16,ORÇAMENTO!$A$10:$I$30,5)","v":"GL"},{"$f":"ORÇAMENTO!J11","v":5.2253949713975643E-2}]
[]
[null,"TIPO ITEM","CODIGO ITEM","DESCRIÇÃO ITEM","UNIDADE ITEM","COEFICIENTE","PRECO UNITARIO","CUSTO TOTAL"]
[null,"INSUMO",14250,"ENERGIA ELÉTRICA","kwh",50,0.94,{"$f":"ROUNDDOWN(F21*G21,2)","v":47}]
[null,"INSUMO",44480,"TARIFA FORNECIMENTO DE ÁGUA/ESGOTO ","M3",5,17.78,{"$f":"ROUNDDOWN(F22*G22,2)","v":88.9}]
[null,"COTAÇÃO","MERC.","TELEFONE (PLANO CONTROLE)","UNID",2,59.9,119.8]
[null,"COMPOSICAO",90777,"Engenheiro Civil Júnior com encargos complementares","H",55,114.12,6276.6]
[null,"COMPOSICAO",90776,"Encarregado Geral com encargos complementares","H",110,57.73,{"$f":"ROUNDDOWN(F25*G25,2)","v":6350.3}]
[null,"COMPOSICAO",88321,"Tecnico de Laboratório com encargos complementares","H",110,45.45,{"$f":"ROUNDDOWN(F26*G26,2)","v":4999.5}]
[null,"COMPOSICAO",100309,"Tecnico em Segurança do Trabalho com encargos complementares","H",55,45.71,{"$f":"ROUNDDOWN(F27*G27,2)","v":2514.0500000000002}]
[null,"COMPOSICAO",90772,"Auxiliar de escritório com encargos complementares","H",55,23.72,1304.5999999999999]
[{"$nulls":7},0]
[null,"PRODUÇÃO DA EQUIPE",null,null,{"$f":"1/6","v":0.16666666666666666},"CUSTO ",null,{"$f":"SUM(H21:H29)","v":21700.749999999996}]
[null,"TOTAL",{"$nulls":5},{"$f":"H30/E30","v":130204.49999999999},"OK"]
[null,"BDI                %",{"$nulls":5},{"$f":"1+$M$1","v":1.2149000000000001}]
[null,"TOTAL DO SERVIÇO - R$",{"$nulls":5},{"$f":"H31*H32","v":158185.44704999999}]
[]
[{"$f":"A16+1","v":3},"CODEVASF",null,null," COMPOSIÇÃO DE PREÇO UNITÁRIO",null,null,null,{"$f":"H45","v":13531.5},{"$f":"H47","v":16439.41935}]
[null,"OBRA:  ",{"$f":"$C$2","v":"DRENAGEM E PAVIMENTAÇÃO - PARQUE DE EXPOSIÇÕES - SERRO/MG (ITEM 1)"},null,null,null,"DATA: ",{"$f":"$H$2","v":"OUTUBRO/2023"}]
[null,"SERVIÇO:  ",{"$f":"VLOOKUP(A35,ORÇAMENTO!$A$10:$I$30,3)","v":"CANTEIRO DE OBRAS"},null,"SINAPI",{"$f":"VLOOKUP(A35,ORÇAMENTO!$A$10:$I$30,4)","v":"CPU.3"},"UNIDADE: ",{"$f":"VLOOKUP(A35,ORÇAMENTO!$A$10:$I$30,5)","v":"GL"}]
[]
[null,"TIPO ITEM","CODIGO ITEM","DESCRIÇÃO ITEM","UNIDADE ITEM","COEFICIENTE","PRECO UNITARIO","CUSTO TOTAL"]
[null,"COTAÇÃO",10775,"ALUGUEL DE IMÓVEL OU CONTEINER QUE ATENDA AOS REQUISITOS MÍNIMOS PARA INSTALAÇÃO DO CANTEIRO DE OBRAS ","MÊS",6,975,{"$f":"ROUNDDOWN(F40*G40,2)","v":5850}]
[null,"INSUMO",10779,"LOCACAO DE CONTAINER 2,30 X 4,30 M, ALT. 2,50 M, P/ SANITARIO, C/ 5 BACIAS, 1 LAVATORIO E 4 MICTORIOS","MÊS",6,1218.75,{"$f":"ROUNDDOWN(F41*G41,2)","v":7312.5}]
[null,"INSUMO","37525","TELA PLASTICA TECIDA LISTRADA BRANCA E LARANJA, TIPO GUARDA CORPO, EM POLIETILENO MONOFILADO, ROLO 1,20 X 50 M (L X C)","M",100,3.69,369]
[{"$nulls":7},0]
[null,"PRODUÇÃO DA EQUIPE",null,null,1,"CUSTO ",null,{"$f":"SUM(H40:H43)","v":13531.5}]
[null,"TOTAL",{"$nulls":5},{"$f":"H44/E44","v":13531.5},"OK"]
[null,"BDI                %",{"$nulls":5},{"$f":"1+$M$1","v":1.2149000000000001}]
[null,"TOTAL DO SERVIÇO - R$",{"$nulls":5},{"$f":"H45*H46","v":16439.41935}]
[]
[{"$f":"A35+1","v":4},"CODEVASF",null,null," COMPOSIÇÃO DE PREÇO UNITÁRIO",null,null,null,{"$f":"H63","v":340.5},{"$f":"H65","v":413.67345}]
[null,"OBRA:  ",{"$f":"$C$2","v":"DRENAGEM E PAVIMENTAÇÃO - PARQUE DE EXPOSIÇÕES - SERRO/MG (ITEM 1)"},null,null,null,"DATA: ",{"$f":"$H$2","v":"OUTUBRO/2023"}]
[null,"SERVIÇO:  ",{"$f":"VLOOKUP(A49,ORÇAMENTO!$A$10:$I$30,3)","v":"PLACA DE OBRA EM CHAPA DE AÇO GALVANIZADO"},null,"SINAPI",{"$f":"VLOOKUP(A49,ORÇAMENTO!$A$10:$I$30,4)","v":103689},"UNIDADE: ",{"$f":"VLOOKUP(A49,ORÇAMENTO!$A$10:$I$30,5)","v":"M2"}]
[]
[null,"TIPO ITEM","CODIGO ITEM","DESCRIÇÃO ITEM","UNIDADE ITEM","COEFICIENTE","PRECO UNITARIO","CUSTO TOTAL"]
[null,"INSUMO","4509","SARRAFO *2,5 X 10* CM EM PINUS, MISTA OU EQUIVALENTE DA REGIAO - BRUTA","M","3,2083000","4,41",{"$f":"ROUNDDOWN(F54*G54,2)","v":14.14}]
[null,"INSUMO","4813","PLACA DE OBRA (PARA CONSTRUCAO CIVIL) EM CHAPA GALVANIZADA *N. 22*, ADESIVADA, DE *2,4 X 1,2* M (SEM POSTES PARA FIXACAO)","M2","1,0000000","250,00",{"$f":"ROUNDDOWN(F55*G55,2)","v":250}]
[null,"INSUMO","5065","PREGO DE ACO POLIDO COM CABECA 10 X 10 ","KG","0,0113000","36,57",0.41]
[null,"INSUMO","5069","PREGO DE ACO POLIDO COM CABECA 17 X 27 ","KG","0,0132000","19,59",0.25]
[null,"COMPOSICAO","88262","CARPINTEIRO DE FORMAS COM ENCARGOS COMPLEMENTARES","H","0,3729000","27,05",10.08]
[null,"COMPOSICAO","88316","SERVENTE COM ENCARGOS COMPLEMENTARES","H","1,1186000","19,76",22.1]
[null,"COMPOSICAO",4115,"MADEIRA ROLICA TRATADA, D = 12 A 15 CM, H = 3,00 M, EM EUCALIPTO OU EQUIVALENTE","M",2,21.76,{"$f":"ROUNDDOWN(F60*G60,2)","v":43.52}]
[{"$nulls":7},0]
[null,"PRODUÇÃO DA EQUIPE",null,null,1,"CUSTO ",null,{"$f":"SUM(H54:H61)","v":340.5}]
[null,"TOTAL",{"$nulls":5},{"$f":"H62/E62","v":340.5},"OK"]
[null,"BDI                %",{"$nulls":5},{"$f":"1+$M$1","v":1.2149000000000001}]
[null,"TOTAL DO SERVIÇO - R$",{"$nulls":5},{"$f":"H63*H64","v":413.67345}]
[]
[{"$f":"A49+1","v":5},"CODEVASF",null,null," COMPOSIÇÃO DE PREÇO UNITÁRIO",null,null,null,{"$f":"H79","v":0.32999999999999996},{"$f":"H81","v":0.40091699999999997}]
[null,"OBRA:  ",{"$f":"$C$2","v":"DRENAGEM E PAVIMENTAÇÃO - PARQUE DE EXPOSIÇÕES - SERRO/MG (ITEM 1)"},null,null,null,"DATA: ",{"$f":"$H$2","v":"OUTUBRO/2023"}]
[null,"SERVIÇO:  ",{"$f":"VLOOKUP(A67,ORÇAMENTO!$A$10:$I$30,3)","v":"SERVIÇOS TOPOGRÁFICOS PARA PAVIMENTAÇÃO, INCLUSIVE NOTA DE SERVIÇO, ACOMPANHAMENTO E GREIDE"},null,"SINAPI",{"$f":"VLOOKUP(A67,ORÇAMENTO!$A$10:$I$30,4)","v":99064},"UNIDADE: ",{"$f":"VLOOKUP(A67,ORÇAMENTO!$A$10:$I$30,5)","v":"M2"}]
[]
[null,"TIPO ITEM","CODIGO ITEM","DESCRIÇÃO ITEM","UNIDADE ITEM","COEFICIENTE","PRECO UNITARIO","CUSTO TOTAL"]
[null,"COMPOSICAO",88253,"AUXILIAR DE TOPÓGRAFO COM ENCARGOS COMPLEMENTARES","H",2.5000000000000001E-3,21.57,{"$f":"ROUNDDOWN(F72*G72,2)","v":0.05}]
[null,"COMPOSICAO",88288,"NIVELADOR COM ENCARGOS COMPLEMENTARES","H",2.5000000000000001E-3,26.99,{"$f":"ROUNDDOWN(F73*G73,2)","v":0.06}]
[null,"COMPOSICAO",88316,"SERVENTE COM ENCARGOS COMPLEMENTARES","H",7.4999999999999997E-3,19.760000000000002,0.14000000000000001]
[null,"COMPOSICAO",88597,"DESENHISTA DETALHISTA COM ENCARGOS COMPLEMENTARES ","H",2E-3,29.72,0.05]
[null,"COMPOSICAO",92145,"CAMINHONETE CABINE SIMPLES COM MOTOR 1.6 FLEX, CÂMBIO MANUAL, POTÊNCIA 101/104 CV, 2 PORTAS","CHP",5.0000000000000001E-4,75.75,0.03]
[{"$nulls":7},0]
[null,"PRODUÇÃO DA EQUIPE",null,null,1,"CUSTO ",null,{"$f":"SUM(H72:H77)","v":0.32999999999999996}]
[null,"TOTAL",{"$nulls":5},{"$f":"H78/E78","v":0.32999999999999996},"OK"]
[null,"BDI                %",{"$nulls":5},{"$f":"1+$M$1","v":1.2149000000000001}]
[null,"TOTAL DO SERVIÇO - R$",{"$nulls":5},{"$f":"H79*H80","v":0.40091699999999997}]
[]
[{"$f":"A67+1","v":6},"CODEVASF",null,null," COMPOSIÇÃO DE PREÇO UNITÁRIO",null,null,null,{"$f":"H92","v":2.2000000000000002},{"$f":"H94","v":2.6727800000000004}]
[null,"OBRA:  ",{"$f":"$C$2","v":"DRENAGEM E PAVIMENTAÇÃO - PARQUE DE EXPOSIÇÕES - SERRO/MG (ITEM 1)"},null,null,null,"DATA: ",{"$f":"$H$2","v":"OUTUBRO/2023"}]
[null,"SERVIÇO:  ",{"$f":"VLOOKUP(A83,ORÇAMENTO!$A$10:$I$30,3)","v":"ESCAVAÇÃO HORIZONTAL EM SOLO DE 1A CATEGORIA COM TRATOR DE ESTEIRAS"},null,"SINAPI",{"$f":"VLOOKUP(A83,ORÇAMENTO!$A$10:$I$30,4)","v":101116},"UNIDADE: ",{"$f":"VLOOKUP(A83,ORÇAMENTO!$A$10:$I$30,5)","v":"M3"}]
[]
[null,"TIPO ITEM","CODIGO ITEM","DESCRIÇÃO ITEM","UNIDADE ITEM","COEFICIENTE","PRECO UNITARIO","CUSTO TOTAL"]
[null,"COMPOSICAO",5847,"TRATOR DE ESTEIRAS, POTÊNCIA 170 HP, PESO OPERACIONAL 19 T, CAÇAMBA 5,2 M3 ","CHP","0,0048000","253,93",{"$f":"ROUNDDOWN(F88*G88,2)","v":1.21}]
[null,"COMPOSICAO",5849,"TRATOR DE ESTEIRAS, POTÊNCIA 170 HP, PESO OPERACIONAL 19 T, CAÇAMBA 5,2 M3","CHI","0,0082000","90,40",{"$f":"ROUNDDOWN(F89*G89,2)","v":0.74}]
[null,"COMPOSICAO",88316,"SERVENTE COM ENCARGOS COMPLEMENTARES","H","0,0131000","19,76",{"$f":"ROUNDDOWN(F90*G90,2)","v":0.25}]
[null,"PRODUÇÃO DA EQUIPE",null,null,1,"CUSTO ",null,{"$f":"SUM(H88:H90)","v":2.2000000000000002}]
[null,"TOTAL",{"$nulls":5},{"$f":"H91/E91","v":2.2000000000000002},"OK"]
[null,"BDI                %",{"$nulls":5},{"$f":"1+$M$1","v":1.2149000000000001}]
[null,"TOTAL DO SERVIÇO - R$",{"$nulls":5},{"$f":"H92*H93","v":2.6727800000000004}]
[]
[7,"CODEVASF",null,null," COMPOSIÇÃO DE PREÇO UNITÁRIO",null,null,null,{"$f":"H106","v":8.7100000000000009},{"$f":"H108","v":10.581779000000003}]
[null,"OBRA:  ",{"$f":"$C$2","v":"DRENAGEM E PAVIMENTAÇÃO - PARQUE DE EXPOSIÇÕES - SERRO/MG (ITEM 1)"},null,null,null,"DATA: ",{"$f":"$H$2","v":"OUTUBRO/2023"}]
[null,"SERVIÇO:  ",{"$f":"VLOOKUP(A96,ORÇAMENTO!$A$10:$I$30,3)","v":"CARGA, MANOBRA E DESCARGA DE SOLOS E MATERIAIS GRANULARES EM CAMINHÃO BASCULANTE - CARGA COM PÁ CARREGADEIRA E DESCARGA LIVRE"},null,"SINAPI",{"$f":"VLOOKUP(A96,ORÇAMENTO!$A$10:$I$30,4)","v":100976},"UNIDADE: ",{"$f":"VLOOKUP(A96,ORÇAMENTO!$A$10:$I$30,5)","v":"M3"}]
[]
[null,"TIPO ITEM","CODIGO ITEM","DESCRIÇÃO ITEM","UNIDADE ITEM","COEFICIENTE","PRECO UNITARIO","CUSTO TOTAL"]
[null,"COMPOSICAO",5940,"PÁ CARREGADEIRA SOBRE RODAS, POTÊNCIA LÍQUIDA 128 HP, CAPACIDADE DA CAÇAMBA 1,7 A 2,8 M3, PESO OPERACIONAL 11632 KG","CHP","0,0083000","217,72",{"$f":"ROUNDDOWN(F101*G101,2)","v":1.8}]
[null,"COMPOSICAO",5942,"PÁ CARREGADEIRA SOBRE RODAS, POTÊNCIA LÍQUIDA 128 HP, CAPACIDADE DA CAÇAMBA 1,7 A 2,8 M3, PESO OPERACIONAL 11632 KG","CHI","0,0074000","95,85",{"$f":"ROUNDDOWN(F102*G102,2)","v":0.7}]
[null,"COMPOSICAO",89883,"CAMINHÃO BASCULANTE 18 M3, COM CAVALO MECÂNICO DE CAPACIDADE MÁXIMA DE TRAÇÃO COMBINADO DE 45000 KG, POTÊNCIA 330 CV, INCLUSIVE SEMIREBOQUE COM CAÇAMBA METÁLICA","CHP","0,0153000","348,45",{"$f":"ROUNDDOWN(F103*G103,2)","v":5.33}]
[null,"COMPOSICAO",89884,"CAMINHÃO BASCULANTE 18 M3, COM CAVALO MECÂNICO DE CAPACIDADE MÁXIMA DE TRAÇÃO COMBINADO DE 45000 KG, POTÊNCIA 330 CV, INCLUSIVE SEMIREBOQUE COM CAÇAMBA METÁLICA","CHI","0,0095000","93,65",{"$f":"ROUNDDOWN(F104*G104,2)","v":0.88}]
[null,"PRODUÇÃO DA EQUIPE",null,null,1,"CUSTO ",null,{"$f":"SUM(H101:H104)","v":8.7100000000000009}]
[null,"TOTAL",{"$nulls":5},{"$f":"H105/E105","v":8.7100000000000009},"OK"]
[null,"BDI                %",{"$nulls":5},{"$f":"1+$M$1","v":1.2149000000000001}]
[null,"TOTAL DO SERVIÇO - R$",{"$nulls":5},{"$f":"H106*H107","v":10.581779000000003}]
[]
[7.5,"CODEVASF",null,null," COMPOSIÇÃO DE PREÇO UNITÁRIO",null,null,null,{"$f":"H123","v":11.77},{"$f":"H125","v":14.299373000000001}]
[null,"OBRA:  ",{"$f":"$C$2","v":"DRENAGEM E PAVIMENTAÇÃO - PARQUE DE EXPOSIÇÕES - SERRO/MG (ITEM 1)"},null,null,null,"DATA: ",{"$f":"$H$2","v":"OUTUBRO/2023"}]
[null,"SERVIÇO:  ",{"$f":"VLOOKUP(A110,ORÇAMENTO!$A$10:$I$30,3)","v":"EXECUÇÃO E COMPACTAÇÃO DE ATERRO COM SOLO PREDOMINANTEMENTE ARGILOSO - EXCLUSIVE SOLO, ESCAVAÇÃO, CARGA E TRANSPORTE"},null,"SINAPI",{"$f":"VLOOKUP(A110,ORÇAMENTO!$A$10:$I$30,4)","v":96385},"UNIDADE: ",{"$f":"VLOOKUP(A110,ORÇAMENTO!$A$10:$I$30,5)","v":"M3"}]
[]
[null,"TIPO ITEM","CODIGO ITEM","DESCRIÇÃO ITEM","UNIDADE ITEM","COEFICIENTE","PRECO UNITARIO","CUSTO TOTAL"]
[null,"COMPOSICAO","5901","CAMINHÃO PIPA 10.000 L TRUCADO, PESO BRUTO TOTAL 23.000 KG, CARGA ÚTIL MÁXIMA 15.935 KG, DISTÂNCIA ENTRE EIXOS 4,8 M, POTÊNCIA 230 CV, INCLUSIVE TANQUE DE AÇO PARA TRANSPORTE DE ÁGUA","CHP","0,0040000","294,94",{"$f":"ROUNDDOWN(F115*G115,2)","v":1.17}]
[null,"COMPOSICAO","5903","CAMINHÃO PIPA 10.000 L TRUCADO, PESO BRUTO TOTAL 23.000 KG, CARGA ÚTIL MÁXIMA 15.935 KG, DISTÂNCIA ENTRE EIXOS 4,8 M, POTÊNCIA 230 CV, INCLUSIVE TANQUE DE AÇO PARA TRANSPORTE DE ÁGUA","CHI","0,0300000","72,55",2.17]
[null,"COMPOSICAO","5932","MOTONIVELADORA POTÊNCIA BÁSICA LÍQUIDA (PRIMEIRA MARCHA) 125 HP, PESO BRUTO 13032 KG, LARGURA DA LÂMINA DE 3,7 M","CHP","0,0060000","262,71",1.57]
[null,"COMPOSICAO","5934","MOTONIVELADORA POTÊNCIA BÁSICA LÍQUIDA (PRIMEIRA MARCHA) 125 HP, PESO BRUTO 13032 KG, LARGURA DA LÂMINA DE 3,7 M ","CHI","0,0270000","109,40",2.95]
[null,"COMPOSICAO","73436","ROLO COMPACTADOR VIBRATÓRIO PÉ DE CARNEIRO PARA SOLOS, POTÊNCIA 80 HP, PESO OPERACIONAL SEM/COM LASTRO 7,4 / 8,8 T","CHP","0,0100000","163,19",1.63]
[null,"COMPOSICAO","88316","SERVENTE COM ENCARGOS COMPLEMENTARES","H","0,0330000","19,76",0.65]
[null,"COMPOSICAO","93244","ROLO COMPACTADOR VIBRATÓRIO PÉ DE CARNEIRO PARA SOLOS, POTÊNCIA 80 HP, PESO OPERACIONAL SEM/COM LASTRO 7,4 / 8,8 T","CHI","0,0230000","71,18",1.63]
[null,"PRODUÇÃO DA EQUIPE",null,null,1,"CUSTO ",null,{"$f":"SUM(H115:H121)","v":11.77}]
[null,"TOTAL",{"$nulls":5},{"$f":"H122/E122","v":11.77},"OK"]
[null,"BDI                %",{"$nulls":5},{"$f":"1+$M$1","v":1.2149000000000001}]
[null,"TOTAL DO SERVIÇO - R$",{"$nulls":5},{"$f":"H123*H124","v":14.299373000000001}]
[]
[8,"CODEVASF",null,null," COMPOSIÇÃO DE PREÇO UNITÁRIO",null,null,null,{"$f":"H140","v":2.57},{"$f":"H142","v":3.122293}]
[null,"OBRA:  ",{"$f":"$C$2","v":"DRENAGEM E PAVIMENTAÇÃO - PARQUE DE EXPOSIÇÕES - SERRO/MG (ITEM 1)"},null,null,null,"DATA: ",{"$f":"$H$2","v":"OUTUBRO/2023"}]
[null,"SERVIÇO:  ",{"$f":"VLOOKUP(A127,ORÇAMENTO!$A$10:$I$30,3)","v":"REGULARIZAÇÃO E COMPACTAÇÃO DE SUBLEITO"},null,"SINAPI",{"$f":"VLOOKUP(A127,ORÇAMENTO!$A$10:$I$30,4)","v":100576},"UNIDADE: ",{"$f":"VLOOKUP(A127,ORÇAMENTO!$A$10:$I$30,5)","v":"M2"}]
[]
[null,"TIPO ITEM","CODIGO ITEM","DESCRIÇÃO ITEM","UNIDADE ITEM","COEFICIENTE","PRECO UNITARIO","CUSTO TOTAL"]
[null,"COMPOSICAO",5901,"CAMINHÃO PIPA 10.000 L TRUCADO, PESO BRUTO TOTAL 23.000 KG, CARGA ÚTIL MÁXIMA 15.935 KG, DISTÂNCIA ENTRE EIXOS 4,8 M, POTÊNCIA 230 CV, INCLUSIVE TANQUE DE AÇO PARA TRANSPORTE DE ÁGUA ","CHP","0,0010000","294,94",{"$f":"ROUNDDOWN(F132*G132,2)","v":0.28999999999999998}]
[null,"COMPOSICAO",5903,"CAMINHÃO PIPA 10.000 L TRUCADO, PESO BRUTO TOTAL 23.000 KG, CARGA ÚTIL MÁXIMA 15.935 KG, DISTÂNCIA ENTRE EIXOS 4,8 M, POTÊNCIA 230 CV, INCLUSIVE TANQUE DE AÇO PARA TRANSPORTE DE ÁGUA ","CHI","0,0070000","72,55",0.5]
[null,"COMPOSICAO",5932,"MOTONIVELADORA POTÊNCIA BÁSICA LÍQUIDA (PRIMEIRA MARCHA) 125 HP, PESO BRUTO 13032 KG, LARGURA DA LÂMINA DE 3,7 M ","CHP","0,0001000","262,71",0.02]
[null,"COMPOSICAO",5934,"MOTONIVELADORA POTÊNCIA BÁSICA LÍQUIDA (PRIMEIRA MARCHA) 125 HP, PESO BRUTO 13032 KG, LARGURA DA LÂMINA DE 3,7 M ","CHI","0,0080000","109,40",0.87]
[null,"COMPOSICAO",73436,"ROLO COMPACTADOR VIBRATÓRIO PÉ DE CARNEIRO PARA SOLOS, POTÊNCIA 80 HP, PESO OPERACIONAL SEM/COM LASTRO 7,4 / 8,8 T, LARGURA DE TRABALHO 1,68 M","CHP","0,0020000","163,19",0.32]
[null,"COMPOSICAO",88316,"SERVENTE COM ENCARGOS COMPLEMENTARES","H","0,0080000","19,76",0.15]
[null,"COMPOSICAO",93244,"ROLO COMPACTADOR VIBRATÓRIO PÉ DE CARNEIRO PARA SOLOS, POTÊNCIA 80 HP, PESO OPERACIONAL SEM/COM LASTRO 7,4 / 8,8 T, LARGURA DE TRABALHO 1,68 M ","CHI","0,0060000","71,18",0.42]
[null,"PRODUÇÃO DA EQUIPE",null,null,1,"CUSTO ",null,{"$f":"SUM(H132:H138)","v":2.57}]
[null,"TOTAL",{"$nulls":5},{"$f":"H139/E139","v":2.57},"OK"]
[null,"BDI                %",{"$nulls":5},{"$f":"1+$M$1","v":1.2149000000000001}]
[null,"TOTAL DO SERVIÇO - R$",{"$nulls":5},{"$f":"H140*H141","v":3.122293}]
[]
[8.1,"CODEVASF",null,null," COMPOSIÇÃO DE PREÇO UNITÁRIO",null,null,null,{"$f":"H160","v":12.469999999999999},{"$f":"H162","v":15.149803}]
[null,"OBRA:  ",{"$f":"$C$2","v":"DRENAGEM E PAVIMENTAÇÃO - PARQUE DE EXPOSIÇÕES - SERRO/MG (ITEM 1)"},null,null,null,"DATA: ",{"$f":"$H$2","v":"OUTUBRO/2023"}]
[null,"SERVIÇO:  ",{"$f":"VLOOKUP(A144,ORÇAMENTO!$A$10:$I$30,3)","v":"EXECUÇÃO E COMPACTAÇÃO DE BASE E OU SUB BASE PARA PAVIMENTAÇÃO DE SOLO DE COMPORTAMENTO LATERÍTICO - EXCLUSIVE SOLO, ESCAVAÇÃO, CARGA E TRANSPORTE"},null,"SINAPI",{"$f":"VLOOKUP(A144,ORÇAMENTO!$A$10:$I$30,4)","v":96388},"UNIDADE: ",{"$f":"VLOOKUP(A144,ORÇAMENTO!$A$10:$I$30,5)","v":"M3"}]
[]
[null,"TIPO ITEM","CODIGO ITEM","DESCRIÇÃO ITEM","UNIDADE ITEM","COEFICIENTE","PRECO UNITARIO","CUSTO TOTAL"]
[null,"COMPOSICAO",5684,"ROLO COMPACTADOR VIBRATÓRIO DE UM CILINDRO AÇO LISO, POTÊNCIA 80 HP, PESO OPERACIONAL MÁXIMO 8,1 T, IMPACTO DINÂMICO 16,15 / 9,5 T, LARGURA DE TRABALHO 1,68 M","CHP","0,0030000","159,98",{"$f":"ROUNDDOWN(F149*G149,2)","v":0.47}]
[null,"COMPOSICAO",5685,"ROLO COMPACTADOR VIBRATÓRIO DE UM CILINDRO AÇO LISO, POTÊNCIA 80 HP, PESO OPERACIONAL MÁXIMO 8,1 T, IMPACTO DINÂMICO 16,15 / 9,5 T, LARGURA DE TRABALHO 1,68 M","CHI","0,0230000","69,53",1.59]
[null,"COMPOSICAO",5901,"CAMINHÃO PIPA 10.000 L TRUCADO, PESO BRUTO TOTAL 23.000 KG, CARGA ÚTIL MÁXIMA 15.935 KG, DISTÂNCIA ENTRE EIXOS 4,8 M, POTÊNCIA 230 CV, INCLUSIVE TANQUE DE AÇO PARA TRANSPORTE DE ÁGUA","CHP","0,0040000","294,94",1.17]
[null,"COMPOSICAO",5903,"CAMINHÃO PIPA 10.000 L TRUCADO, PESO BRUTO TOTAL 23.000 KG, CARGA ÚTIL MÁXIMA 15.935 KG, DISTÂNCIA ENTRE EIXOS 4,8 M, POTÊNCIA 230 CV, INCLUSIVE TANQUE DE AÇO PARA TRANSPORTE DE ÁGUA","CHI","0,0220000","72,55",1.59]
[null,"COMPOSICAO",5932,"MOTONIVELADORA POTÊNCIA BÁSICA LÍQUIDA (PRIMEIRA MARCHA) 125 HP, PESO BRUTO 13032 KG, LARGURA DA LÂMINA DE 3,7 M","CHP","0,0080000","262,71",2.1]
[null,"COMPOSICAO",5934,"MOTONIVELADORA POTÊNCIA BÁSICA LÍQUIDA (PRIMEIRA MARCHA) 125 HP, PESO BRUTO 13032 KG, LARGURA DA LÂMINA DE 3,7 M","CHI","0,0190000","109,40",2.0699999999999998]
[null,"COMPOSICAO",88316,"SERVENTE COM ENCARGOS COMPLEMENTARES","H","0,0260000","19,76",0.51]
[null,"INSUMO",4743,"CASCALHO DE CAVA (FORNECIMENTO PREFEITURA)","M3",1,null,0]
[null,"COMPOSICAO",96463,"ROLO COMPACTADOR DE PNEUS, ESTATICO, PRESSAO VARIAVEL, POTENCIA 110 HP, PESO SEM/COM LASTRO 10,8/27 T","CHP","0,0040000","218,21",0.87]
[null,"COMPOSICAO",96464,"ROLO COMPACTADOR DE PNEUS, ESTATICO, PRESSAO VARIAVEL, POTENCIA 110 HP, PESO SEM/COM LASTRO 10,8/27 T","CHI","0,0220000","95,83",2.1]
[null,"PRODUÇÃO DA EQUIPE",null,null,1,"CUSTO ",null,{"$f":"SUM(H149:H158)","v":12.469999999999999}]
[null,"TOTAL",{"$nulls":5},{"$f":"H159/E159","v":12.469999999999999},"OK"]
[null,"BDI                %",{"$nulls":5},{"$f":"1+$M$1","v":1.2149000000000001}]
[null,"TOTAL DO SERVIÇO - R$",{"$nulls":5},{"$f":"H160*H161","v":15.149803}]
[]
[8.1999999999999993,"CODEVASF",null,null," COMPOSIÇÃO DE PREÇO UNITÁRIO",null,null,null,{"$f":"H178","v":1.23},{"$f":"H180","v":1.49}]
[null,"OBRA:  ",{"$f":"$C$2","v":"DRENAGEM E PAVIMENTAÇÃO - PARQUE DE EXPOSIÇÕES - SERRO/MG (ITEM 1)"},null,null,null,"DATA: ",{"$f":"$H$2","v":"OUTUBRO/2023"}]
[null,"SERVIÇO:  ",{"$f":"VLOOKUP(A164,ORÇAMENTO!$A$10:$I$30,3)","v":"IMPRIMAÇÃO COM EMULSÃO ASFÁLTICA (EAI)"},null,"SINAPI",{"$f":"VLOOKUP(A164,ORÇAMENTO!$A$10:$I$30,4)","v":96401},"UNIDADE: ",{"$f":"VLOOKUP(A164,ORÇAMENTO!$A$10:$I$30,5)","v":"M2"}]
[]
[null,"TIPO ITEM","CODIGO ITEM","DESCRIÇÃO ITEM","UNIDADE ITEM","COEFICIENTE","PRECO UNITARIO","CUSTO TOTAL"]
[null,"COMPOSICAO",5839,"VASSOURA MECÂNICA REBOCÁVEL COM ESCOVA CILÍNDRICA","CHP","0,0020000",10.3,{"$f":"ROUNDDOWN(F169*G169,2)","v":0.02}]
[null,"COMPOSICAO",5841,"VASSOURA MECÂNICA REBOCÁVEL COM ESCOVA CILÍNDRICA","CHI","0,0040000",5.18,0.02]
[null,"INSUMO","ANP","EMULSÃO ASFÁLTICA PARA IMPRIMAÇÃO (FORNECIMENTO COM BDI DIFERENCIADO)","T",{"$f":"1.3/1000","v":1.2999999999999999E-3},null,0]
[null,"COMPOSICAO",83362,"ESPARGIDOR DE ASFALTO PRESSURIZADO, TANQUE 6 M3 COM ISOLAÇÃO TÉRMICA, AQUECIDO COM 2 MAÇARICOS, COM BARRA ESPARGIDORA 3,60 M, MONTADO SOBRE CAMINHÃO  TOCO","CHP","0,0010000",256.33999999999997,0.25]
[null,"COMPOSICAO",88316,"SERVENTE COM ENCARGOS COMPLEMENTARES","H","0,0060000",19.760000000000002,0.11]
[null,"COMPOSICAO",89035,"TRATOR DE PNEUS, POTÊNCIA 85 CV, TRAÇÃO 4X4, PESO COM LASTRO DE 4.675 KG ","CHP","0,0020000",135.08000000000001,0.27]
[null,"COMPOSICAO",89036,"TRATOR DE PNEUS, POTÊNCIA 85 CV, TRAÇÃO 4X4, PESO COM LASTRO DE 4.675 KG ","CHI","0,0040000",56.48,0.22]
[null,"COMPOSICAO",91486,"ESPARGIDOR DE ASFALTO PRESSURIZADO, TANQUE 6 M3 COM ISOLAÇÃO TÉRMICA, AQUECIDO COM 2 MAÇARICOS, COM BARRA ESPARGIDORA 3,60 M, MONTADO SOBRE CAMINHÃO  TOCO","CHI","0,0050000",68.430000000000007,0.34]
[null,"PRODUÇÃO DA EQUIPE",null,null,1,"CUSTO ",null,{"$f":"SUM(H169:H176)","v":1.23}]
[null,"TOTAL",{"$nulls":5},{"$f":"H177/E177","v":1.23},"OK"]
[null,"BDI                %",{"$nulls":5},{"$f":"1+$M$1","v":1.2149000000000001}]
[null,"TOTAL DO SERVIÇO - R$",{"$nulls":5},{"$f":"ROUND(H178*H179,2)","v":1.49}]
[]
[8.3000000000000007,"CODEVASF",null,null," COMPOSIÇÃO DE PREÇO UNITÁRIO",null,null,null,{"$f":"H196","v":1.01},{"$f":"H198","v":1.23}]
[null,"OBRA:  ",{"$f":"$C$2","v":"DRENAGEM E PAVIMENTAÇÃO - PARQUE DE EXPOSIÇÕES - SERRO/MG (ITEM 1)"},null,null,null,"DATA: ",{"$f":"$H$2","v":"OUTUBRO/2023"}]
[null,"SERVIÇO:  ",{"$f":"VLOOKUP(A182,ORÇAMENTO!$A$10:$I$30,3)","v":"PINTURA DE LIGAÇÃO COM EMULSÃO ASFÁLTICA RR-2C"},null,"SINAPI",{"$f":"VLOOKUP(A182,ORÇAMENTO!$A$10:$I$30,4)","v":96402},"UNIDADE: ",{"$f":"VLOOKUP(A182,ORÇAMENTO!$A$10:$I$30,5)","v":"M2"}]
[]
[null,"TIPO ITEM","CODIGO ITEM","DESCRIÇÃO ITEM","UNIDADE ITEM","COEFICIENTE","PRECO UNITARIO","CUSTO TOTAL"]
[null,"COMPOSICAO",5839,"VASSOURA MECÂNICA REBOCÁVEL COM ESCOVA CILÍNDRICA","CHP","0,0020000",10.3,{"$f":"ROUNDDOWN(F187*G187,2)","v":0.02}]
[null,"COMPOSICAO",5841,"VASSOURA MECÂNICA REBOCÁVEL COM ESCOVA CILÍNDRICA","CHI","0,0040000",5.18,0.02]
[null,"INSUMO","ANP","EMULSÃO ASFÁLTICA PARA IMPRIMAÇÃO (FORNECIMENTO COM BDI DIFERENCIADO)","T","0,4500000",null,0]
[null,"COMPOSICAO",83362,"ESPARGIDOR DE ASFALTO PRESSURIZADO, TANQUE 6 M3 COM ISOLAÇÃO TÉRMICA, AQUECIDO COM 2 MAÇARICOS, COM BARRA ESPARGIDORA 3,60 M, MONTADO SOBRE CAMINHÃO  TOCO","CHP","0,0004000",256.33999999999997,0.1]
[null,"COMPOSICAO",88316,"SERVENTE COM ENCARGOS COMPLEMENTARES","H","0,0055000",19.760000000000002,0.1]
[null,"COMPOSICAO",89035,"TRATOR DE PNEUS, POTÊNCIA 85 CV, TRAÇÃO 4X4, PESO COM LASTRO DE 4.675 KG ","CHP","0,0017000",135.08000000000001,0.22]
[null,"COMPOSICAO",89036,"TRATOR DE PNEUS, POTÊNCIA 85 CV, TRAÇÃO 4X4, PESO COM LASTRO DE 4.675 KG ","CHI","0,0038000",56.48,0.21]
[null,"COMPOSICAO",91486,"ESPARGIDOR DE ASFALTO PRESSURIZADO, TANQUE 6 M3 COM ISOLAÇÃO TÉRMICA, AQUECIDO COM 2 MAÇARICOS, COM BARRA ESPARGIDORA 3,60 M, MONTADO SOBRE CAMINHÃO  TOCO","CHI","0,0051000",68.430000000000007,0.34]
[null,"PRODUÇÃO DA EQUIPE",null,null,1,"CUSTO ",null,{"$f":"SUM(H187:H194)","v":1.01}]
[null,"TOTAL",{"$nulls":5},{"$f":"H195/E195","v":1.01},"OK"]
[null,"BDI                %",{"$nulls":5},{"$f":"1+$M$1","v":1.2149000000000001}]
[null,"TOTAL DO SERVIÇO - R$",{"$nulls":5},{"$f":"ROUND(H196*H197,2)","v":1.23}]
[]
[8.4,"CODEVASF",null,null," COMPOSIÇÃO DE PREÇO UNITÁRIO",null,null,null,{"$f":"H217","v":129.6},{"$f":"H219","v":157.45104000000001}]
[null,"OBRA:  ",{"$f":"$C$2","v":"DRENAGEM E PAVIMENTAÇÃO - PARQUE DE EXPOSIÇÕES - SERRO/MG (ITEM 1)"},null,null,null,"DATA: ",{"$f":"$H$2","v":"OUTUBRO/2023"}]
[null,"SERVIÇO:  ",{"$f":"VLOOKUP(A200,ORÇAMENTO!$A$10:$I$30,3)","v":"EXECUÇÃO DE PAVIMENTO COM APLICAÇÃO DE CONCRETO ASFÁLTICO, CAMADA DE ROLAMENTO - EXCLUSIVE CARGA E TRANSPORTE"},null,"SINAPI",{"$f":"VLOOKUP(A200,ORÇAMENTO!$A$10:$I$30,4)","v":95995},"UNIDADE: ",{"$f":"VLOOKUP(A200,ORÇAMENTO!$A$10:$I$30,5)","v":"M3"}]
[]
[null,"TIPO ITEM","CODIGO ITEM","DESCRIÇÃO ITEM","UNIDADE ITEM","COEFICIENTE","PRECO UNITARIO","CUSTO TOTAL"]
[null,"INSUMO","1518","CONCRETO BETUMINOSO USINADO A QUENTE (CBUQ) PARA PAVIMENTACAO ASFALTICA, PADRAO DNIT, FAIXA C, COM CAP 50/70 - AQUISICAO POSTO USINA","T","2,5548000",null,{"$f":"ROUNDDOWN(F205*G205,2)","v":0}]
[null,"COMPOSICAO","5835","VIBROACABADORA DE ASFALTO SOBRE ESTEIRAS, LARGURA DE PAVIMENTAÇÃO 1,90 M A 5,30 M, POTÊNCIA 105 HP CAPACIDADE 450 T/H","CHP","0,0464000","396,75",18.399999999999999]
[null,"COMPOSICAO","5837","VIBROACABADORA DE ASFALTO SOBRE ESTEIRAS, LARGURA DE PAVIMENTAÇÃO 1,90 M A 5,30 M, POTÊNCIA 105 HP CAPACIDADE 450 T/H","CHI","0,0949000","165,12",15.66]
[null,"COMPOSICAO","88314","RASTELEIRO COM ENCARGOS COMPLEMENTARES","H","1,1301000","26,52",29.97]
[null,"COMPOSICAO","91386","CAMINHÃO BASCULANTE 10 M3, TRUCADO CABINE SIMPLES, PESO BRUTO TOTAL 23.000 KG, CARGA ÚTIL MÁXIMA 15.935 KG, DISTÂNCIA ENTRE EIXOS 4,80 M, POTÊNCIA 230 CV INCLUSIVE CAÇAMBA METÁLICA","CHP","0,0464000","252,13",11.69]
[null,"COMPOSICAO","95631","ROLO COMPACTADOR VIBRATORIO TANDEM, ACO LISO, POTENCIA 125 HP, PESO SEM/COM LASTRO 10,20/11,65 T, LARGURA DE TRABALHO 1,73 M","CHP","0,0805000","228,02",18.350000000000001]
[null,"COMPOSICAO","95632","ROLO COMPACTADOR VIBRATORIO TANDEM, ACO LISO, POTENCIA 125 HP, PESO SEM/COM LASTRO 10,20/11,65 T, LARGURA DE TRABALHO 1,73 M","CHI","0,0607000","89,32",5.42]
[null,"COMPOSICAO","96155","TRATOR DE PNEUS COM POTÊNCIA DE 85 CV, TRAÇÃO 4X4, COM VASSOURA MECÂNICA ACOPLADA","CHI","0,1071000","61,42",6.57]
[null,"COMPOSICAO","96157","TRATOR DE PNEUS COM POTÊNCIA DE 85 CV, TRAÇÃO 4X4, COM VASSOURA MECÂNICA ACOPLADA","CHP","0,0341000","144,29",4.92]
[null,"COMPOSICAO","96463","ROLO COMPACTADOR DE PNEUS, ESTATICO, PRESSAO VARIAVEL, POTENCIA 110 HP, PESO SEM/COM LASTRO 10,8/27 T, LARGURA DE ROLAGEM 2,30 M","CHP","0,0419000","218,21",9.14]
[null,"COMPOSICAO","96464","ROLO COMPACTADOR DE PNEUS, ESTATICO, PRESSAO VARIAVEL, POTENCIA 110 HP, PESO SEM/COM LASTRO 10,8/27 T, LARGURA DE ROLAGEM 2,30 M","CHI","0,0990000","95,83",9.48]
[null,"PRODUÇÃO DA EQUIPE",null,null,1,"CUSTO ",null,{"$f":"SUM(H205:H215)","v":129.6}]
[null,"TOTAL",{"$nulls":5},{"$f":"H216/E216","v":129.6},"OK"]
[null,"BDI                %",{"$nulls":5},{"$f":"1+$M$1","v":1.2149000000000001}]
[null,"TOTAL DO SERVIÇO - R$",{"$nulls":5},{"$f":"H217*H218","v":157.45104000000001}]
[]
[9,"CODEVASF",null,null," COMPOSIÇÃO DE PREÇO UNITÁRIO",null,null,null,{"$f":"H236","v":61.66},{"$f":"H238","v":74.910734000000005}]
[null,"OBRA:  ",{"$f":"$C$2","v":"DRENAGEM E PAVIMENTAÇÃO - PARQUE DE EXPOSIÇÕES - SERRO/MG (ITEM 1)"},null,null,null,"DATA: ",{"$f":"$H$2","v":"OUTUBRO/2023"}]
[null,"SERVIÇO:  ",{"$f":"VLOOKUP(A221,ORÇAMENTO!$A$10:$I$30,3)","v":"EXECUÇÃO DE PAVIMENTO EM PISO INTERTRAVADO, COM BLOCO DE CONCRETO DO TIPO 16 FACES DE 22 X 11CM, ESPESSURA 8 CM"},null,"SINAPI",{"$f":"VLOOKUP(A221,ORÇAMENTO!$A$10:$I$30,4)","v":92394},"UNIDADE: ",{"$f":"VLOOKUP(A221,ORÇAMENTO!$A$10:$I$30,5)","v":"M2"}]
[]
[null,"TIPO ITEM","CODIGO ITEM","DESCRIÇÃO ITEM","UNIDADE ITEM","COEFICIENTE","PRECO UNITARIO","CUSTO TOTAL"]
[null,"INSUMO",370,"AREIA MEDIA - POSTO JAZIDA/FORNECEDOR (RETIRADO NA JAZIDA, SEM TRANSPORTE)","M3","0,0568000",90,{"$f":"ROUNDDOWN(F226*G226,2)","v":5.1100000000000003}]
[null,"INSUMO",712,"BLOQUETE/PISO INTERTRAVADO DE CONCRETO - MODELO 16 FACES, 22 CM X 11 CM, E = 8 CM, RESISTENCIA DE 35 MPA (NBR 9781), COR NATURAL","M2","1,0038000",48.6,48.78]
[null,"INSUMO",4741,"PO DE PEDRA (POSTO PEDREIRA/FORNECEDOR, SEM FRETE)","M3","0,0066000","111,12",0.73]
[null,"COMPOSICAO",88260,"CALCETEIRO COM ENCARGOS COMPLEMENTARES","H","0,1683000","21,06",3.54]
[null,"COMPOSICAO",88316,"SERVENTE COM ENCARGOS COMPLEMENTARES","H","0,1683000","19,76",3.32]
[null,"COMPOSICAO",91277,"PLACA VIBRATÓRIA REVERSÍVEL COM MOTOR 4 TEMPOS A GASOLINA, FORÇA CENTRÍFUGA DE 25 KN (2500 KGF), POTÊNCIA 5,5 CV","CHP","0,0055000","8,77",0.04]
[null,"COMPOSICAO",91278,"PLACA VIBRATÓRIA REVERSÍVEL COM MOTOR 4 TEMPOS A GASOLINA, FORÇA CENTRÍFUGA DE 25 KN (2500 KGF), POTÊNCIA 5,5 CV","CHI","0,0787000","0,52",0.04]
[null,"COMPOSICAO",91283,"CORTADORA DE PISO COM MOTOR 4 TEMPOS A GASOLINA, POTÊNCIA DE 13 HP, COM DISCO DE CORTE DIAMANTADO SEGMENTADO PARA CONCRETO, DIÂMETRO DE 350 MM, FURO DE 1\" (14 X 1\")","CHP","0,0038000","9,69",0.03]
[null,"COMPOSICAO",91285,"CORTADORA DE PISO COM MOTOR 4 TEMPOS A GASOLINA, POTÊNCIA DE 13 HP, COM DISCO DE CORTE DIAMANTADO SEGMENTADO PARA CONCRETO, DIÂMETRO DE 350 MM, FURO DE 1\" (14 X 1\")","CHI","0,0804000","0,92",7.0000000000000007E-2]
[null,"PRODUÇÃO DA EQUIPE",null,null,1,"CUSTO ",null,{"$f":"SUM(H226:H234)","v":61.66}]
[null,"TOTAL",{"$nulls":5},{"$f":"H235/E235","v":61.66},"OK"]
[null,"BDI                %",{"$nulls":5},{"$f":"1+$M$1","v":1.2149000000000001}]
[null,"TOTAL DO SERVIÇO - R$",{"$nulls":5},{"$f":"H236*H237","v":74.910734000000005}]
[]
[10,"CODEVASF",null,null," COMPOSIÇÃO DE PREÇO UNITÁRIO",null,null,null,{"$f":"H249","v":0.73},{"$f":"H251","v":0.88687700000000003}]
[null,"OBRA:  ",{"$f":"$C$2","v":"DRENAGEM E PAVIMENTAÇÃO - PARQUE DE EXPOSIÇÕES - SERRO/MG (ITEM 1)"},null,null,null,"DATA: ",{"$f":"$H$2","v":"OUTUBRO/2023"}]
[null,"SERVIÇO:  ",{"$f":"VLOOKUP(A240,ORÇAMENTO!$A$10:$I$30,3)","v":"TRANSPORTE COM CAMINHÃO BASCULANTE, EM VIA URBANA PAVIMENTADA"},null,"SINAPI",{"$f":"VLOOKUP(A240,ORÇAMENTO!$A$10:$I$30,4)","v":95427},"UNIDADE: ",{"$f":"VLOOKUP(A240,ORÇAMENTO!$A$10:$I$30,5)","v":"M3XKM"}]
[]
[null,"TIPO ITEM","CODIGO ITEM","DESCRIÇÃO ITEM","UNIDADE ITEM","COEFICIENTE","PRECO UNITARIO","CUSTO TOTAL"]
[null,"COMPOSICAO",89883,"CAMINHÃO BASCULANTE 18 M3, COM CAVALO MECÂNICO DE CAPACIDADE MÁXIMA DE TRAÇÃO COMBINADO DE 45000 KG, POTÊNCIA 330 CV, INCLUSIVE SEMIREBOQUE COM CAÇAMBA METÁLICA","CHP","0,0019000","348,45",{"$f":"ROUNDDOWN(F245*G245,2)","v":0.66}]
[null,"COMPOSICAO",89884,"CAMINHÃO BASCULANTE 18 M3, COM CAVALO MECÂNICO DE CAPACIDADE MÁXIMA DE TRAÇÃO COMBINADO DE 45000 KG, POTÊNCIA 330 CV, INCLUSIVE SEMIREBOQUE COM CAÇAMBA METÁLICA","CHI","0,0008000","93,65",{"$f":"ROUNDDOWN(F246*G246,2)","v":7.0000000000000007E-2}]
[{"$nulls":7},{"$f":"F247*G247","v":0}]
[null,"PRODUÇÃO DA EQUIPE",null,null,1,"CUSTO ",null,{"$f":"SUM(H245:H247)","v":0.73}]
[null,"TOTAL",{"$nulls":5},{"$f":"H248/E248","v":0.73},"OK"]
[null,"BDI                %",{"$nulls":5},{"$f":"1+$M$1","v":1.2149000000000001}]
[null,"TOTAL DO SERVIÇO - R$",{"$nulls":5},{"$f":"H249*H250","v":0.88687700000000003}]
[]
[11,"CODEVASF",null,null," COMPOSIÇÃO DE PREÇO UNITÁRIO",null,null,null,{"$f":"H262","v":0.84},{"$f":"H264","v":1.020516}]
[null,"OBRA:  ",{"$f":"$C$2","v":"DRENAGEM E PAVIMENTAÇÃO - PARQUE DE EXPOSIÇÕES - SERRO/MG (ITEM 1)"},null,null,null,"DATA: ",{"$f":"$H$2","v":"OUTUBRO/2023"}]
[null,"SERVIÇO:  ","TRANSPORTE COM CAMINHÃO CARROCERIA 9T, EM VIA URBANA PAVIMENTADA",null,"SINAPI",{"$f":"VLOOKUP(A253,ORÇAMENTO!$A$10:$I$30,4)","v":100948},"UNIDADE: ",{"$f":"VLOOKUP(A253,ORÇAMENTO!$A$10:$I$30,5)","v":"TXKM"}]
[]
[null,"TIPO ITEM","CODIGO ITEM","DESCRIÇÃO ITEM","UNIDADE ITEM","COEFICIENTE","PRECO UNITARIO","CUSTO TOTAL"]
[null,"COMPOSICAO",5824,"CAMINHÃO TOCO, PBT 16.000 KG, CARGA ÚTIL MÁX. 10.685 KG, DIST. ENTRE EIXOS 4,8 M, POTÊNCIA 189 CV, INCLUSIVE CARROCERIA FIXA ABERTA DE MADEIRA P/ TRANSPORTE GERAL DE CARGA SECA","CHP","0,0037000","202,74",{"$f":"ROUNDDOWN(F258*G258,2)","v":0.75}]
[null,"COMPOSICAO",5826,"CAMINHÃO TOCO, PBT 16.000 KG, CARGA ÚTIL MÁX. 10.685 KG, DIST. ENTRE EIXOS 4,8 M, POTÊNCIA 189 CV, INCLUSIVE CARROCERIA FIXA ABERTA DE MADEIRA P/ TRANSPORTE GERAL DE CARGA SECA","CHI","0,0016000","60,95",{"$f":"ROUNDDOWN(F259*G259,2)","v":0.09}]
[{"$nulls":7},{"$f":"F260*G260","v":0}]
[null,"PRODUÇÃO DA EQUIPE",null,null,1,"CUSTO ",null,{"$f":"SUM(H258:H260)","v":0.84}]
[null,"TOTAL",{"$nulls":5},{"$f":"H261/E261","v":0.84},"OK"]
[null,"BDI                %",{"$nulls":5},{"$f":"1+$M$1","v":1.2149000000000001}]
[null,"TOTAL DO SERVIÇO - R$",{"$nulls":5},{"$f":"H262*H263","v":1.020516}]
[]
[12,"CODEVASF",null,null," COMPOSIÇÃO DE PREÇO UNITÁRIO",null,null,null,{"$f":"H281","v":773.45},{"$f":"H283","v":939.6644050000001}]
[null,"OBRA:  ",{"$f":"$C$2","v":"DRENAGEM E PAVIMENTAÇÃO - PARQUE DE EXPOSIÇÕES - SERRO/MG (ITEM 1)"},null,null,null,"DATA: ",{"$f":"$H$2","v":"OUTUBRO/2023"}]
[null,"SERVIÇO:  ",{"$f":"VLOOKUP(A266,ORÇAMENTO!$A$10:$I$30,3)","v":"EXECUÇÃO DE PASSEIO (CALÇADA) OU PISO DE CONCRETO COM CONCRETO MOLDADO IN LOCO, FEITO EM OBRA, ACABAMENTO CONVENCIONAL, NÃO ARMADO."},null,"SINAPI",{"$f":"VLOOKUP(A266,ORÇAMENTO!$A$10:$I$30,4)","v":94990},"UNIDADE: ",{"$f":"VLOOKUP(A266,ORÇAMENTO!$A$10:$I$54,5)","v":"M3"}]
[]
[null,"TIPO ITEM","CODIGO ITEM","DESCRIÇÃO ITEM","UNIDADE ITEM","COEFICIENTE","PRECO UNITARIO","CUSTO TOTAL"]
[null,"INSUMO",2692,"DESMOLDANTE PROTETOR PARA FORMAS DE MADEIRA, DE BASE OLEOSA EMULSIONADA EM AGUA","L","0,0213000","5,92",{"$f":"ROUNDDOWN(F271*G271,2)","v":0.12}]
[null,"INSUMO",4509,"SARRAFO *2,5 X 10* CM EM PINUS, MISTA OU EQUIVALENTE DA REGIAO - BRUTA","M","3,1250000","4,41",{"$f":"ROUNDDOWN(F272*G272,2)","v":13.78}]
[null,"INSUMO",4517,"SARRAFO *2,5 X 7,5* CM EM PINUS, MISTA OU EQUIVALENTE DA REGIAO - BRUTA","M","2,5000000","3,04",7.6]
[null,"INSUMO",5068,"PREGO DE ACO POLIDO COM CABECA 17 X 21 (2 X 11)","KG","0,2994000","19,23",5.75]
[null,"COMPOSICAO",88262,"CARPINTEIRO DE FORMAS COM ENCARGOS COMPLEMENTARES","H","1,6268000","27,05",44]
[null,"COMPOSICAO",88309,"PEDREIRO COM ENCARGOS COMPLEMENTARES","H","1,4149000","27,45",38.83]
[null,"COMPOSICAO",88316,"SERVENTE COM ENCARGOS COMPLEMENTARES","H","3,0417000","19,76",60.1]
[null,"COMPOSICAO",94964,"CONCRETO FCK = 20MPA, TRAÇO 1:2,7:3 (EM MASSA SECA DE CIMENTO/ AREIA MÉDIA/ BRITA 1) - PREPARO MECÂNICO COM BETONEIRA 400 L.","M3","1,2315000","489,87",603.27]
[]
[null,"PRODUÇÃO DA EQUIPE",null,null,1,"CUSTO ",null,{"$f":"SUM(H271:H279)","v":773.45}]
[null,"TOTAL",{"$nulls":5},{"$f":"H280/E280","v":773.45},"OK"]
[null,"BDI                %",{"$nulls":5},{"$f":"1+$M$1","v":1.2149000000000001}]
[null,"TOTAL DO SERVIÇO - R$",{"$nulls":5},{"$f":"H281*H282","v":939.6644050000001}]
[]
[13,"CODEVASF",null,null," COMPOSIÇÃO DE PREÇO UNITÁRIO",null,null,null,{"$f":"H300","v":47.749999999999993},{"$f":"H302","v":58.011474999999997}]
[null,"OBRA:  ",{"$f":"$C$2","v":"DRENAGEM E PAVIMENTAÇÃO - PARQUE DE EXPOSIÇÕES - SERRO/MG (ITEM 1)"},null,null,null,"DATA: ",{"$f":"$H$2","v":"OUTUBRO/2023"}]
[null,"SERVIÇO:  ",{"$f":"VLOOKUP(A285,ORÇAMENTO!$A$10:$I$30,3)","v":"GUIA (MEIO-FIO) E SARJETA CONJUGADOS DE CONCRETO, MOLDADA  IN LOCO  EM TRECHO RETO COM EXTRUSORA, 45 CM BASE (15 CM BASE DA GUIA + SARJETA (30 X 0,05))X 22 CM ALTURA"},null,"SINAPI",{"$f":"VLOOKUP(A285,ORÇAMENTO!$A$10:$I$30,4)","v":94267},"UNIDADE: ",{"$f":"VLOOKUP(A285,ORÇAMENTO!$A$10:$I$54,5)","v":"M"}]
[]
[null,"TIPO ITEM","CODIGO ITEM","DESCRIÇÃO ITEM","UNIDADE ITEM","COEFICIENTE","PRECO UNITARIO","CUSTO TOTAL"]
[null,"INSUMO",370,"AREIA MEDIA - POSTO JAZIDA/FORNECEDOR (RETIRADO NA JAZIDA, SEM TRANSPORTE)","M3","0,0150000",90,{"$f":"ROUNDDOWN(F290*G290,2)","v":1.35}]
[null,"INSUMO","34492a","CONCRETO USINADO BOMBEAVEL, CLASSE DE RESISTENCIA C20, COM BRITA 0 E 1, SLUMP = 100 +/- 20 MM","M3",{"$f":"(0.15+0.13)*0.22 /2 + (0.3 *0.05)","v":4.5800000000000007E-2},"550,00",25.19]
[null,"COMPOSICAO",88243,"AJUDANTE ESPECIALIZADO COM ENCARGOS COMPLEMENTARES","H","0,1090000","21,76",2.37]
[null,"COMPOSICAO",88309,"PEDREIRO COM ENCARGOS COMPLEMENTARES","H","0,2440000","27,45",6.69]
[null,"COMPOSICAO",88316,"SERVENTE COM ENCARGOS COMPLEMENTARES","H","0,4870000","19,76",9.6199999999999992]
[null,"COMPOSICAO",88631,"ARGAMASSA TRAÇO 1:4 (EM VOLUME DE CIMENTO E AREIA MÉDIA ÚMIDA), PREPARO MANUAL","M3","0,0030000","575,87",1.72]
[null,"COMPOSICAO",92960,"MÁQUINA EXTRUSORA DE CONCRETO PARA GUIAS E SARJETAS, MOTOR A DIESEL, POTÊNCIA 14 CV","CHP","0,0180000","18,46",0.33]
[null,"COMPOSICAO",92961,"MÁQUINA EXTRUSORA DE CONCRETO PARA GUIAS E SARJETAS, MOTOR A DIESEL, POTÊNCIA 14 CV","CHI","0,0910000","5,38",0.48]
[]
[null,"PRODUÇÃO DA EQUIPE",null,null,1,"CUSTO ",null,{"$f":"SUM(H290:H298)","v":47.749999999999993}]
[null,"TOTAL",{"$nulls":5},{"$f":"H299/E299","v":47.749999999999993},"OK"]
[null,"BDI                %",{"$nulls":5},{"$f":"1+$M$1","v":1.2149000000000001}]
[null,"TOTAL DO SERVIÇO - R$",{"$nulls":5},{"$f":"H300*H301","v":58.011474999999997}]
[]
[14,"CODEVASF",null,null," COMPOSIÇÃO DE PREÇO UNITÁRIO",null,null,null,{"$f":"H319","v":35.590000000000003},{"$f":"H321","v":43.238291000000011}]
[null,"OBRA:  ",{"$f":"$C$2","v":"DRENAGEM E PAVIMENTAÇÃO - PARQUE DE EXPOSIÇÕES - SERRO/MG (ITEM 1)"},null,null,null,"DATA: ",{"$f":"$H$2","v":"OUTUBRO/2023"}]
[null,"SERVIÇO:  ",{"$f":"VLOOKUP(A304,ORÇAMENTO!$A$10:$I$53,3)","v":"GUIA (MEIO-FIO) CONCRETO, MOLDADA IN LOCO EM TRECHO RETO COM EXTRUSORA, 13 CM BASE X 22 CM ALTURA - PARA TRAVAMENTO"},null,"SINAPI",{"$f":"VLOOKUP(A304,ORÇAMENTO!$A$10:$I$53,4)","v":94263},"UNIDADE: ",{"$f":"VLOOKUP(A304,ORÇAMENTO!$A$10:$I$54,5)","v":"M"}]
[]
[null,"TIPO ITEM","CODIGO ITEM","DESCRIÇÃO ITEM","UNIDADE ITEM","COEFICIENTE","PRECO UNITARIO","CUSTO TOTAL"]
[null,"INSUMO",370,"AREIA MEDIA - POSTO JAZIDA/FORNECEDOR (RETIRADO NA JAZIDA, SEM TRANSPORTE)","M3","0,0070000",90,{"$f":"ROUNDDOWN(F309*G309,2)","v":0.63}]
[null,"INSUMO",34492,"CONCRETO USINADO BOMBEAVEL, CLASSE DE RESISTENCIA C20, COM BRITA 0 E 1, SLUMP = 100 +/- 20 MM","M3","0,0300000","550,00",16.5]
[null,"COMPOSICAO",88243,"AJUDANTE ESPECIALIZADO COM ENCARGOS COMPLEMENTARES","H","0,0870000","21,76",1.89]
[null,"COMPOSICAO",88309,"PEDREIRO COM ENCARGOS COMPLEMENTARES","H","0,2210000","27,45",6.06]
[null,"COMPOSICAO",88316,"SERVENTE COM ENCARGOS COMPLEMENTARES","H","0,4420000","19,76",8.73]
[null,"COMPOSICAO",88631,"ARGAMASSA TRAÇO 1:4 (EM VOLUME DE CIMENTO E AREIA MÉDIA ÚMIDA), PREPARO MANUAL","M3","0,0020000","575,87",1.1499999999999999]
[null,"COMPOSICAO",92960,"MÁQUINA EXTRUSORA DE CONCRETO PARA GUIAS E SARJETAS, MOTOR A DIESEL, POTÊNCIA 14 CV","CHP","0,0140000","18,46",0.25]
[null,"COMPOSICAO",92961,"MÁQUINA EXTRUSORA DE CONCRETO PARA GUIAS E SARJETAS, MOTOR A DIESEL, POTÊNCIA 14 CV","CHI","0,0720000","5,38",0.38]
[]
[null,"PRODUÇÃO DA EQUIPE",null,null,1,"CUSTO ",null,{"$f":"SUM(H309:H317)","v":35.590000000000003}]
[null,"TOTAL",{"$nulls":5},{"$f":"H318/E318","v":35.590000000000003},"OK"]
[null,"BDI                %",{"$nulls":5},{"$f":"1+$M$1","v":1.2149000000000001}]
[null,"TOTAL DO SERVIÇO - R$",{"$nulls":5},{"$f":"H319*H320","v":43.238291000000011}]
[]
[15,"CODEVASF",null,null," COMPOSIÇÃO DE PREÇO UNITÁRIO",null,null,null,{"$f":"H338","v":5.92},{"$f":"H340","v":7.1922080000000008}]
[null,"OBRA:  ",{"$f":"$C$2","v":"DRENAGEM E PAVIMENTAÇÃO - PARQUE DE EXPOSIÇÕES - SERRO/MG (ITEM 1)"},null,null,null,"DATA: ",{"$f":"$H$2","v":"OUTUBRO/2023"}]
[null,"SERVIÇO:  ",{"$f":"VLOOKUP(A323,ORÇAMENTO!$A$10:$I$53,3)","v":"LOCAÇÃO DE REDE DE ÁGUA OU ESGOTO"},null,"SINAPI",{"$f":"VLOOKUP(A323,ORÇAMENTO!$A$10:$I$53,4)","v":99063},"UNIDADE: ",{"$f":"VLOOKUP(A323,ORÇAMENTO!$A$10:$I$54,5)","v":"M"}]
[]
[null,"TIPO ITEM","CODIGO ITEM","DESCRIÇÃO ITEM","UNIDADE ITEM","COEFICIENTE","PRECO UNITARIO","CUSTO TOTAL"]
[null,"INSUMO","4433","CAIBRO NAO APARELHADO *6 X 6* CM, EM MACARANDUBA OU EQUIV. REGIAO - BRUTA","M",{"$f":"0.05*1.1","v":5.5000000000000007E-2},"40,97",{"$f":"ROUNDDOWN(F328*G328,2)","v":2.25}]
[null,"INSUMO","5068","PREGO DE ACO POLIDO COM CABECA 17 X 21 ","KG",{"$f":"0.05*0.0452","v":2.2599999999999999E-3},"19,23",0.04]
[null,"INSUMO","10567","TABUA *2,5 X 23* CM EM PINUS, MISTA OU EQUIVALENTE DA REGIAO - BRUTA","M",{"$f":"0.05*0.8663","v":4.3314999999999999E-2},"9,83",0.42]
[null,"COMPOSICAO","88239","AJUDANTE DE CARPINTEIRO COM ENCARGOS COMPLEMENTARES","H",{"$f":"0.05*0.8044","v":4.0220000000000006E-2},"21,78",0.87]
[null,"COMPOSICAO","88262","CARPINTEIRO DE FORMAS COM ENCARGOS COMPLEMENTARES","H",{"$f":"0.05*1.6088","v":8.0440000000000011E-2},"27,05",2.17]
[null,"COMPOSICAO","91692","SERRA CIRCULAR DE BANCADA COM MOTOR ELÉTRICO POTÊNCIA DE 5HP, COM COIFA","CHP",{"$f":"0.05*0.0066","v":3.3E-4},"35,12",0.01]
[null,"COMPOSICAO","91693","SERRA CIRCULAR DE BANCADA COM MOTOR ELÉTRICO POTÊNCIA DE 5HP, COM COIFA","CHI",{"$f":"0.05*0.0289","v":1.4450000000000001E-3},"33,81",0.04]
[null,"COMPOSICAO","99062","MARCAÇÃO DE PONTOS EM GABARITO OU CAVALETE","UN",{"$f":"0.05*1","v":0.05},"2,50",0.12]
[]
[null,"PRODUÇÃO DA EQUIPE",null,null,1,"CUSTO ",null,{"$f":"SUM(H328:H336)","v":5.92}]
[null,"TOTAL",{"$nulls":5},{"$f":"H337/E337","v":5.92},"OK"]
[null,"BDI                %",{"$nulls":5},{"$f":"1+$M$1","v":1.2149000000000001}]
[null,"TOTAL DO SERVIÇO - R$",{"$nulls":5},{"$f":"H338*H339","v":7.1922080000000008}]
[]
[16,"CODEVASF",null,null," COMPOSIÇÃO DE PREÇO UNITÁRIO",null,null,null,{"$f":"H352","v":9.34},{"$f":"H354","v":11.347166000000001}]
[null,"OBRA:  ",{"$f":"$C$2","v":"DRENAGEM E PAVIMENTAÇÃO - PARQUE DE EXPOSIÇÕES - SERRO/MG (ITEM 1)"},null,null,null,"DATA: ",{"$f":"$H$2","v":"OUTUBRO/2023"}]
[null,"SERVIÇO:  ",{"$f":"VLOOKUP(A342,ORÇAMENTO!$A$10:$I$53,3)","v":"ESCAVAÇÃO MECANIZADA DE VALA COM PROFUNDIDADE ATÉ 1,5 M, EM SOLO DE 1A CATEGORIA"},null,"SINAPI",{"$f":"VLOOKUP(A342,ORÇAMENTO!$A$10:$I$53,4)","v":90105},"UNIDADE: ",{"$f":"VLOOKUP(A342,ORÇAMENTO!$A$10:$I$54,5)","v":"M3"}]
[]
[null,"TIPO ITEM","CODIGO ITEM","DESCRIÇÃO ITEM","UNIDADE ITEM","COEFICIENTE","PRECO UNITARIO","CUSTO TOTAL"]
[null,"COMPOSICAO","5678","RETROESCAVADEIRA SOBRE RODAS COM CARREGADEIRA, TRAÇÃO 4X4, POTÊNCIA LÍQ. 88 HP, CAÇAMBA CARREG. CAP. MÍN. 1 M3, CAÇAMBA RETRO CAP. 0,26 M3, PESO OPERACIONAL MÍN. 6.674 KG, PROFUNDIDADE ESCAVAÇÃO MÁX. 4,37 M","CHP",3.2399999999999998E-2,"155,17",{"$f":"ROUNDDOWN(F347*G347,2)","v":5.0199999999999996}]
[null,"COMPOSICAO","5679","RETROESCAVADEIRA SOBRE RODAS COM CARREGADEIRA, TRAÇÃO 4X4, POTÊNCIA LÍQ. 88 HP, CAÇAMBA CARREG. CAP. MÍN. 1 M3, CAÇAMBA RETRO CAP. 0,26 M3, PESO OPERACIONAL MÍN. 6.674 KG, PROFUNDIDADE ESCAVAÇÃO MÁX. 4,37 M","CHI",3.9199999999999999E-2,"74,35",2.91]
[null,"COMPOSICAO","88316","SERVENTE COM ENCARGOS COMPLEMENTARES","H",7.17E-2,"19,76",1.41]
[]
[null,"PRODUÇÃO DA EQUIPE",null,null,1,"CUSTO ",null,{"$f":"SUM(H347:H350)","v":9.34}]
[null,"TOTAL",{"$nulls":5},{"$f":"H351/E351","v":9.34},"OK"]
[null,"BDI                %",{"$nulls":5},{"$f":"1+$M$1","v":1.2149000000000001}]
[null,"TOTAL DO SERVIÇO - R$",{"$nulls":5},{"$f":"H352*H353","v":11.347166000000001}]
[]
[17,"CODEVASF",null,null," COMPOSIÇÃO DE PREÇO UNITÁRIO",null,null,null,{"$f":"H368","v":59.33},{"$f":"H370","v":72.080016999999998}]
[null,"OBRA:  ",{"$f":"$C$2","v":"DRENAGEM E PAVIMENTAÇÃO - PARQUE DE EXPOSIÇÕES - SERRO/MG (ITEM 1)"},null,null,null,"DATA: ",{"$f":"$H$2","v":"OUTUBRO/2023"}]
[null,"SERVIÇO:  ",{"$f":"VLOOKUP(A356,ORÇAMENTO!$A$10:$I$53,3)","v":"PREPARO DE FUNDO DE VALA COM LARGURA MENOR QUE 1,5 M (ACERTO DO SOLO NATURAL), INCLUSIVE LASTRO DE CONCRETO MAGRO PARA BERÇO"},null,"SINAPI",{"$f":"VLOOKUP(A356,ORÇAMENTO!$A$10:$I$53,4)","v":"101616+\n95240"},"UNIDADE: ",{"$f":"VLOOKUP(A356,ORÇAMENTO!$A$10:$I$54,5)","v":"M2"}]
[]
[null,"TIPO ITEM","CODIGO ITEM","DESCRIÇÃO ITEM","UNIDADE ITEM","COEFICIENTE","PRECO UNITARIO","CUSTO TOTAL"]
[null,"COMPOSICAO","88309","PEDREIRO COM ENCARGOS COMPLEMENTARES","H",{"$f":"0.1631+0.102","v":0.2651},"27,45",{"$f":"ROUNDDOWN(F361*G361,2)","v":7.27}]
[null,"COMPOSICAO","88316","SERVENTE COM ENCARGOS COMPLEMENTARES","H",{"$f":"0.0444+0.1531","v":0.19750000000000001},"19,76",3.9]
[null,"COMPOSICAO","91533","COMPACTADOR DE SOLOS DE PERCUSSÃO (SOQUETE) COM MOTOR A GASOLINA 4 TEMPOS, POTÊNCIA 4 CV","CHP","0,0036000","40,78",0.14000000000000001]
[null,"COMPOSICAO","91534","COMPACTADOR DE SOLOS DE PERCUSSÃO (SOQUETE) COM MOTOR A GASOLINA 4 TEMPOS, POTÊNCIA 4 CV","CHI","0,0036000","34,48",0.12]
[null,"COMPOSICAO","94968","CONCRETO MAGRO PARA LASTRO, TRAÇO 1:4,5:4,5 (EM MASSA SECA DE CIMENTO/ AREIA MÉDIA/ BRITA 1) - PREPARO COM BETONEIRA ","M3",0.12,"399,21",47.9]
[]
[null,"PRODUÇÃO DA EQUIPE",null,null,1,"CUSTO ",null,{"$f":"SUM(H361:H366)","v":59.33}]
[null,"TOTAL",{"$nulls":5},{"$f":"H367/E367","v":59.33},"OK"]
[null,"BDI                %",{"$nulls":5},{"$f":"1+$M$1","v":1.2149000000000001}]
[null,"TOTAL DO SERVIÇO - R$",{"$nulls":5},{"$f":"H368*H369","v":72.080016999999998}]
[]
[18,"CODEVASF",null,null," COMPOSIÇÃO DE PREÇO UNITÁRIO",null,null,null,{"$f":"H384","v":26.27},{"$f":"H386","v":31.915423000000001}]
[null,"OBRA:  ",{"$f":"$C$2","v":"DRENAGEM E PAVIMENTAÇÃO - PARQUE DE EXPOSIÇÕES - SERRO/MG (ITEM 1)"},null,null,null,"DATA: ",{"$f":"$H$2","v":"OUTUBRO/2023"}]
[null,"SERVIÇO:  ",{"$f":"VLOOKUP(A372,ORÇAMENTO!$A$10:$I$53,3)","v":"ESCORAMENTO DE VALA, TIPO PONTALETEAMENTO"},null,"SINAPI",{"$f":"VLOOKUP(A372,ORÇAMENTO!$A$10:$I$53,4)","v":101570},"UNIDADE: ",{"$f":"VLOOKUP(A372,ORÇAMENTO!$A$10:$I$54,5)","v":"M2"}]
[]
[null,"TIPO ITEM","CODIGO ITEM","DESCRIÇÃO ITEM","UNIDADE ITEM","COEFICIENTE","PRECO UNITARIO","CUSTO TOTAL"]
[null,"INSUMO","5061","PREGO DE ACO POLIDO COM CABECA 18 X 27 (2 1/2 X 10)","KG","0,0096000","18,90",{"$f":"ROUNDDOWN(F377*G377,2)","v":0.18}]
[null,"INSUMO","6189","TABUA NAO APARELHADA *2,5 X 30* CM, EM MACARANDUBA, ANGELIM OU EQUIVALENTE DA REGIAO - BRUTA","M","0,2173000","43,21",9.3800000000000008]
[null,"INSUMO","21138","MOURAO ROLICO DE MADEIRA TRATADA, D = 8 A 11 CM, H = 2,20 M, EM EUCALIPTO OU EQUIVALENTE DA REGIAO (PARA CERCA)","M","0,0543000","7,82",0.42]
[null,"COMPOSICAO","88262","CARPINTEIRO DE FORMAS COM ENCARGOS COMPLEMENTARES","H","0,4591000","27,05",12.41]
[null,"COMPOSICAO","88316","SERVENTE COM ENCARGOS COMPLEMENTARES","H","0,1967000","19,76",3.88]
[]
[null,"PRODUÇÃO DA EQUIPE",null,null,1,"CUSTO ",null,{"$f":"SUM(H377:H382)","v":26.27}]
[null,"TOTAL",{"$nulls":5},{"$f":"H383/E383","v":26.27},"OK"]
[null,"BDI                %",{"$nulls":5},{"$f":"1+$M$1","v":1.2149000000000001}]
[null,"TOTAL DO SERVIÇO - R$",{"$nulls":5},{"$f":"H384*H385","v":31.915423000000001}]
[]
[19,"CODEVASF",null,null," COMPOSIÇÃO DE PREÇO UNITÁRIO",null,null,null,{"$f":"H401","v":186.66999999999996},{"$f":"H403","v":226.78538299999997}]
[null,"OBRA:  ",{"$f":"$C$2","v":"DRENAGEM E PAVIMENTAÇÃO - PARQUE DE EXPOSIÇÕES - SERRO/MG (ITEM 1)"},null,null,null,"DATA: ",{"$f":"$H$2","v":"OUTUBRO/2023"}]
[null,"SERVIÇO:  ",{"$f":"VLOOKUP(A388,ORÇAMENTO!$A$10:$I$53,3)","v":"TUBO DE CONCRETO PARA REDES COLETORAS DE ÁGUAS PLUVIAIS, DIÂMETRO DE 400 MM, JUNTA RÍGIDA - FORNECIMENTO E ASSENTAMENTO"},null,"SINAPI",{"$f":"VLOOKUP(A388,ORÇAMENTO!$A$10:$I$53,4)","v":92210},"UNIDADE: ",{"$f":"VLOOKUP(A388,ORÇAMENTO!$A$10:$I$54,5)","v":"M"}]
[]
[null,"TIPO ITEM","CODIGO ITEM","DESCRIÇÃO ITEM","UNIDADE ITEM","COEFICIENTE","PRECO UNITARIO","CUSTO TOTAL"]
[null,"COMPOSICAO",5678,"RETROESCAVADEIRA SOBRE RODAS COM CARREGADEIRA, TRAÇÃO 4X4, POTÊNCIA LÍQ. 88 HP, CAÇAMBA CARREG. CAP. MÍN. 1 M3, CAÇAMBA RETRO CAP. 0,26 M3","CHP","0,0740000","155,17",{"$f":"ROUNDDOWN(F393*G393,2)","v":11.48}]
[null,"COMPOSICAO",5679,"RETROESCAVADEIRA SOBRE RODAS COM CARREGADEIRA, TRAÇÃO 4X4, POTÊNCIA LÍQ. 88 HP, CAÇAMBA CARREG. CAP. MÍN. 1 M3, CAÇAMBA RETRO CAP. 0,26 M3","CHI","0,1550000","74,35",11.52]
[null,"INSUMO","7745","TUBO DE CONCRETO ARMADO PARA AGUAS PLUVIAIS, CLASSE PA-1, COM ENCAIXE PONTA E BOLSA, DIAMETRO NOMINAL DE 400 MM","M","1,0300000",133.57,137.57]
[null,"COMPOSICAO","88246","ASSENTADOR DE TUBOS COM ENCARGOS COMPLEMENTARES","H","0,3460000","32,20",11.14]
[null,"COMPOSICAO","88316","SERVENTE COM ENCARGOS COMPLEMENTARES","H","0,6920000","19,76",13.67]
[null,"COMPOSICAO",88629,"ARGAMASSA TRAÇO 1:3 (EM VOLUME DE CIMENTO E AREIA MÉDIA ÚMIDA), PREPARO MANUAL","M3","0,0020000","645,53",1.29]
[]
[null,"PRODUÇÃO DA EQUIPE",null,null,1,"CUSTO ",null,{"$f":"SUM(H393:H399)","v":186.66999999999996}]
[null,"TOTAL",{"$nulls":5},{"$f":"H400/E400","v":186.66999999999996},"OK"]
[null,"BDI                %",{"$nulls":5},{"$f":"1+$M$1","v":1.2149000000000001}]
[null,"TOTAL DO SERVIÇO - R$",{"$nulls":5},{"$f":"H401*H402","v":226.78538299999997}]
[]
[20,"CODEVASF",null,null," COMPOSIÇÃO DE PREÇO UNITÁRIO",null,null,null,{"$f":"H418","v":337.5100000000001},{"$f":"H420","v":410.04089900000014}]
[null,"OBRA:  ",{"$f":"$C$2","v":"DRENAGEM E PAVIMENTAÇÃO - PARQUE DE EXPOSIÇÕES - SERRO/MG (ITEM 1)"},null,null,null,"DATA: ",{"$f":"$H$2","v":"OUTUBRO/2023"}]
[null,"SERVIÇO:  ",{"$f":"VLOOKUP(A405,ORÇAMENTO!$A$10:$I$53,3)","v":"TUBO DE CONCRETO PARA REDES COLETORAS DE ÁGUAS PLUVIAIS, DIÂMETRO DE 600 MM, JUNTA RÍGIDA - FORNECIMENTO E ASSENTAMENTO"},null,"SINAPI",{"$f":"VLOOKUP(A405,ORÇAMENTO!$A$10:$I$53,4)","v":92212},"UNIDADE: ",{"$f":"VLOOKUP(A405,ORÇAMENTO!$A$10:$I$54,5)","v":"M"}]
[]
[null,"TIPO ITEM","CODIGO ITEM","DESCRIÇÃO ITEM","UNIDADE ITEM","COEFICIENTE","PRECO UNITARIO","CUSTO TOTAL"]
[null,"COMPOSICAO",5678,"RETROESCAVADEIRA SOBRE RODAS COM CARREGADEIRA, TRAÇÃO 4X4, POTÊNCIA LÍQ. 88 HP, CAÇAMBA CARREG. CAP. MÍN. 1 M3, CAÇAMBA RETRO CAP. 0,26 M3","CHP","0,1050000","155,17",{"$f":"ROUNDDOWN(F410*G410,2)","v":16.29}]
[null,"COMPOSICAO",5679,"RETROESCAVADEIRA SOBRE RODAS COM CARREGADEIRA, TRAÇÃO 4X4, POTÊNCIA LÍQ. 88 HP, CAÇAMBA CARREG. CAP. MÍN. 1 M3, CAÇAMBA RETRO CAP. 0,26 M3","CHI","0,2210000","74,35",16.43]
[null,"INSUMO","7745","TUBO DE CONCRETO ARMADO PARA AGUAS PLUVIAIS, CLASSE PA-1, COM ENCAIXE PONTA E BOLSA, DIAMETRO NOMINAL DE 400 MM","M","1,0300000",258.47000000000003,266.22000000000003]
[null,"COMPOSICAO","88246","ASSENTADOR DE TUBOS COM ENCARGOS COMPLEMENTARES","H","0,4930000","32,20",15.87]
[null,"COMPOSICAO","88316","SERVENTE COM ENCARGOS COMPLEMENTARES","H","0,9860000","19,76",19.48]
[null,"COMPOSICAO",88629,"ARGAMASSA TRAÇO 1:3 (EM VOLUME DE CIMENTO E AREIA MÉDIA ÚMIDA), PREPARO MANUAL","M3","0,0050000","645,53",3.22]
[]
[null,"PRODUÇÃO DA EQUIPE",null,null,1,"CUSTO ",null,{"$f":"SUM(H410:H416)","v":337.5100000000001}]
[null,"TOTAL",{"$nulls":5},{"$f":"H417/E417","v":337.5100000000001},"OK"]
[null,"BDI                %",{"$nulls":5},{"$f":"1+$M$1","v":1.2149000000000001}]
[null,"TOTAL DO SERVIÇO - R$",{"$nulls":5},{"$f":"H418*H419","v":410.04089900000014}]
[]
[21,"CODEVASF",null,null," COMPOSIÇÃO DE PREÇO UNITÁRIO",null,null,null,{"$f":"H435","v":348.86},{"$f":"H437","v":423.83001400000006}]
[null,"OBRA:  ",{"$f":"$C$2","v":"DRENAGEM E PAVIMENTAÇÃO - PARQUE DE EXPOSIÇÕES - SERRO/MG (ITEM 1)"},null,null,null,"DATA: ",{"$f":"$H$2","v":"OUTUBRO/2023"}]
[null,"SERVIÇO:  ",{"$f":"VLOOKUP(A422,ORÇAMENTO!$A$10:$I$53,3)","v":"TUBO DE CONCRETO PARA REDES COLETORAS DE ÁGUAS PLUVIAIS, DIÂMETRO DE 800 MM, JUNTA RÍGIDA - FORNECIMENTO E ASSENTAMENTO"},null,"SINAPI",{"$f":"VLOOKUP(A422,ORÇAMENTO!$A$10:$I$53,4)","v":92214},"UNIDADE: ",{"$f":"VLOOKUP(A422,ORÇAMENTO!$A$10:$I$54,5)","v":"M"}]
[]
[null,"TIPO ITEM","CODIGO ITEM","DESCRIÇÃO ITEM","UNIDADE ITEM","COEFICIENTE","PRECO UNITARIO","CUSTO TOTAL"]
[null,"COMPOSICAO",5678,"RETROESCAVADEIRA SOBRE RODAS COM CARREGADEIRA, TRAÇÃO 4X4, POTÊNCIA LÍQ. 88 HP, CAÇAMBA CARREG. CAP. MÍN. 1 M3, CAÇAMBA RETRO CAP. 0,26 M3","CHP","0,1200000","155,17",{"$f":"ROUNDDOWN(F427*G427,2)","v":18.62}]
[null,"COMPOSICAO",5679,"RETROESCAVADEIRA SOBRE RODAS COM CARREGADEIRA, TRAÇÃO 4X4, POTÊNCIA LÍQ. 88 HP, CAÇAMBA CARREG. CAP. MÍN. 1 M3, CAÇAMBA RETRO CAP. 0,26 M3","CHI","0,2540000","74,35",18.88]
[null,"INSUMO","7745","TUBO DE CONCRETO ARMADO PARA AGUAS PLUVIAIS, CLASSE PA-1, COM ENCAIXE PONTA E BOLSA, DIAMETRO NOMINAL DE 400 MM","M","1,0300000",258.47000000000003,266.22000000000003]
[null,"COMPOSICAO","88246","ASSENTADOR DE TUBOS COM ENCARGOS COMPLEMENTARES","H","0,5670000","32,20",18.25]
[null,"COMPOSICAO","88316","SERVENTE COM ENCARGOS COMPLEMENTARES","H","1,1330000","19,76",22.38]
[null,"COMPOSICAO",88629,"ARGAMASSA TRAÇO 1:3 (EM VOLUME DE CIMENTO E AREIA MÉDIA ÚMIDA), PREPARO MANUAL","M3","0,0070000","645,53",4.51]
[]
[null,"PRODUÇÃO DA EQUIPE",null,null,1,"CUSTO ",null,{"$f":"SUM(H427:H433)","v":348.86}]
[null,"TOTAL",{"$nulls":5},{"$f":"H434/E434","v":348.86},"OK"]
[null,"BDI                %",{"$nulls":5},{"$f":"1+$M$1","v":1.2149000000000001}]
[null,"TOTAL DO SERVIÇO - R$",{"$nulls":5},{"$f":"H435*H436","v":423.83001400000006}]
[]
[22,"CODEVASF",null,null," COMPOSIÇÃO DE PREÇO UNITÁRIO",null,null,null,{"$f":"H468","v":2438.16},{"$f":"H470","v":2962.1205840000002}]
[null,"OBRA:  ",{"$f":"$C$2","v":"DRENAGEM E PAVIMENTAÇÃO - PARQUE DE EXPOSIÇÕES - SERRO/MG (ITEM 1)"},null,null,null,"DATA: ",{"$f":"$H$2","v":"OUTUBRO/2023"}]
[null,"SERVIÇO:  ",{"$f":"VLOOKUP(A439,ORÇAMENTO!$A$10:$I$53,3)","v":"CAIXA PARA BOCA DE LOBO COMBINADA COM GRELHA RETANGULAR, EM ALVENARIA COM BLOCOS DE CONCRETO, DIMENSÕES INTERNAS: 1,3X1X1,2 M."},null,"SINAPI",{"$f":"VLOOKUP(A439,ORÇAMENTO!$A$10:$I$53,4)","v":97961},"UNIDADE: ",{"$f":"VLOOKUP(A439,ORÇAMENTO!$A$10:$I$54,5)","v":"UNID."}]
[]
[null,"TIPO ITEM","CODIGO ITEM","DESCRIÇÃO ITEM","UNIDADE ITEM","COEFICIENTE","PRECO UNITARIO","CUSTO TOTAL"]
[null,"INSUMO","660","CANALETA DE CONCRETO 19 X 19 X 19 CM ","UN","28,3500000","3,02",{"$f":"ROUNDDOWN(F444*G444,2)","v":85.61}]
[null,"INSUMO","2692","DESMOLDANTE PROTETOR PARA FORMAS DE MADEIRA, DE BASE OLEOSA EMULSIONADA EM AGUA","L","0,0105000","5,92",0.06]
[null,"INSUMO","4491","PONTALETE *7,5 X 7,5* CM EM PINUS, MISTA OU EQUIVALENTE DA REGIAO - BRUTA","M","0,2294000","8,69",1.99]
[null,"INSUMO","4517","SARRAFO *2,5 X 7,5* CM EM PINUS, MISTA OU EQUIVALENTE DA REGIAO - BRUTA","M","0,2728000","3,04",0.82]
[null,"INSUMO","5069","PREGO DE ACO POLIDO COM CABECA 17 X 27 ","KG","0,0242000","19,59",0.47]
[null,"COMPOSICAO","5678","RETROESCAVADEIRA SOBRE RODAS COM CARREGADEIRA, TRAÇÃO 4X4, POTÊNCIA LÍQ. 88 HP, CAÇAMBA CARREG. CAP. MÍN. 1 M3, CAÇAMBA RETRO CAP. 0,26 M3, PESO OPERACIONAL MÍN. 6.674 KG, PROFUNDIDADE ESCAVAÇÃO MÁX. 4,37 M","CHP","0,0528000","155,17",8.19]
[null,"COMPOSICAO","5679","RETROESCAVADEIRA SOBRE RODAS COM CARREGADEIRA, TRAÇÃO 4X4, POTÊNCIA LÍQ. 88 HP, CAÇAMBA CARREG. CAP. MÍN. 1 M3, CAÇAMBA RETRO CAP. 0,26 M3, PESO OPERACIONAL MÍN. 6.674 KG, PROFUNDIDADE ESCAVAÇÃO MÁX. 4,37 M","CHI","0,1075000","74,35",7.99]
[null,"INSUMO","6193","TABUA NAO APARELHADA *2,5 X 20* CM, EM MACARANDUBA/MASSARANDUBA, ANGELIM OU EQUIVALENTE DA REGIAO - BRUTA","M","0,8556000","29,60",25.32]
[null,"INSUMO","25067","BLOCO DE CONCRETO ESTRUTURAL 19 X 19 X 39 CM","UN","61,8757000","4,87",301.33]
[null,"INSUMO","43386","MEIO-FIO OU GUIA DE CONCRETO PRE-MOLDADO, TIPO CHAPEU PARA BOCA DE LOBO,  DIMENSOES *1,20* X 0,15 X 0,30 M","UN","1,0000000","71,11",71.11]
[null,"INSUMO","43440","CONJUNTO PRE-MOLDADO COMPOSTO POR GRELHA (0,99 X 0,45 M), QUADRO (1,10 X 0,52 M) E CANTONEIRA (1,10 X 0,35 M), EM CONCRETO ARMADO, COM FCK DE 21 MPA","UN","1,0000000","524,54",524.54]
[null,"COMPOSICAO","87316","ARGAMASSA TRAÇO 1:4 (EM VOLUME DE CIMENTO E AREIA GROSSA ÚMIDA) PARA CHAPISCO CONVENCIONAL","M3","0,0588000","503,10",29.58]
[null,"COMPOSICAO","88309","PEDREIRO COM ENCARGOS COMPLEMENTARES","H","13,8543000","27,45",380.3]
[null,"COMPOSICAO","88316","SERVENTE COM ENCARGOS COMPLEMENTARES","H","10,8855000","19,76",215.09]
[null,"COMPOSICAO","88628","ARGAMASSA TRAÇO 1:3 (EM VOLUME DE CIMENTO E AREIA MÉDIA ÚMIDA)","M3","0,5972000","578,37",345.4]
[null,"COMPOSICAO","89993","GRAUTEAMENTO VERTICAL EM ALVENARIA ESTRUTURAL","M3","0,0299000","1.035,54",30.96]
[null,"COMPOSICAO","89995","GRAUTEAMENTO DE CINTA SUPERIOR OU DE VERGA EM ALVENARIA ESTRUTURAL","M3","0,0831000","999,68",83.07]
[null,"COMPOSICAO","89996","ARMAÇÃO VERTICAL DE ALVENARIA ESTRUTURAL; DIÂMETRO DE 10,0 MM","KG","0,9872000","10,08",9.9499999999999993]
[null,"COMPOSICAO","89998","ARMAÇÃO DE CINTA DE ALVENARIA ESTRUTURAL; DIÂMETRO DE 10,0 MM","KG","3,3318000","9,56",31.85]
[null,"COMPOSICAO","94970","CONCRETO FCK = 20MPA, TRAÇO 1:2,7:3 (EM MASSA SECA DE CIMENTO/ AREIA MÉDIA/ BRITA 1) - PREPARO MECÂNICO COM BETONEIRA 600 L","M3","0,2768000","475,96",131.74]
[null,"COMPOSICAO","97735","PEÇA RETANGULAR PRÉ-MOLDADA, VOLUME DE CONCRETO DE 30 A 100 LITROS, TAXA DE AÇO APROXIMADA DE 30KG/M³","M3","0,0616000","2.379,22",146.55000000000001]
[null,"COMPOSICAO","101617","PREPARO DE FUNDO DE VALA COM LARGURA MAIOR OU IGUAL A 1,5 M E MENOR QUE 2,5 M (ACERTO DO SOLO NATURAL)","M2","2,0800000","3,00",6.24]
[{"$nulls":7},0]
[null,"PRODUÇÃO DA EQUIPE",null,null,1,"CUSTO ",null,{"$f":"SUM(H444:H466)","v":2438.16}]
[null,"TOTAL",{"$nulls":5},{"$f":"H467/E467","v":2438.16},"OK"]
[null,"BDI                %",{"$nulls":5},{"$f":"1+$M$1","v":1.2149000000000001}]
[null,"TOTAL DO SERVIÇO - R$",{"$nulls":5},{"$f":"H468*H469","v":2962.1205840000002}]
[]
[23,"CODEVASF",null,null," COMPOSIÇÃO DE PREÇO UNITÁRIO",null,null,null,{"$f":"H502","v":4583.45},{"$f":"H504","v":5568.4334049999998}]
[null,"OBRA:  ",{"$f":"$C$2","v":"DRENAGEM E PAVIMENTAÇÃO - PARQUE DE EXPOSIÇÕES - SERRO/MG (ITEM 1)"},null,null,null,"DATA: ",{"$f":"$H$2","v":"OUTUBRO/2023"}]
[null,"SERVIÇO:  ",{"$f":"VLOOKUP(A472,ORÇAMENTO!$A$10:$I$53,3)","v":"CAIXA PARA BOCA DE LOBO DUPLA COMBINADA COM GRELHA RETANGULAR, EM ALVENARIA COM BLOCOS DE CONCRETO, DIMENSÕES INTERNAS: 1,3X2,2X1,2 M"},null,"SINAPI",{"$f":"VLOOKUP(A472,ORÇAMENTO!$A$10:$I$53,4)","v":97973},"UNIDADE: ",{"$f":"VLOOKUP(A472,ORÇAMENTO!$A$10:$I$54,5)","v":"UNID."}]
[]
[null,"TIPO ITEM","CODIGO ITEM","DESCRIÇÃO ITEM","UNIDADE ITEM","COEFICIENTE","PRECO UNITARIO","CUSTO TOTAL"]
[null,"INSUMO","660","CANALETA DE CONCRETO 19 X 19 X 19 CM ","UN","40,9500000","3,02",{"$f":"ROUNDDOWN(F477*G477,2)","v":123.66}]
[null,"INSUMO","2692","DESMOLDANTE PROTETOR PARA FORMAS DE MADEIRA, DE BASE OLEOSA EMULSIONADA EM AGUA","L","0,0146000","5,92",0.08]
[null,"INSUMO","4491","PONTALETE *7,5 X 7,5* CM EM PINUS, MISTA OU EQUIVALENTE DA REGIAO - BRUTA","M","0,3182000","8,69",2.76]
[null,"INSUMO","4517","SARRAFO *2,5 X 7,5* CM EM PINUS, MISTA OU EQUIVALENTE DA REGIAO - BRUTA","M","0,3784000","3,04",1.1499999999999999]
[null,"INSUMO","5069","PREGO DE ACO POLIDO COM CABECA 17 X 27 ","KG","0,0335000","19,59",0.65]
[null,"COMPOSICAO","5678","RETROESCAVADEIRA SOBRE RODAS COM CARREGADEIRA, TRAÇÃO 4X4, POTÊNCIA LÍQ. 88 HP, CAÇAMBA CARREG. CAP. MÍN. 1 M3, CAÇAMBA RETRO CAP. 0,26 M3, PESO OPERACIONAL MÍN. 6.674 KG, PROFUNDIDADE ESCAVAÇÃO MÁX. 4,37 M ","CHP","0,1303000","155,17",20.21]
[null,"COMPOSICAO","5679","RETROESCAVADEIRA SOBRE RODAS COM CARREGADEIRA, TRAÇÃO 4X4, POTÊNCIA LÍQ. 88 HP, CAÇAMBA CARREG. CAP. MÍN. 1 M3, CAÇAMBA RETRO CAP. 0,26 M3, PESO OPERACIONAL MÍN. 6.674 KG, PROFUNDIDADE ESCAVAÇÃO MÁX. 4,37 M ","CHI","0,2656000","74,35",19.739999999999998]
[null,"INSUMO","6193","TABUA NAO APARELHADA *2,5 X 20* CM, EM MACARANDUBA/MASSARANDUBA, ANGELIM OU EQUIVALENTE DA REGIAO - BRUTA","M","1,1868000","29,60",35.119999999999997]
[null,"INSUMO","25067","BLOCO DE CONCRETO ESTRUTURAL 19 X 19 X 39 CM","UN","89,8319000","4,87",437.48]
[null,"INSUMO","43386","MEIO-FIO OU GUIA DE CONCRETO PRE-MOLDADO, TIPO CHAPEU PARA BOCA DE LOBO,  DIMENSOES *1,20* X 0,15 X 0,30 M","UN","2,0000000","71,11",142.22]
[null,"INSUMO","43440","CONJUNTO PRE-MOLDADO COMPOSTO POR GRELHA (0,99 X 0,45 M), QUADRO (1,10 X 0,52 M) E CANTONEIRA (1,10 X 0,35 M), EM CONCRETO ARMADO, COM FCK DE 21 MPA","UN","2,0000000","524,54",1049.08]
[null,"COMPOSICAO","87316","ARGAMASSA TRAÇO 1:4 (EM VOLUME DE CIMENTO E AREIA GROSSA ÚMIDA) PARA CHAPISCO CONVENCIONAL","M3","0,0896000","503,10",45.07]
[null,"COMPOSICAO","88309","PEDREIRO COM ENCARGOS COMPLEMENTARES","H","22,0984000","27,45",606.6]
[null,"COMPOSICAO","88316","SERVENTE COM ENCARGOS COMPLEMENTARES","H","17,3630000","19,76",343.09]
[null,"COMPOSICAO","88628","ARGAMASSA TRAÇO 1:3 (EM VOLUME DE CIMENTO E AREIA MÉDIA ÚMIDA)","M3","1,3110000","578,37",758.24]
[null,"COMPOSICAO","89993","GRAUTEAMENTO VERTICAL EM ALVENARIA ESTRUTURAL","M3","0,0523000","1.035,54",54.15]
[null,"COMPOSICAO","89995","GRAUTEAMENTO DE CINTA SUPERIOR OU DE VERGA EM ALVENARIA ESTRUTURAL","M3","0,1200000","999,68",119.96]
[null,"COMPOSICAO","89996","ARMAÇÃO VERTICAL DE ALVENARIA ESTRUTURAL; DIÂMETRO DE 10,0 MM","KG","1,7276000","10,08",17.41]
[null,"COMPOSICAO","89998","ARMAÇÃO DE CINTA DE ALVENARIA ESTRUTURAL; DIÂMETRO DE 10,0 MM","KG","4,8126000","9,56",46]
[null,"COMPOSICAO","94970","CONCRETO FCK = 20MPA, TRAÇO 1:2,7:3 (EM MASSA SECA DE CIMENTO/ AREIA MÉDIA/ BRITA 1) - PREPARO MECÂNICO COM BETONEIRA 600 L","M3","0,5140000","475,96",244.64]
[null,"COMPOSICAO","97735","PEÇA RETANGULAR PRÉ-MOLDADA, VOLUME DE CONCRETO DE 30 A 100 LITROS, TAXA DE AÇO APROXIMADA DE 30KG/M³","M3","0,1232000","2.379,22",293.11]
[null,"COMPOSICAO","97737","PEÇA RETANGULAR PRÉ-MOLDADA, VOLUME DE CONCRETO DE 30 A 70 LITROS , TAXA DE AÇO APROXIMADA DE 70KG/M³","M3","0,0680000","3.103,52",211.03]
[null,"COMPOSICAO","101617","PREPARO DE FUNDO DE VALA COM LARGURA MAIOR OU IGUAL A 1,5 M E MENOR QUE 2,5 M (ACERTO DO SOLO NATURAL)","M2","4,0000000","3,00",12]
[{"$nulls":7},0]
[null,"PRODUÇÃO DA EQUIPE",null,null,1,"CUSTO ",null,{"$f":"SUM(H477:H500)","v":4583.45}]
[null,"TOTAL",{"$nulls":5},{"$f":"H501/E501","v":4583.45},"OK"]
[null,"BDI                %",{"$nulls":5},{"$f":"1+$M$1","v":1.2149000000000001}]
[null,"TOTAL DO SERVIÇO - R$",{"$nulls":5},{"$f":"H502*H503","v":5568.4334049999998}]
[]
[24,"CODEVASF",null,null," COMPOSIÇÃO DE PREÇO UNITÁRIO",null,null,null,{"$f":"H536","v":2811.2100000000005},{"$f":"H538","v":3415.3390290000007}]
[null,"OBRA:  ",{"$f":"$C$2","v":"DRENAGEM E PAVIMENTAÇÃO - PARQUE DE EXPOSIÇÕES - SERRO/MG (ITEM 1)"},null,null,null,"DATA: ",{"$f":"$H$2","v":"OUTUBRO/2023"}]
[null,"SERVIÇO:  ",{"$f":"VLOOKUP(A506,ORÇAMENTO!$A$10:$I$53,3)","v":"POÇO DE VISITA RETANGULAR PARA DRENAGEM, EM ALVENARIA COM BLOCOS DE CONCRETO, DIMENSÕES INTERNAS = 1X1 M, PROFUNDIDADE = 1,40 M, INCLUSIVE TAMPÃO EM FERRO FUNDIDO D = 600MM"},null,"SINAPI",{"$f":"VLOOKUP(A506,ORÇAMENTO!$A$10:$I$53,4)","v":99252},"UNIDADE: ",{"$f":"VLOOKUP(A506,ORÇAMENTO!$A$10:$I$54,5)","v":"UNID."}]
[]
[null,"TIPO ITEM","CODIGO ITEM","DESCRIÇÃO ITEM","UNIDADE ITEM","COEFICIENTE","PRECO UNITARIO","CUSTO TOTAL"]
[null,"INSUMO","660","CANALETA DE CONCRETO 19 X 19 X 19 CM (CLASSE C - NBR 6136)","UN","25,2000000","3,02",{"$f":"ROUNDDOWN(F511*G511,2)","v":76.099999999999994}]
[null,"INSUMO","2692","DESMOLDANTE PROTETOR PARA FORMAS DE MADEIRA, DE BASE OLEOSA EMULSIONADA EM AGUA","L","0,0143000","5,92",0.08]
[null,"INSUMO","4491","PONTALETE *7,5 X 7,5* CM EM PINUS, MISTA OU EQUIVALENTE DA REGIAO - BRUTA","M","0,3108000","8,69",2.7]
[null,"INSUMO","4517","SARRAFO *2,5 X 7,5* CM EM PINUS, MISTA OU EQUIVALENTE DA REGIAO - BRUTA","M","0,3696000","3,04",1.1200000000000001]
[null,"INSUMO","5069","PREGO DE ACO POLIDO COM CABECA 17 X 27 (2 1/2 X 11)","KG","0,0328000","19,59",0.64]
[null,"COMPOSICAO","5678","RETROESCAVADEIRA SOBRE RODAS COM CARREGADEIRA, TRAÇÃO 4X4, POTÊNCIA LÍQ. 88 HP, CAÇAMBA CARREG. CAP. MÍN. 1 M3, CAÇAMBA RETRO CAP. 0,26 M3, PESO OPERACIONAL MÍN. 6.674 KG, PROFUNDIDADE ESCAVAÇÃO MÁX. 4,37 M","CHP","0,0993000","155,17",15.4]
[null,"COMPOSICAO","5679","RETROESCAVADEIRA SOBRE RODAS COM CARREGADEIRA, TRAÇÃO 4X4, POTÊNCIA LÍQ. 88 HP, CAÇAMBA CARREG. CAP. MÍN. 1 M3, CAÇAMBA RETRO CAP. 0,26 M3, PESO OPERACIONAL MÍN. 6.674 KG, PROFUNDIDADE ESCAVAÇÃO MÁX. 4,37 M","CHI","0,2024000","74,35",15.04]
[null,"INSUMO","6193","TABUA NAO APARELHADA *2,5 X 20* CM, EM MACARANDUBA/MASSARANDUBA, ANGELIM OU EQUIVALENTE DA REGIAO - BRUTA","M","1,1592000","29,60",34.31]
[null,"INSUMO","25067","BLOCO DE CONCRETO ESTRUTURAL 19 X 19 X 39 CM, FBK 4,5 MPA (NBR 6136)","UN","54,3233000","4,87",264.55]
[null,"COMPOSICAO","87316","ARGAMASSA TRAÇO 1:4 (EM VOLUME DE CIMENTO E AREIA GROSSA ÚMIDA) PARA CHAPISCO CONVENCIONAL, PREPARO COM BETONEIRA ","M3","0,0372000","503,10",18.71]
[null,"COMPOSICAO","88309","PEDREIRO COM ENCARGOS COMPLEMENTARES","H",13.9453,"27,45",382.79]
[null,"COMPOSICAO","88316","SERVENTE COM ENCARGOS COMPLEMENTARES","H","11,7428000","19,76",232.03]
[null,"COMPOSICAO","88628","ARGAMASSA TRAÇO 1:3 (EM VOLUME DE CIMENTO E AREIA MÉDIA ÚMIDA), PREPARO COM BETONEIRA","M3",5.7000000000000002E-2,"578,37",32.96]
[null,"COMPOSICAO","89993","GRAUTEAMENTO VERTICAL EM ALVENARIA ESTRUTURAL","M3","0,0598000","1.035,54",61.92]
[null,"COMPOSICAO","89995","GRAUTEAMENTO DE CINTA SUPERIOR OU DE VERGA EM ALVENARIA ESTRUTURAL","M3","0,0738000","999,68",73.77]
[null,"COMPOSICAO","89996","ARMAÇÃO VERTICAL DE ALVENARIA ESTRUTURAL; DIÂMETRO DE 10,0 MM","KG","1,9744000","10,08",19.899999999999999]
[null,"COMPOSICAO","89998","ARMAÇÃO DE CINTA DE ALVENARIA ESTRUTURAL; DIÂMETRO DE 10,0 MM","KG","2,9616000","9,56",28.31]
[null,"COMPOSICAO","92767","ARMAÇÃO DE LAJE DE ESTRUTURA CONVENCIONAL DE CONCRETO ARMADO UTILIZANDO AÇO CA-60 DE 4,2 MM - MONTAGEM","KG","12,6004000","14,93",188.12]
[null,"COMPOSICAO","94970","CONCRETO FCK = 20MPA, TRAÇO 1:2,7:3 (EM MASSA SECA DE CIMENTO/ AREIA MÉDIA/ BRITA 1) - PREPARO COM BETONEIRA","M3","0,4747000","475,96",225.93]
[null,"COMPOSICAO","97736","PEÇA RETANGULAR PRÉ-MOLDADA, VOLUME DE CONCRETO ACIMA DE 100 LITROS, TAXA DE AÇO APROXIMADA DE 30KG/M³","M3","0,2516000","1.447,42",364.17]
[null,"COMPOSICAO","97738","PEÇA CIRCULAR PRÉ-MOLDADA, VOLUME DE CONCRETO DE 10 A 30 LITROS, TAXA DE FIBRA DE POLIPROPILENO APROXIMADA DE 6 KG/M³","M3","0,0221000","4.856,07",107.31]
[null,"COMPOSICAO","101624","PREPARO DE FUNDO DE VALA COM LARGURA MAIOR OU IGUAL A 1,5 M E MENOR QUE 2,5 M, COM CAMADA DE BRITA, LANÇAMENTO MECANIZADO","M3","0,6348000","226,26",143.62]
[null,"INSUMO",6240,"TAMPAO FOFO SIMPLES COM BASE / REQUADRO, CLASSE D400 CARGA MAX. 40 T, UN 521,73\nREDONDO, TAMPA 600 MM, REDE PLUVIAL/ESGOTO (COM INSCRICAO EM RELEVO DO TIPO DE REDE)","UNID.",1,521.73,521.73]
[{"$nulls":7},0]
[null,"PRODUÇÃO DA EQUIPE",null,null,1,"CUSTO ",null,{"$f":"SUM(H511:H534)","v":2811.2100000000005}]
[null,"TOTAL",{"$nulls":5},{"$f":"H535/E535","v":2811.2100000000005},"OK"]
[null,"BDI                %",{"$nulls":5},{"$f":"1+$M$1","v":1.2149000000000001}]
[null,"TOTAL DO SERVIÇO - R$",{"$nulls":5},{"$f":"H536*H537","v":3415.3390290000007}]
[]
[25,"CODEVASF",null,null," COMPOSIÇÃO DE PREÇO UNITÁRIO",null,null,null,{"$f":"H550","v":781.01},{"$f":"H552","v":948.84904900000004}]
[null,"OBRA:  ",{"$f":"$C$2","v":"DRENAGEM E PAVIMENTAÇÃO - PARQUE DE EXPOSIÇÕES - SERRO/MG (ITEM 1)"},null,null,null,"DATA: ",{"$f":"$H$2","v":"OUTUBRO/2023"}]
[null,"SERVIÇO:  ",{"$f":"VLOOKUP(A540,ORÇAMENTO!$A$10:$I$53,3)","v":"BACIA DE DISSIPAÇÃO, TIPO BACIA EM PEDRA DE MÃO FIXADA COM CONCRETO (DEB 01, 02), COM PREPARO MANUAL, FCK = 20 MPA, LANÇADO MANUALMENTE, INCLUINDO MATERIAIS E FÔRMAS"},null,"SINAPI",{"$f":"VLOOKUP(A540,ORÇAMENTO!$A$10:$I$53,4)","v":103930},"UNIDADE: ",{"$f":"VLOOKUP(A540,ORÇAMENTO!$A$10:$I$54,5)","v":"M3"}]
[]
[null,"TIPO ITEM","CODIGO ITEM","DESCRIÇÃO ITEM","UNIDADE ITEM","COEFICIENTE","PRECO UNITARIO","CUSTO TOTAL"]
[null,"COMPOSICAO","103796","FABRICAÇÃO, MONTAGEM E DESMONTAGEM DE FÔRMA PARA BACIA DE DISSIPAÇÃO, EM MADEIRA SERRADA, E = 25 MM","M2","4,1235000","60,26",{"$f":"ROUNDDOWN(F545*G545,2)","v":248.48}]
[null,"COMPOSICAO","103799","PEDRA DE MÃO FIXADA COM CONCRETO PARA BACIA DE DISSIPAÇÃO, 40% DE CONCRETO EM VOLUME, FCK = 20 MPA, COM USO DE JERICA E PREPARO EM BETONEIRA DE 600 L - AREIA, BRITA E PEDRA DE MÃO COMERCIAIS - LANÇAMENTO, ADENSAMENTO E ACABAMENTO","M3","0,5387000","432,56",233.02]
[null,"COMPOSICAO","103801","CONCRETAGEM DE DISSIPADOR DE ENERGIA, FCK = 20 MPA, COM USO DE JERICAS E PREPARO EM BETONEIRA DE 600 L - AREIA E BRITA COMERCIAIS - LANÇAMENTO, ADENSAMENTO E ACABAMENTO","M3","0,4613000","649,28",299.51]
[]
[null,"PRODUÇÃO DA EQUIPE",null,null,1,"CUSTO ",null,{"$f":"SUM(H545:H548)","v":781.01}]
[null,"TOTAL",{"$nulls":5},{"$f":"H549/E549","v":781.01},"OK"]
[null,"BDI                %",{"$nulls":5},{"$f":"1+$M$1","v":1.2149000000000001}]
[null,"TOTAL DO SERVIÇO - R$",{"$nulls":5},{"$f":"H550*H551","v":948.84904900000004}]
[]
[26,"CODEVASF",null,null," COMPOSIÇÃO DE PREÇO UNITÁRIO",null,null,null,{"$f":"H565","v":1523.0700000000002},{"$f":"H567","v":1850.3777430000002}]
[null,"OBRA:  ",{"$f":"$C$2","v":"DRENAGEM E PAVIMENTAÇÃO - PARQUE DE EXPOSIÇÕES - SERRO/MG (ITEM 1)"},null,null,null,"DATA: ",{"$f":"$H$2","v":"OUTUBRO/2023"}]
[null,"SERVIÇO:  ",{"$f":"VLOOKUP(A554,ORÇAMENTO!$A$10:$I$53,3)","v":"ESCADA HIDRÁULICA, LARGURA ATÉ 1M, TIPO DESCIDA DÁGUA DE CORTE OU ATERRO EM DEGRAUS (DCD 02, 04 E DAD 02), EM CONCRETO USINADO, FCK = 20 MPA, INCLUINDO ARMAÇÃO, MATERIAIS E FÔRMAS"},null,"SINAPI",{"$f":"VLOOKUP(A554,ORÇAMENTO!$A$10:$I$53,4)","v":103925},"UNIDADE: ",{"$f":"VLOOKUP(A554,ORÇAMENTO!$A$10:$I$54,5)","v":"M3"}]
[]
[null,"TIPO ITEM","CODIGO ITEM","DESCRIÇÃO ITEM","UNIDADE ITEM","COEFICIENTE","PRECO UNITARIO","CUSTO TOTAL"]
[null,"COMPOSICAO","98576","TRATAMENTO DE JUNTA DE DILATAÇÃO COM MANTA ASFÁLTICA ADERIDA COM MAÇARICO","M","0,4350000","21,15",{"$f":"ROUNDDOWN(F559*G559,2)","v":9.1999999999999993}]
[null,"COMPOSICAO","103795","FABRICAÇÃO, MONTAGEM E DESMONTAGEM DE FÔRMA PARA ESCADA HIDRÁULICA, EM CHAPA DE MADEIRA COMPENSADA RESINADA, E = 17 MM","M2",6.4255000000000004,"81,34",522.65]
[null,"COMPOSICAO","103797","ARMAÇÃO DE DESCIDA D\u0092ÁGUA UTILIZANDO AÇO CA-60 DE 5 MM - MONTAGEM","KG","24,6980000","15,53",383.55]
[null,"COMPOSICAO","103798","CONCRETAGEM DE DISSIPADOR DE ENERGIA, CONCRETO USINADO, FCK = 20 MPA, COM USO DE BOMBA - LANÇAMENTO, ADENSAMENTO E ACABAMENTO","M3",0.85,"714,91",607.66999999999996]
[]
[null,"PRODUÇÃO DA EQUIPE",null,null,1,"CUSTO ",null,{"$f":"SUM(H559:H563)","v":1523.0700000000002}]
[null,"TOTAL",{"$nulls":5},{"$f":"H564/E564","v":1523.0700000000002},"OK"]
[null,"BDI                %",{"$nulls":5},{"$f":"1+$M$1","v":1.2149000000000001}]
[null,"TOTAL DO SERVIÇO - R$",{"$nulls":5},{"$f":"H565*H566","v":1850.3777430000002}]
[]
[27,"CODEVASF",null,null," COMPOSIÇÃO DE PREÇO UNITÁRIO",null,null,null,{"$f":"H580","v":25.169999999999998},{"$f":"H582","v":30.579032999999999}]
[null,"OBRA:  ",{"$f":"$C$2","v":"DRENAGEM E PAVIMENTAÇÃO - PARQUE DE EXPOSIÇÕES - SERRO/MG (ITEM 1)"},null,null,null,"DATA: ",{"$f":"$H$2","v":"OUTUBRO/2023"}]
[null,"SERVIÇO:  ",{"$f":"VLOOKUP(A569,ORÇAMENTO!$A$10:$I$53,3)","v":"REATERRO MANUAL DE VALAS COM COMPACTAÇÃO MECANIZADA"},null,"SINAPI",{"$f":"VLOOKUP(A569,ORÇAMENTO!$A$10:$I$53,4)","v":93382},"UNIDADE: ",{"$f":"VLOOKUP(A569,ORÇAMENTO!$A$10:$I$54,5)","v":"M3"}]
[]
[null,"TIPO ITEM","CODIGO ITEM","DESCRIÇÃO ITEM","UNIDADE ITEM","COEFICIENTE","PRECO UNITARIO","CUSTO TOTAL"]
[null,"COMPOSICAO","5901","CAMINHÃO PIPA 10.000 L TRUCADO, PESO BRUTO TOTAL 23.000 KG POTÊNCIA 230 CV, INCLUSIVE TANQUE DE AÇO PARA TRANSPORTE DE ÁGUA","CHP","0,0054000","294,94",{"$f":"ROUNDDOWN(F574*G574,2)","v":1.59}]
[null,"COMPOSICAO","5903","CAMINHÃO PIPA 10.000 L TRUCADO, PESO BRUTO TOTAL 23.000 KG POTÊNCIA 230 CV, INCLUSIVE TANQUE DE AÇO PARA TRANSPORTE DE ÁGUA","CHI","0,0006000","72,55",0.04]
[null,"COMPOSICAO","88316","SERVENTE COM ENCARGOS COMPLEMENTARES","H","0,7866000","19,76",15.54]
[null,"COMPOSICAO","91533","COMPACTADOR DE SOLOS DE PERCUSSÃO (SOQUETE) COM MOTOR A GASOLINA 4 TEMPOS, POTÊNCIA 4 CV","CHP","0,1962000","40,78",8]
[]
[null,"PRODUÇÃO DA EQUIPE",null,null,1,"CUSTO ",null,{"$f":"SUM(H574:H578)","v":25.169999999999998}]
[null,"TOTAL",{"$nulls":5},{"$f":"H579/E579","v":25.169999999999998},"OK"]
[null,"BDI                %",{"$nulls":5},{"$f":"1+$M$1","v":1.2149000000000001}]
[null,"TOTAL DO SERVIÇO - R$",{"$nulls":5},{"$f":"H580*H581","v":30.579032999999999}]
[]
[28,"CODEVASF",null,null," COMPOSIÇÃO DE PREÇO UNITÁRIO",null,null,null,{"$f":"H599","v":3650.96},{"$f":"H601","v":4435.5513040000005}]
[null,"OBRA:  ",{"$f":"$C$2","v":"DRENAGEM E PAVIMENTAÇÃO - PARQUE DE EXPOSIÇÕES - SERRO/MG (ITEM 1)"},null,null,null,"DATA: ",{"$f":"$H$2","v":"OUTUBRO/2023"}]
[null,"SERVIÇO:  ",{"$f":"VLOOKUP(A584,ORÇAMENTO!$A$10:$I$53,3)","v":"BOCA PARA BUEIRO SIMPLES TUBULAR D = 80 CM EM CONCRETO, ALAS COM ESCONSIDADE DE 0°, INCLUINDO FÔRMAS E MATERIAIS"},null,"SINAPI",{"$f":"VLOOKUP(A584,ORÇAMENTO!$A$10:$I$53,4)","v":102739},"UNIDADE: ",{"$f":"VLOOKUP(A584,ORÇAMENTO!$A$10:$I$54,5)","v":"UNID."}]
[]
[null,"TIPO ITEM","CODIGO ITEM","DESCRIÇÃO ITEM","UNIDADE ITEM","COEFICIENTE","PRECO UNITARIO","CUSTO TOTAL"]
[null,"COMPOSICAO","96620","LASTRO DE CONCRETO MAGRO, APLICADO EM PISOS, LAJES SOBRE SOLO OU RADIERS","M3","0,2880000","629,64",{"$f":"ROUNDDOWN(F589*G589,2)","v":181.33}]
[null,"COMPOSICAO","102727","FABRICAÇÃO, MONTAGEM E DESMONTAGEM DE FÔRMA PARA BOCA PARA BUEIRO, EM CHAPA DE MADEIRA COMPENSADA RESINADA, E = 17 MM","M2","9,2667000","91,89",851.51]
[null,"COMPOSICAO","102728","ARMAÇÃO DE MURO ALA E MURO TESTA UTILIZANDO AÇO CA-50 DE 6,3 MM - MONTAGEM","KG","65,0389000","14,00",910.54]
[null,"COMPOSICAO","102729","ARMAÇÃO DE MURO ALA E MURO TESTA UTILIZANDO AÇO CA-50 DE 8 MM - MONTAGEM","KG","3,7320000","12,94",48.29]
[null,"COMPOSICAO","102730","ARMAÇÃO DE MURO ALA E MURO TESTA UTILIZANDO AÇO CA-50 DE 10 MM - MONTAGEM","KG","10,6874000","11,45",122.37]
[null,"COMPOSICAO","102731","ARMAÇÃO DE MURO ALA E MURO TESTA UTILIZANDO AÇO CA-50 DE 12,5 MM - MONTAGEM","KG","26,3330000","9,63",253.58]
[null,"COMPOSICAO","102734","ARMAÇÃO DE SOLEIRA UTILIZANDO AÇO CA-50 DE 6,3 MM - MONTAGEM","KG","11,5309000","13,07",150.69999999999999]
[null,"COMPOSICAO","102736","CONCRETAGEM DE BOCA PARA BUEIRO, FCK = 20 MPA, COM USO DE BOMBA - LANÇAMENTO, ADENSAMENTO E ACABAMENTO","M3","1,6202000","699,08",1132.6400000000001]
[{"$nulls":7},0]
[null,"PRODUÇÃO DA EQUIPE",null,null,1,"CUSTO ",null,{"$f":"SUM(H589:H597)","v":3650.96}]
[null,"TOTAL",{"$nulls":5},{"$f":"H598/E598","v":3650.96},"OK"]
[null,"BDI                %",{"$nulls":5},{"$f":"1+$M$1","v":1.2149000000000001}]
[null,"TOTAL DO SERVIÇO - R$",{"$nulls":5},{"$f":"H599*H600","v":4435.5513040000005}]
[]
[29,"CODEVASF",null,null," COMPOSIÇÃO DE PREÇO UNITÁRIO",null,null,null,{"$f":"H621","v":6466.73},{"$f":"H623","v":7856.4302770000004}]
[null,"OBRA:  ",{"$f":"$C$2","v":"DRENAGEM E PAVIMENTAÇÃO - PARQUE DE EXPOSIÇÕES - SERRO/MG (ITEM 1)"},null,null,null,"DATA: ",{"$f":"$H$2","v":"OUTUBRO/2023"}]
[null,"SERVIÇO:  ",{"$f":"VLOOKUP(A603,ORÇAMENTO!$A$10:$I$54,3)","v":"FAIXA ELEVADA PARA TRAVESSIA DE PEDESTRES - CONF. PROJETO, INCLUSIVE PINTURA DE SINALIZAÇÃO"},null,"SINAPI",{"$f":"VLOOKUP(A603,ORÇAMENTO!$A$10:$I$54,4)","v":"CPU.4"},"UNIDADE: ",{"$f":"VLOOKUP(A603,ORÇAMENTO!$A$10:$I$54,5)","v":"UNID."}]
[]
[null,"TIPO ITEM","CODIGO ITEM","DESCRIÇÃO ITEM","UNIDADE ITEM","COEFICIENTE","PRECO UNITARIO","CUSTO TOTAL"]
[null,"INSUMO",2692,"DESMOLDANTE PROTETOR PARA FORMAS DE MADEIRA, DE BASE OLEOSA EMULSIONADA EM AGUA","L","0,0213000","5,92",{"$f":"ROUNDDOWN(F608*G608,2)","v":0.12}]
[null,"INSUMO",4509,"SARRAFO *2,5 X 10* CM EM PINUS, MISTA OU EQUIVALENTE DA REGIAO - BRUTA","M",{"$f":"6*0.25+6*0.15","v":2.4},"4,41",{"$f":"ROUNDDOWN(F609*G609,2)","v":10.58}]
[null,"INSUMO",4517,"SARRAFO *2,5 X 7,5* CM EM PINUS, MISTA OU EQUIVALENTE DA REGIAO - BRUTA","M",5,"3,04",15.2]
[null,"INSUMO",5068,"PREGO DE ACO POLIDO COM CABECA 17 X 21 (2 X 11)","KG","0,2994000","19,23",5.75]
[null,"COMPOSICAO",88262,"CARPINTEIRO DE FORMAS COM ENCARGOS COMPLEMENTARES","H","1,6268000","27,05",44]
[null,"COMPOSICAO",88309,"PEDREIRO COM ENCARGOS COMPLEMENTARES","H","1,4149000","27,45",38.83]
[null,"COMPOSICAO",88316,"SERVENTE COM ENCARGOS COMPLEMENTARES","H","3,0417000","19,76",60.1]
[null,"COMPOSICAO",94964,"CONCRETO FCK = 20MPA, TRAÇO 1:2,7:3 (EM MASSA SECA DE CIMENTO/ AREIA MÉDIA/ BRITA 1) - PREPARO MECÂNICO COM BETONEIRA 400 L.","M3",{"$f":"3*6*0.15+(6*(0.15+0.1)*1.5/2)*2","v":4.9499999999999993},"489,87",2424.85]
[null,"COMPOSICAO",97093,"ARMAÇÃO PARA EXECUÇÃO DE RADIER, PISO DE CONCRETO OU LAJE SOBRE SOLO, COM USO DE TELA","KG",{"$f":"F615*40","v":197.99999999999997},13.71,2714.58]
[null,"COMPOSICAO",102491,"PINTURA DE PISO COM TINTA ACRÍLICA, APLICAÇÃO MANUAL, 2 DEMÃOS, INCLUSO FUNDO PREPARADOR","M2",{"$f":"6*6","v":36},19.260000000000002,693.36]
[null,"COMPOSICAO",102509,"PINTURA DE FAIXA DE PEDESTRE OU ZEBRADA TINTA RETRORREFLETIVA A BASE DE RESINA ACRÍLICA COM MICROESFERAS DE VIDRO, E = 30 CM, APLICAÇÃO MANUAL","M2",{"$f":"3*6","v":18},25.52,459.36]
[null,"COMPOSICAO",{"$nulls":5},0]
[null,"PRODUÇÃO DA EQUIPE",null,null,1,"CUSTO ",null,{"$f":"SUM(H608:H619)","v":6466.73}]
[null,"TOTAL",{"$nulls":5},{"$f":"H620/E620","v":6466.73},"OK"]
[null,"BDI                %",{"$nulls":5},{"$f":"1+$M$1","v":1.2149000000000001}]
[null,"TOTAL DO SERVIÇO - R$",{"$nulls":5},{"$f":"H621*H622","v":7856.4302770000004}]
[]
[30,"CODEVASF",null,null," COMPOSIÇÃO DE PREÇO UNITÁRIO",null,null,null,{"$f":"H636","v":113.27000000000001},{"$f":"H638","v":137.61172300000001}]
[null,"OBRA:  ",{"$f":"$C$2","v":"DRENAGEM E PAVIMENTAÇÃO - PARQUE DE EXPOSIÇÕES - SERRO/MG (ITEM 1)"},null,null,null,"DATA: ",{"$f":"$H$2","v":"OUTUBRO/2023"}]
[null,"SERVIÇO:  ",{"$f":"VLOOKUP(A625,ORÇAMENTO!$A$10:$I$53,3)","v":"ESTACA BROCA DE CONCRETO, DIÂMETRO DE 30CM, ESCAVAÇÃO MANUAL COM TRADO CONCHA, COM ARMADURA DE ARRANQUE"},null,"SINAPI",{"$f":"VLOOKUP(A625,ORÇAMENTO!$A$10:$I$53,4)","v":101175},"UNIDADE: ",{"$f":"VLOOKUP(A625,ORÇAMENTO!$A$10:$I$53,5)","v":"M"}]
[]
[null,"TIPO ITEM","CODIGO ITEM","DESCRIÇÃO ITEM","UNIDADE ITEM","COEFICIENTE","PRECO UNITARIO","CUSTO TOTAL"]
[null,"COMPOSICAO","88309","PEDREIRO COM ENCARGOS COMPLEMENTARES","H","1,1030000","27,45",{"$f":"ROUNDDOWN(F630*G630,2)","v":30.27}]
[null,"COMPOSICAO","88316","SERVENTE COM ENCARGOS COMPLEMENTARES","H","1,3300000","19,76",26.28]
[null,"COMPOSICAO","92804","CORTE E DOBRA DE AÇO CA-50, DIÂMETRO DE 12,5 MM","KG","2,1230000","7,44",15.79]
[null,"COMPOSICAO","94970","CONCRETO FCK = 20MPA, TRAÇO 1:2,7:3 (EM MASSA SECA DE CIMENTO/ AREIA MÉDIA/ BRITA 1) - PREPARO MECÂNICO COM BETONEIRA ","M3","0,0860000","475,96",40.93]
[]
[null,"PRODUÇÃO DA EQUIPE",null,null,1,"CUSTO ",null,{"$f":"SUM(H630:H634)","v":113.27000000000001}]
[null,"TOTAL",{"$nulls":5},{"$f":"H635/E635","v":113.27000000000001},"OK"]
[null,"BDI                %",{"$nulls":5},{"$f":"1+$M$1","v":1.2149000000000001}]
[null,"TOTAL DO SERVIÇO - R$",{"$nulls":5},{"$f":"H636*H637","v":137.61172300000001}]
[]
[31,"CODEVASF",null,null," COMPOSIÇÃO DE PREÇO UNITÁRIO",null,null,null,{"$f":"H655","v":158.82999999999998},{"$f":"H657","v":192.96256700000001}]
[null,"OBRA:  ",{"$f":"$C$2","v":"DRENAGEM E PAVIMENTAÇÃO - PARQUE DE EXPOSIÇÕES - SERRO/MG (ITEM 1)"},null,null,null,"DATA: ",{"$f":"$H$2","v":"OUTUBRO/2023"}]
[null,"SERVIÇO:  ",{"$f":"VLOOKUP(A640,ORÇAMENTO!$A$10:$I$53,3)","v":"CONTENÇÃO EM CORTINA COM ESTACAS ESPAÇADAS COM 30 CM DE DIÂMETRO E PROFUNDIDADE MENOR OU IGUAL A 10 M."},null,"SINAPI",{"$f":"VLOOKUP(A640,ORÇAMENTO!$A$10:$I$53,4)","v":98615},"UNIDADE: ",{"$f":"VLOOKUP(A640,ORÇAMENTO!$A$10:$I$53,5)","v":"M2"}]
[]
[null,"TIPO ITEM","CODIGO ITEM","DESCRIÇÃO ITEM","UNIDADE ITEM","COEFICIENTE","PRECO UNITARIO","CUSTO TOTAL"]
[null,"INSUMO","34493","CONCRETO USINADO BOMBEAVEL, CLASSE DE RESISTENCIA C25, COM BRITA 0 E 1, SLUMP = 100 +/- 20 MM","M3","0,1446000","565,50",{"$f":"ROUNDDOWN(F645*G645,2)","v":81.77}]
[null,"COMPOSICAO","88309","PEDREIRO COM ENCARGOS COMPLEMENTARES","H","0,1233000","27,45",3.38]
[null,"COMPOSICAO","88316","SERVENTE COM ENCARGOS COMPLEMENTARES","H","0,3700000","19,76",7.31]
[null,"COMPOSICAO","90680","PERFURATRIZ HIDRÁULICA SOBRE CAMINHÃO COM TRADO CURTO ACOPLADO, PROFUNDIDADE MÁXIMA DE 20 M, DIÂMETRO MÁXIMO DE 1500 MM, POTÊNCIA INSTALADA DE 137 HP, MESA ROTATIVA COM TORQUE MÁXIMO DE 30 KNM","CHP","0,0785000","426,94",33.51]
[null,"COMPOSICAO","90681","PERFURATRIZ HIDRÁULICA SOBRE CAMINHÃO COM TRADO CURTO ACOPLADO, PROFUNDIDADE MÁXIMA DE 20 M, DIÂMETRO MÁXIMO DE 1500 MM, POTÊNCIA INSTALADA DE 137 HP, MESA ROTATIVA COM TORQUE MÁXIMO DE 30 KNM","CHI","0,0449000","191,54",8.6]
[null,"COMPOSICAO","91634","GUINDAUTO HIDRÁULICO, CAPACIDADE MÁXIMA DE CARGA 6500 KG, MOMENTO MÁXIMO DE CARGA 5,8 TM, ALCANCE MÁXIMO HORIZONTAL 7,60 M, INCLUSIVE CAMINHÃO TOCO PBT 9.700 KG, POTÊNCIA DE 160 CV","CHP","0,0700000","219,40",15.35]
[null,"COMPOSICAO","91635","GUINDAUTO HIDRÁULICO, CAPACIDADE MÁXIMA DE CARGA 6500 KG, MOMENTO MÁXIMO DE CARGA 5,8 TM, ALCANCE MÁXIMO HORIZONTAL 7,60 M, INCLUSIVE CAMINHÃO TOCO PBT 9.700 KG, POTÊNCIA DE 160 CV","CHI","0,1163000","63,86",7.42]
[null,"COMPOSICAO","97913","TRANSPORTE COM CAMINHÃO BASCULANTE DE 6 M³, EM VIA URBANA EM REVESTIMENTO PRIMÁRIO","M3XKM","0,0442000","3,11",0.13]
[null,"COMPOSICAO","100973","CARGA, MANOBRA E DESCARGA DE SOLOS E MATERIAIS GRANULARES EM CAMINHÃO BASCULANTE 6 M³ - CARGA COM PÁ CARREGADEIRA (CAÇAMBA DE 1,7 A 2,8 M³ / 128 HP) E DESCARGA LIVRE","M3","0,1473000","9,28",1.36]
[null,"PRODUÇÃO DA EQUIPE",null,null,1,"CUSTO ",null,{"$f":"SUM(H645:H653)","v":158.82999999999998}]
[null,"TOTAL",{"$nulls":5},{"$f":"H654/E654","v":158.82999999999998},"OK"]
[null,"BDI                %",{"$nulls":5},{"$f":"1+$M$1","v":1.2149000000000001}]
[null,"TOTAL DO SERVIÇO - R$",{"$nulls":5},{"$f":"H655*H656","v":192.96256700000001}]
[]
[34,"CODEVASF",null,null," COMPOSIÇÃO DE PREÇO UNITÁRIO",null,null,null,{"$f":"H666","v":2689.76},{"$f":"H668","v":3093.22}]
[null,"OBRA:  ",{"$f":"$C$2","v":"DRENAGEM E PAVIMENTAÇÃO - PARQUE DE EXPOSIÇÕES - SERRO/MG (ITEM 1)"},null,null,null,"DATA: ",{"$f":"$H$2","v":"OUTUBRO/2023"}]
[null,"SERVIÇO:  ",{"$f":"VLOOKUP(A659,ORÇAMENTO!$A$10:$I$53,3)","v":"AQUISIÇÃO DE EMULSÃO ASFÁLTICA PARA IMPRIMAÇÃO (EAI) - EXCLUSIVE TRANSPORTE"},null,"SINAPI",{"$f":"VLOOKUP(A659,ORÇAMENTO!$A$10:$I$53,4)","v":"CPU.7"},"UNIDADE: ",{"$f":"VLOOKUP(A659,ORÇAMENTO!$A$10:$I$53,5)","v":"T"}]
[]
[null,"TIPO ITEM","CODIGO ITEM","DESCRIÇÃO ITEM","UNIDADE ITEM","COEFICIENTE","PRECO UNITARIO","CUSTO TOTAL"]
[null,"INSUMO","ANP","EMULSÃO ASFÁLTICA PARA IMPRIMAÇÃO (CUSTO ANP, INCLUINDO ICMS 18%)","T",1,{"$f":"2.20561*1000*1.2195122","v":2689.7683034420002},{"$f":"ROUNDDOWN(F664*G664,2)","v":2689.76}]
[null,"PRODUÇÃO DA EQUIPE",null,null,1,"CUSTO ",null,{"$f":"SUM(H664:H664)","v":2689.76}]
[null,"TOTAL",{"$nulls":5},{"$f":"H665/E665","v":2689.76}]
[null,"BDI                %",{"$nulls":5},{"$f":"1+$M$2","v":1.1499999999999999}]
[null,"TOTAL DO SERVIÇO - R$",{"$nulls":5},{"$f":"ROUND(H666*H667,2)","v":3093.22},"OK"]
[]
[35,"CODEVASF",null,null," COMPOSIÇÃO DE PREÇO UNITÁRIO",null,null,null,{"$f":"H677","v":2706.7},{"$f":"H679","v":3112.71}]
[null,"OBRA:  ",{"$f":"$C$2","v":"DRENAGEM E PAVIMENTAÇÃO - PARQUE DE EXPOSIÇÕES - SERRO/MG (ITEM 1)"},null,null,null,"DATA: ",{"$f":"$H$2","v":"OUTUBRO/2023"}]
[null,"SERVIÇO:  ",{"$f":"VLOOKUP(A670,ORÇAMENTO!$A$10:$I$53,3)","v":"AQUISIÇÃO DE EMULSAO ASFALTICA CATIONICA RR-1C - EXCLUSIVE TRANSPORTE"},null,"SINAPI",{"$f":"VLOOKUP(A670,ORÇAMENTO!$A$10:$I$53,4)","v":"CPU.8"},"UNIDADE: ",{"$f":"VLOOKUP(A670,ORÇAMENTO!$A$10:$I$53,5)","v":"T"}]
[]
[null,"TIPO ITEM","CODIGO ITEM","DESCRIÇÃO ITEM","UNIDADE ITEM","COEFICIENTE","PRECO UNITARIO","CUSTO TOTAL"]
[null,"INSUMO","ANP","EMULSÃO ASFÁLTICA CATIÔNICA RR-1C(CUSTO ANP, INCLUINDO ICMS 18%)","T",1,{"$f":"2.2195*1.2195122*1000","v":2706.7073279000001},{"$f":"ROUNDDOWN(F675*G675,2)","v":2706.7}]
[null,"PRODUÇÃO DA EQUIPE",null,null,1,"CUSTO ",null,{"$f":"SUM(H675:H675)","v":2706.7}]
[null,"TOTAL",{"$nulls":5},{"$f":"H676/E676","v":2706.7},"OK"]
[null,"BDI                %",{"$nulls":5},{"$f":"1+$M$2","v":1.1499999999999999}]
[null,"TOTAL DO SERVIÇO - R$",{"$nulls":5},{"$f":"ROUND(H677*H678,2)","v":3112.71}]
[]
[36,"CODEVASF",null,null," COMPOSIÇÃO DE PREÇO UNITÁRIO",null,null,null,{"$f":"H688","v":597.5},{"$f":"H690","v":687.13}]
[null,"OBRA:  ",{"$f":"$C$2","v":"DRENAGEM E PAVIMENTAÇÃO - PARQUE DE EXPOSIÇÕES - SERRO/MG (ITEM 1)"},null,null,null,"DATA: ",{"$f":"$H$2","v":"OUTUBRO/2023"}]
[null,"SERVIÇO:  ",{"$f":"VLOOKUP(A681,ORÇAMENTO!$A$10:$I$53,3)","v":"AQUISIÇÃO DE CONCRETO BETUMINOSO USINADO A QUENTE (CBUQ) PARA PAVIMENTACAO ASFALTICA, PADRAO DNIT, FAIXA C, COM CAP 50/70 - EXCLUSIVE TRANSPORTE"},null,"SINAPI",{"$f":"VLOOKUP(A681,ORÇAMENTO!$A$10:$I$53,4)","v":"CPU.9"},"UNIDADE: ",{"$f":"VLOOKUP(A681,ORÇAMENTO!$A$10:$I$53,5)","v":"T"}]
[]
[null,"TIPO ITEM","CODIGO ITEM","DESCRIÇÃO ITEM","UNIDADE ITEM","COEFICIENTE","PRECO UNITARIO","CUSTO TOTAL"]
[null,"INSUMO",1518,"CONCRETO BETUMINOSO USINADO A QUENTE (CBUQ) PARA PAVIMENTACAO ASFALTICA, PADRAO DNIT, FAIXA C, COM CAP 50/70 - AQUISICAO POSTO USINA","T",1,597.5,{"$f":"ROUNDDOWN(F686*G686,2)","v":597.5}]
[null,"PRODUÇÃO DA EQUIPE",null,null,1,"CUSTO ",null,{"$f":"SUM(H686:H686)","v":597.5}]
[null,"TOTAL",{"$nulls":5},{"$f":"H687/E687","v":597.5},"OK"]
[null,"BDI                %",{"$nulls":5},{"$f":"1+$M$2","v":1.1499999999999999}]
[null,"TOTAL DO SERVIÇO - R$",{"$nulls":5},{"$f":"ROUND(H688*H689,2)","v":687.13}]

{"sheet":"BDI SERV","index":2,"n_rows":36,"n_cols":5,"rows_kept":36,"cut":false,"hidden":false,"merged":[[7,7,17,12],[35,0,35,5],[3,1,4,1],[3,2,4,2],[0,1,2,4],[31,0,33,5],[27,0,27,5],[29,1,29,2],[30,1,30,2]]}
[null,"DETALHAMENTO DO BDI - SERVIÇOS"]
[]
[]
[null,"Item","Descrição dos Serviços","%","%"]
[null,null,null,"PV","CD"]
[]
[null,1,"ADMINISTRAÇÃO CENTRAL"," ",4.01]
[null,"1.1","ESCRITÓRIO CENTRAL"," "," "]
[null,"1.2","VIAGENS"," "," "]
[null,"1.3","OUTROS"," "," "]
[null," "," "," "," "]
[null,2,"IMPOSTOS E TAXAS",{"$f":"SUM(D13:D15)","v":5.65},{"$f":"SUM(E13:E15)","v":7.0600000000000005}]
[null,"2.1","ISS (*)",{"$f":"4*0.5","v":2},{"$f":"ROUND(D13*1.2515,2)","v":2.5}]
[null,"2.2","PIS",0.65,{"$f":"ROUND(D14*1.2515,2)","v":0.81}]
[null,"2.3","Cofins",3,{"$f":"ROUND(D15*1.2515,2)","v":3.75}]
[]
[null,3,"TAXA DE RISCO"," ",{"$f":"SUM(E18:E21)","v":0.96}]
[null,"3.1","SEGURO",null,0.2]
[null,"3.2","RISCO",null,0.56000000000000005]
[null,"3.3","GARANTIA",null,0.2]
[]
[null,4,"DESPESAS FINANCEIRAS"," ",1.1100000000000001]
[]
[null,5,"LUCRO",null,8]
[]
[null," ","BDI - CALCULADO"," ",{"$f":"ROUND((((1+(E7+E17)/100)*(1+E22/100)*(1+E24/100)/(1-D12/100)-1)*100),2)","v":21.49}]
[]
["BDI = ((1+((AC+S+R+G)/100))x(1+DF/100)x(1+L/100)/(1-I/100)-1)*100"]
[]
[null,"BDI (CALCULADO):",null,{"$f":"ROUND((((1+((E7+E17)/100))*(1+E22/100)*(1+E24/100))/(1-D12/100)-1)*100,2)","v":21.49},"%"]
[null," "]
["(*) ISS CONFORME LEI COMPLEMENTAR Nº 63/2005 - ART. 30\n(QUANT. ESTIMADA DE MATERIAIS = 50%)"]
[]
[]
[" "]
["BDI EM CONFORMIDADE COM OS ACÓRDÃOS Nº 2369/2011 e ACÓRDÃO Nº 2.622/2013 - TCU - PLENÁRIO"]

{"sheet":"BDI FORN","index":3,"n_rows":36,"n_cols":5,"rows_kept":36,"cut":false,"hidden":false,"merged":[[7,7,17,12],[27,0,27,5],[29,1,29,2],[30,1,30,2],[31,0,33,5],[35,0,35,5],[0,1,2,4],[3,1,4,1],[3,2,4,2]]}
[null,"DETALHAMENTO DO BDI - FORNECIMENTOS"]
[]
[]
[null,"Item","Descrição dos Serviços","%","%"]
[null,null,null,"PV","CD"]
[]
[null,1,"ADMINISTRAÇÃO CENTRAL"," ",3.72]
[null,"1.1","ESCRITÓRIO CENTRAL"," "," "]
[null,"1.2","VIAGENS"," "," "]
[null,"1.3","OUTROS"," "," "]
[null," "," "," "," "]
[null,2,"IMPOSTOS E TAXAS",{"$f":"SUM(D13:D15)","v":3.65},{"$f":"SUM(E13:E15)","v":4.5600000000000005}]
[null,"2.1","ISS (*)",null,{"$f":"ROUND(D13*1.2515,2)","v":0}]
[null,"2.2","PIS",0.65,{"$f":"ROUND(D14*1.2515,2)","v":0.81}]
[null,"2.3","Cofins",3,{"$f":"ROUND(D15*1.2515,2)","v":3.75}]
[]
[null,3,"TAXA DE RISCO"," ",{"$f":"SUM(E18:E21)","v":0.82000000000000006}]
[null,"3.1","SEGURO",null,0.16]
[null,"3.2","RISCO",null,0.5]
[null,"3.3","GARANTIA",null,0.16]
[]
[null,4,"DESPESAS FINANCEIRAS"," ",0.94]
[]
[null,5,"LUCRO",null,5]
[]
[null," ","BDI - CALCULADO"," ",{"$f":"ROUND((((1+(E7+E17)/100)*(1+E22/100)*(1+E24/100)/(1-D12/100)-1)*100),2)","v":15}]
[]
["BDI = ((1+((AC+S+R+G)/100))x(1+DF/100)x(1+L/100)/(1-I/100)-1)*100"]
[]
[null,"BDI (CALCULADO):",null,{"$f":"ROUND((((1+((E7+E17)/100))*(1+E22/100)*(1+E24/100))/(1-D12/100)-1)*100,2)","v":15},"%"]
[null," "]
[]
[]
[]
[]
["BDI EM CONFORMIDADE COM OS ACÓRDÃOS Nº 2369/2011 e ACÓRDÃO Nº 2.622/2013 - TCU - PLENÁRIO"]

{"sheet":"CRONOGRAMA","index":4,"n_rows":19,"n_cols":12,"rows_kept":19,"cut":false,"hidden":false,"merged":[[15,1,16,2],[18,1,22,11],[7,2,8,2],[9,2,10,2],[11,2,12,2],[7,1,8,1],[9,1,10,1],[11,1,12,1],[0,1,0,11],[1,6,1,11],[2,6,2,11],[3,1,3,6],[5,0,6,0],[5,2,6,2],[1,1,2,1],[5,1,6,1],[1,2,2,4],[13,0,14,0],[13,1,14,1],[13,2,14,2],[7,0,8,0],[9,0,10,0],[11,0,12,0]]}
[null,"CRONOGRAMA FÍSICO-FINANCEIRO"]
[null,"OBRA: ",{"$f":"ORÇAMENTO!C5","v":"DRENAGEM E PAVIMENTAÇÃO - PARQUE DE EXPOSIÇÕES - SERRO/MG (ITEM 1)"},null,null,"VALOR:",{"$f":"ORÇAMENTO!I53","v":3027243.89}]
[{"$nulls":5},"PRAZO: ","180 DIAS "]
[]
[null,"ITEM","ETAPAS/DESCRIÇAO","FISICO/  FINANCEIRO","TOTAL    ETAPAS","MÊS 1","MÊS 2","MÊS 3","MÊS 4","MÊS 5","MÊS 6","TOTAL"]
["A",{"$f":"VLOOKUP(A6,ORÇAMENTO!$A$9:$I$53,2)","v":1},{"$f":"VLOOKUP(A6,ORÇAMENTO!$A$9:$I$53,3)","v":"SERVIÇOS PRELIMINARES "},"FISICO ",{"$f":"ROUND(E7/$G$2,4)","v":6.6900000000000001E-2},0.15,0.2,0.2,0.2,0.2,0.05,{"$f":"SUM(F6:K6)","v":1}]
[null,null,null,"FINANCEIRO",{"$f":"ORÇAMENTO!I9","v":202428.59999999998},{"$f":"ROUND($E$7*F6,2)","v":30364.29},{"$f":"ROUND($E$7*G6,2)","v":40485.72},{"$f":"ROUND($E$7*H6,2)","v":40485.72},{"$f":"ROUND($E$7*I6,2)","v":40485.72},40485.72,10121.43,202428.6]
["B",{"$f":"VLOOKUP(A8,ORÇAMENTO!$A$9:$I$53,2)","v":2},{"$f":"VLOOKUP(A8,ORÇAMENTO!$A$9:$I$53,3)","v":"TERRAPLANAGEM E PAVIMENTAÇÃO"},"FISICO ",{"$f":"ROUND(E9/$G$2,4)","v":0.32340000000000002},0.2,0.2,0.2,0.2,0.2,0,1]
[null,null,null,"FINANCEIRO",{"$f":"ORÇAMENTO!I15","v":979031.87000000011},{"$f":"ROUND($E$9*F8,2)","v":195806.37},{"$f":"ROUND($E$9*G8,2)","v":195806.37},{"$f":"ROUND($E$9*H8,2)","v":195806.37},{"$f":"ROUND($E$9*I8,2)","v":195806.37},195806.37,0,979031.85]
["C",{"$f":"VLOOKUP(A10,ORÇAMENTO!$A$9:$I$53,2)","v":3},{"$f":"VLOOKUP(A10,ORÇAMENTO!$A$9:$I$53,3)","v":"TRANSPORTE DE MATERIAIS"},"FISICO ",{"$f":"ROUND(E11/$G$2,4)","v":8.6999999999999994E-2},0.2,0.2,0.2,0.2,0.2,0,1]
[null,null,null,"FINANCEIRO",{"$f":"ORÇAMENTO!I25","v":263511.81},{"$f":"ROUND($E$11*F10,2)","v":52702.36},{"$f":"ROUND($E$11*G10,2)","v":52702.36},{"$f":"ROUND($E$11*H10,2)","v":52702.36},{"$f":"ROUND($E$11*I10,2)","v":52702.36},52702.36,0,263511.8]
["D",{"$f":"VLOOKUP(A12,ORÇAMENTO!$A$9:$I$53,2)","v":4},{"$f":"VLOOKUP(A12,ORÇAMENTO!$A$9:$I$53,3)","v":"DRENAGEM E OBRAS COMPLEMENTARES"},"FISICO ",{"$f":"ROUND(E13/$G$2,4)","v":0.39789999999999998},0.2,0.2,0.2,0.2,0.1,0.1,1]
[null,null,null,"FINANCEIRO",{"$f":"ORÇAMENTO!I28","v":1204486.55},{"$f":"ROUND($E$13*F12,2)","v":240897.31},{"$f":"ROUND($E$13*G12,2)","v":240897.31},{"$f":"ROUND($E$13*H12,2)","v":240897.31},{"$f":"ROUND($E$13*I12,2)","v":240897.31},120448.66,120448.66,1204486.5599999998]
["E",{"$f":"VLOOKUP(A14,ORÇAMENTO!$A$9:$I$53,2)","v":5},{"$f":"VLOOKUP(A14,ORÇAMENTO!$A$9:$I$53,3)","v":"FORNECIMENTOS - MATERIAL ASFÁLTICO (BDI DIFERENCIADO)"},"FISICO ",{"$f":"ROUND(E15/$G$2,4)","v":0.12479999999999999},0.2,0.2,0.2,0.2,0.1,0.1,{"$f":"SUM(F14:K14)","v":1}]
[null,null,null,"FINANCEIRO",{"$f":"ORÇAMENTO!I49","v":377785.06},{"$f":"ROUND($E$15*F14,2)","v":75557.009999999995},75557.009999999995,75557.009999999995,75557.009999999995,37778.51,37778.51,377785.06]
[null,"TOTAL",null,"FISICO ",{"$f":"SUM(F16:K16)","v":0.99999999339333057},{"$f":"F17/E17","v":0.1966565501929215},{"$f":"G17/$E$17","v":0.19999999735733218},{"$f":"H17/$E$17","v":0.19999999735733218},{"$f":"I17/$E$17","v":0.19999999735733218},0.14773227273736442,5.5611178391047969E-2,0.99999999339333057]
[null,null,null,"FINANCEIRO",{"$f":"E11+E9+E7+E13+E15","v":3027243.89},{"$f":"F11+F9+F7+F13+F15","v":595327.34},{"$f":"G11+G9+G7+G13+G15","v":605448.77},{"$f":"H11+H9+H7+H13+H15","v":605448.77},605448.77,447221.62,168348.6,{"$f":"ROUNDUP(SUM(F17:K17),2)+0.02","v":3027243.89}]
[]
[null,"OBSERVAÇÕES:"]