{"text_format":"2","workbook":"xlsx","n_sheets":4,"sheets":["ORÇAMENTO","CPU","BDI SERV","CRONOGRAMA"],"not_rendered":{"charts":0,"images":7,"macros":0,"external_links":0,"defined_names":4,"comments":1,"pivot_tables":0},"unopened":[],"bounds":{"document_bytes":16777216,"sheet_cells":100000,"run_cost":"one","rows_first":2000,"rows_last":500,"rows_between":2000,"halvings":0,"cell_chars":16384,"cell_head_chars":4096},"cells_cut":0,"cells_raw":0,"read":"whole","date_system":"1900"}

{"sheet":"ORÇAMENTO","index":0,"n_rows":47,"n_cols":9,"rows_kept":47,"cut":false,"hidden":false,"merged":[[6,6,6,7],[46,1,46,2],[0,0,7,0],[0,2,0,8],[1,2,1,8],[2,2,2,8],[4,2,4,8],[5,6,5,7]]}
["<---- NUMERAR SERVIÇOS PARA CPU",null,"Ministério do Desenvolvimento Regional"]
[null,null,"Companhia de Desenvolvimento dos Vales do São Francisco e do Parnaíba"]
[null,null,"1ª Superintendência Regional"]
[]
[null,"OBRA: ","PAVIMENTAÇÃO EM BLOQUETE SEXTAVADOS - RUA BOM JARDIM (BAIRRO SANTO ANTÔNIO) - SERRO/MG (ITEM 2)"]
[null,"DATA:","OUTUBRO/2023",null,null,null,"BDI Serviços:",null,{"$f":"'BDI SERV'!D30/100","v":0.21489999999999998}]
[null,"PRAZO DE EXECUÇÃO:    150 DIAS"]
[null,"ITEM","DISCRIMINAÇÃO","REFER.","UNID.","QUANT.","P. UNITÁRIO","P.UNIT.C/ BDI","P. TOTAL"]
["A",1,"SERVIÇOS PRELIMINARES ",{"$nulls":5},{"$f":"SUM(I10:I14)","v":153884.53000000003}]
[1,"1.1","MOBILIZAÇÃO E DESMOBILIZAÇÃO","CPU.1","GL",1,{"$f":"VLOOKUP(A10,CPU!$A$1:$N$4885,9)","v":14753.36},{"$f":"VLOOKUP(A10,CPU!$A$1:$N$4885,10)","v":17923.857064000003},{"$f":"ROUND(F10*H10,2)","v":17923.86}]
[2,"1.2","ADMINISTRAÇÃO LOCAL","CPU.2","GL",1,{"$f":"VLOOKUP(A11,CPU!$A$1:$N$4885,9)","v":96005},{"$f":"VLOOKUP(A11,CPU!$A$1:$N$4885,10)","v":116636.47450000001},{"$f":"ROUND(F11*H11,2)","v":116636.47}]
[3,"1.3","CANTEIRO DE OBRAS","CPU.3","GL",1,{"$f":"VLOOKUP(A12,CPU!$A$1:$N$4885,9)","v":11337.75},{"$f":"VLOOKUP(A12,CPU!$A$1:$N$4885,10)","v":13774.232475000001},{"$f":"ROUND(F12*H12,2)","v":13774.23}]
[4,"1.4","PLACA DE OBRA EM CHAPA DE AÇO GALVANIZADO",103689,"M2",4.5,{"$f":"VLOOKUP(A13,CPU!$A$1:$N$4885,9)","v":340.5},{"$f":"VLOOKUP(A13,CPU!$A$1:$N$4885,10)","v":413.67345},{"$f":"ROUND(F13*H13,2)","v":1861.53}]
[5,"1.5","SERVIÇOS TOPOGRÁFICOS PARA PAVIMENTAÇÃO, INCLUSIVE NOTA DE SERVIÇO, ACOMPANHAMENTO E GREIDE",99064,"M2",9200,{"$f":"VLOOKUP(A14,CPU!$A$1:$N$4885,9)","v":0.32999999999999996},{"$f":"VLOOKUP(A14,CPU!$A$1:$N$4885,10)","v":0.40091699999999997},{"$f":"ROUND(F14*H14,2)","v":3688.44}]
["B",2,"PAVIMENTAÇÃO",{"$nulls":5},{"$f":"SUM(I16:I20)","v":618619.80000000005}]
[6,"2.1","ESCAVAÇÃO HORIZONTAL EM SOLO DE 1A CATEGORIA COM TRATOR DE ESTEIRAS",101116,"M3",7350,{"$f":"VLOOKUP(A16,CPU!$A$1:$N$4885,9)","v":2.2000000000000002},{"$f":"VLOOKUP(A16,CPU!$A$1:$N$4885,10)","v":2.6727800000000004},{"$f":"ROUND(F16*H16,2)","v":19644.93}]
[7,"2.2","CARGA, MANOBRA E DESCARGA DE SOLOS E MATERIAIS GRANULARES EM CAMINHÃO BASCULANTE - CARGA COM PÁ CARREGADEIRA E DESCARGA LIVRE",100976,"M3",7350,{"$f":"VLOOKUP(A17,CPU!$A$1:$N$4885,9)","v":8.7100000000000009},{"$f":"VLOOKUP(A17,CPU!$A$1:$N$4885,10)","v":10.581779000000003},{"$f":"ROUND(F17*H17,2)","v":77776.08}]
[8,"2.3","REGULARIZAÇÃO E COMPACTAÇÃO DE SUBLEITO",100576,"M2",9200,{"$f":"VLOOKUP(A18,CPU!$A$1:$N$4885,9)","v":2.57},{"$f":"VLOOKUP(A18,CPU!$A$1:$N$4885,10)","v":3.122293},{"$f":"ROUND(F18*H18,2)","v":28725.1}]
[8.5,"2.4","EXECUÇÃO E COMPACTAÇÃO DE BASE E OU SUB BASE PARA PAVIMENTAÇÃO DE SOLO DE COMPORTAMENTO LATERÍTICO - EXCLUSIVE SOLO, ESCAVAÇÃO, CARGA E TRANSPORTE",96388,"M3",1850,{"$f":"VLOOKUP(A19,CPU!$A$1:$N$4885,9)","v":12.469999999999999},{"$f":"VLOOKUP(A19,CPU!$A$1:$N$4885,10)","v":15.149803},{"$f":"ROUND(F19*H19,2)","v":28027.14}]
[9,"2.5","EXECUÇÃO DE PAVIMENTO EM PISO INTERTRAVADO, COM BLOCO SEXTAVADO DE CONCRETO DE 25 X 25 CM, ESPESSURA 8 CM",92394,"M2",6200,{"$f":"VLOOKUP(A20,CPU!$A$1:$N$4885,9)","v":61.66},{"$f":"VLOOKUP(A20,CPU!$A$1:$N$4885,10)","v":74.910734000000005},{"$f":"ROUND(F20*H20,2)","v":464446.55}]
["C",3,"TRANSPORTE DE MATERIAIS",{"$nulls":5},{"$f":"SUM(I22:I23)","v":165785.26}]
[10,"3.1","TRANSPORTE COM CAMINHÃO BASCULANTE, EM VIA URBANA PAVIMENTADA",95427,"M3XKM",49999.998100000004,{"$f":"VLOOKUP(A22,CPU!$A$1:$N$4885,9)","v":0.73},{"$f":"VLOOKUP(A22,CPU!$A$1:$N$4885,10)","v":0.88687700000000003},{"$f":"ROUND(F22*H22,2)","v":44343.85}]
[11,"3.2","TRANSPORTE COM CAMINHÃO CARROCERIA, EM VIA URBANA PAVIMENTADA",100948,"TXKM",119000.00369504001,{"$f":"VLOOKUP(A23,CPU!$A$1:$N$4885,9)","v":0.84},{"$f":"VLOOKUP(A23,CPU!$A$1:$N$4885,10)","v":1.020516},{"$f":"ROUND(F23*H23,2)","v":121441.41}]
["D",4,"DRENAGEM E OBRAS COMPLEMENTARES",{"$nulls":5},{"$f":"SUM(I25:I46)","v":1033653.1800000003}]
[12,"4.1","EXECUÇÃO DE PASSEIO (CALÇADA) OU PISO DE CONCRETO COM CONCRETO MOLDADO IN LOCO, FEITO EM OBRA, ACABAMENTO CONVENCIONAL, NÃO ARMADO.",94990,"M3",110,{"$f":"VLOOKUP(A25,CPU!$A$1:$N$4885,9)","v":773.45},{"$f":"VLOOKUP(A25,CPU!$A$1:$N$4885,10)","v":939.6644050000001},{"$f":"ROUND(F25*H25,2)","v":103363.08}]
[13,"4.2","GUIA (MEIO-FIO) E SARJETA CONJUGADOS DE CONCRETO, MOLDADA  IN LOCO  EM TRECHO RETO COM EXTRUSORA, 45 CM BASE (15 CM BASE DA GUIA + SARJETA (30 X 0,05))X 22 CM ALTURA",94267,"M",2300,{"$f":"VLOOKUP(A26,CPU!$A$1:$N$4885,9)","v":47.749999999999993},{"$f":"VLOOKUP(A26,CPU!$A$1:$N$4885,10)","v":58.011474999999997},{"$f":"ROUND(F26*H26,2)","v":133426.39000000001}]
[14,"4.3","GUIA (MEIO-FIO) CONCRETO, MOLDADA IN LOCO EM TRECHO RETO COM EXTRUSORA, 13 CM BASE X 22 CM ALTURA - PARA TRAVAMENTO",94263,"M",120,{"$f":"VLOOKUP(A27,CPU!$A$1:$N$4885,9)","v":35.590000000000003},{"$f":"VLOOKUP(A27,CPU!$A$1:$N$4885,10)","v":43.238291000000011},{"$f":"ROUND(F27*H27,2)","v":5188.59}]
[15,"4.4","LOCAÇÃO DE REDE DE ÁGUA OU ESGOTO",99063,"M",720,{"$f":"VLOOKUP(A28,CPU!$A$1:$N$4885,9)","v":5.92},{"$f":"VLOOKUP(A28,CPU!$A$1:$N$4885,10)","v":7.1922080000000008},{"$f":"ROUND(F28*H28,2)","v":5178.3900000000003}]
[16,"4.5","ESCAVAÇÃO MECANIZADA DE VALA COM PROFUNDIDADE ATÉ 1,5 M, EM SOLO DE 1A CATEGORIA",90105,"M3",1300,{"$f":"VLOOKUP(A29,CPU!$A$1:$N$4885,9)","v":9.34},{"$f":"VLOOKUP(A29,CPU!$A$1:$N$4885,10)","v":11.347166000000001},14751.32]
[17,"4.6","PREPARO DE FUNDO DE VALA COM LARGURA MENOR QUE 1,5 M (ACERTO DO SOLO NATURAL), INCLUSIVE LASTRO DE CONCRETO MAGRO PARA BERÇO","101616+\n95240","M2",900,{"$f":"VLOOKUP(A30,CPU!$A$1:$N$4885,9)","v":59.33},{"$f":"VLOOKUP(A30,CPU!$A$1:$N$4885,10)","v":72.080016999999998},64872.02]
[18,"4.7","ESCORAMENTO DE VALA, TIPO PONTALETEAMENTO",101570,"M2",2200,{"$f":"VLOOKUP(A31,CPU!$A$1:$N$4885,9)","v":26.27},{"$f":"VLOOKUP(A31,CPU!$A$1:$N$4885,10)","v":31.915423000000001},70213.929999999993]
[19,"4.8","TUBO DE CONCRETO PARA REDES COLETORAS DE ÁGUAS PLUVIAIS, DIÂMETRO DE 400 MM, JUNTA RÍGIDA - FORNECIMENTO E ASSENTAMENTO",92210,"M",160,{"$f":"VLOOKUP(A32,CPU!$A$1:$N$4885,9)","v":186.66999999999996},{"$f":"VLOOKUP(A32,CPU!$A$1:$N$4885,10)","v":226.78538299999997},36285.660000000003]
[20,"4.9","TUBO DE CONCRETO PARA REDES COLETORAS DE ÁGUAS PLUVIAIS, DIÂMETRO DE 600 MM, JUNTA RÍGIDA - FORNECIMENTO E ASSENTAMENTO",92212,"M",450,{"$f":"VLOOKUP(A33,CPU!$A$1:$N$4885,9)","v":337.5100000000001},{"$f":"VLOOKUP(A33,CPU!$A$1:$N$4885,10)","v":410.04089900000014},{"$f":"ROUND(F33*H33,2)","v":184518.39999999999}]
[21,"4.10","TUBO DE CONCRETO PARA REDES COLETORAS DE ÁGUAS PLUVIAIS, DIÂMETRO DE 800 MM, JUNTA RÍGIDA - FORNECIMENTO E ASSENTAMENTO",92214,"M",110,{"$f":"VLOOKUP(A34,CPU!$A$1:$N$4885,9)","v":348.86},{"$f":"VLOOKUP(A34,CPU!$A$1:$N$4885,10)","v":423.83001400000006},46621.3]
[22,"4.11","CAIXA PARA BOCA DE LOBO COMBINADA COM GRELHA RETANGULAR, EM ALVENARIA COM BLOCOS DE CONCRETO, DIMENSÕES INTERNAS: 1,3X1X1,2 M.",97961,"UNID.",30,{"$f":"VLOOKUP(A35,CPU!$A$1:$N$4885,9)","v":2438.16},{"$f":"VLOOKUP(A35,CPU!$A$1:$N$4885,10)","v":2962.1205840000002},{"$f":"ROUND(F35*H35,2)","v":88863.62}]
[23,"4.12","CAIXA PARA BOCA DE LOBO DUPLA COMBINADA COM GRELHA RETANGULAR, EM ALVENARIA COM BLOCOS DE CONCRETO, DIMENSÕES INTERNAS: 1,3X2,2X1,2 M",97973,"UNID.",2,{"$f":"VLOOKUP(A36,CPU!$A$1:$N$4885,9)","v":4583.45},{"$f":"VLOOKUP(A36,CPU!$A$1:$N$4885,10)","v":5568.4334049999998},{"$f":"ROUND(F36*H36,2)","v":11136.87}]
[24,"4.13","POÇO DE VISITA RETANGULAR PARA DRENAGEM, EM ALVENARIA COM BLOCOS DE CONCRETO, DIMENSÕES INTERNAS = 1X1 M, PROFUNDIDADE = 1,40 M, INCLUSIVE TAMPÃO EM FERRO FUNDIDO D = 600MM",99252,"UNID.",16,{"$f":"VLOOKUP(A37,CPU!$A$1:$N$4885,9)","v":2811.2100000000005},{"$f":"VLOOKUP(A37,CPU!$A$1:$N$4885,10)","v":3415.3390290000007},{"$f":"ROUND(F37*H37,2)","v":54645.42}]
[25,"4.14","BACIA DE DISSIPAÇÃO, TIPO BACIA EM PEDRA DE MÃO FIXADA COM CONCRETO (DEB 01, 02), COM PREPARO MANUAL, FCK = 20 MPA, LANÇADO MANUALMENTE, INCLUINDO MATERIAIS E FÔRMAS",103930,"M3",7.9999999999999991,{"$f":"VLOOKUP(A38,CPU!$A$1:$N$4885,9)","v":781.01},{"$f":"VLOOKUP(A38,CPU!$A$1:$N$4885,10)","v":948.84904900000004},{"$f":"ROUND(F38*H38,2)","v":7590.79}]
[26,"4.15","ESCADA HIDRÁULICA, LARGURA ATÉ 1M, TIPO DESCIDA DÁGUA DE CORTE OU ATERRO EM DEGRAUS (DCD 02, 04 E DAD 02), EM CONCRETO USINADO, FCK = 20 MPA, INCLUINDO ARMAÇÃO, MATERIAIS E FÔRMAS",103925,"M3",25,{"$f":"VLOOKUP(A39,CPU!$A$1:$N$4885,9)","v":1523.0700000000002},{"$f":"VLOOKUP(A39,CPU!$A$1:$N$4885,10)","v":1850.3777430000002},46259.44]
[27,"4.16","REATERRO MANUAL DE VALAS COM COMPACTAÇÃO MECANIZADA",93382,"M3",1300,{"$f":"VLOOKUP(A40,CPU!$A$1:$N$4885,9)","v":25.169999999999998},{"$f":"VLOOKUP(A40,CPU!$A$1:$N$4885,10)","v":30.579032999999999},{"$f":"ROUND(F40*H40,2)","v":39752.74}]
{"$rows_left_out":8}
{"sheet":"CPU","index":1,"n_rows":620,"n_cols":13,"rows_kept":620,"cut":false,"hidden":false,"merged":[[547,1,547,6],[548,1,548,6],[528,0,549,0],[528,1,528,3],[528,4,528,7],[528,10,528,11],[529,2,529,5],[530,2,530,3],[531,1,531,7],[545,1,545,3],[545,5,545,6],[546,1,546,6],[509,0,527,0],[509,1,509,3],[509,4,509,7],[510,2,510,5],[511,2,511,3],[512,1,512,7],[523,1,523,3],[523,5,523,6],[524,1,524,6],[525,1,525,6],[526,1,526,6],[494,0,508,0],[494,1,494,3],[494,4,494,7],[495,2,495,5],[496,2,496,3],[497,1,497,7],[504,1,504,3],[504,5,504,6],[505,1,505,6],[506,1,506,6],[507,1,507,6],[479,0,493,0],[479,1,479,3],[479,4,479,7],[480,2,480,5],[481,2,481,3],[482,1,482,7],[489,1,489,3],[489,5,489,6],[490,1,490,6],[491,1,491,6],[492,1,492,6],[465,0,478,0],[465,1,465,3],[465,4,465,7],[466,2,466,5],[467,2,467,3],[468,1,468,7],[474,1,474,3],[474,5,474,6],[475,1,475,6],[476,1,476,6],[477,1,477,6],[431,0,464,0],[431,1,431,3],[431,4,431,7],[432,2,432,5],[433,2,433,3],[434,1,434,7],[460,1,460,3],[460,5,460,6],[461,1,461,6],[462,1,462,6],[463,1,463,6],[397,0,430,0],[397,1,397,3],[397,4,397,7],[398,2,398,5],[399,2,399,3],[400,1,400,7],[426,1,426,3],[426,5,426,6],[427,1,427,6],[428,1,428,6],[429,1,429,6],[364,0,396,0],[364,1,364,3],[364,4,364,7],[365,2,365,5],[366,2,366,3],[367,1,367,7],[392,1,392,3],[392,5,392,6],[393,1,393,6],[394,1,394,6],[395,1,395,6],[347,0,363,0],[347,1,347,3],[347,4,347,7],[348,2,348,5],[349,2,349,3],[350,1,350,7],[359,1,359,3],[359,5,359,6],[360,1,360,6],[361,1,361,6],[362,1,362,6],[330,0,346,0],[330,1,330,3],[330,4,330,7],[331,2,331,5],[332,2,332,3],[333,1,333,7],[342,1,342,3],[342,5,342,6],[343,1,343,6],[344,1,344,6],[345,1,345,6],[313,0,329,0],[313,1,313,3],[313,4,313,7],[314,2,314,5],[315,2,315,3],[316,1,316,7],[325,1,325,3],[325,5,325,6],[326,1,326,6],[327,1,327,6],[328,1,328,6],[297,0,312,0],[297,1,297,3],[297,4,297,7],[298,2,298,5],[299,2,299,3],[300,1,300,7],[308,1,308,3],[308,5,308,6],[309,1,309,6],[310,1,310,6],[311,1,311,6],[281,0,296,0],[281,1,281,3],[281,4,281,7],[282,2,282,5],[283,2,283,3],[284,1,284,7],[292,1,292,3],[292,5,292,6],[293,1,293,6],[294,1,294,6],[295,1,295,6],[267,0,280,0],[267,1,267,3],[267,4,267,7],[268,2,268,5],[269,2,269,3],[270,1,270,7],[276,1,276,3],[276,5,276,6],[277,1,277,6],[278,1,278,6],[279,1,279,6],[248,0,266,0],[248,1,248,3],[248,4,248,7],[249,2,249,5],[250,2,250,3],[251,1,251,7],[262,1,262,3],[262,5,262,6],[263,1,263,6],[264,1,264,6],[265,1,265,6],[229,0,247,0],[229,1,229,3],[229,4,229,7],[230,2,230,5],[231,2,231,3],[232,1,232,7],[243,1,243,3],[243,5,243,6],[244,1,244,6],[245,1,245,6],[246,1,246,6],[126,0,142,0],[602,0,620,0],[602,1,602,3],[602,4,602,7],[603,2,603,5],[604,2,604,3],[605,1,605,7],[616,1,616,3],[616,5,616,6],[617,1,617,6],[618,1,618,6],[619,1,619,6],[584,0,601,0],[584,1,584,3],[584,4,584,7],[585,2,585,5],[586,2,586,3],[587,1,587,7],[597,1,597,3],[597,5,597,6],[598,1,598,6],[599,1,599,6],[600,1,600,6],[178,0,190,0],[178,1,178,3],[178,4,178,7],[178,10,178,11],[179,2,179,5],[180,2,180,3],[181,1,181,7],[186,1,186,3],[186,5,186,6],[187,1,187,6],[188,1,188,6],[189,1,189,6],[92,1,92,6],[93,1,93,6],[95,0,107,0],[95,1,95,3],[95,4,95,7],[96,2,96,5],[97,2,97,3],[98,1,98,7],[104,1,104,3],[104,5,104,6],[105,1,105,6],[106,1,106,6],[121,1,121,3],[121,5,121,6],[122,1,122,6],[123,1,123,6],[124,1,124,6],[109,1,109,3],[109,4,109,7],[109,0,124,0],[167,2,167,3],[168,1,168,7],[191,10,191,11],[192,2,192,5],[193,2,193,3],[194,1,194,7],[205,1,205,3],[205,5,205,6],[206,1,206,6],[207,1,207,6],[208,1,208,6],[0,0,14,0],[15,0,33,0],[34,0,47,0],[48,0,65,0],[66,0,81,0],[146,0,164,0],[173,1,173,3],[162,1,162,6],[163,1,163,6],[165,1,165,3],[165,4,165,7],[146,1,146,3],[146,4,146,7],[84,2,84,3],[85,1,85,7],[90,1,90,3],[0,1,0,3],[0,4,0,7],[165,0,177,0],[45,1,45,6],[46,1,46,6],[68,2,68,3],[107,1,107,6],[82,0,93,0],[165,10,165,11],[166,2,166,5],[126,1,126,3],[126,4,126,7],[126,10,126,11],[127,2,127,5],[128,2,128,3],[129,1,129,7],[141,1,141,3],[141,5,141,6],[142,1,142,6],[143,1,143,6],[144,1,144,6],[0,10,0,11],[1,2,1,5],[2,2,2,3],[3,1,3,7],[10,1,10,3],[10,5,10,6],[11,1,11,6],[12,1,12,6],[13,1,13,6],[15,1,15,3],[15,4,15,7],[15,10,15,11],[16,2,16,5],[17,2,17,3],[18,1,18,7],[29,1,29,3],[29,5,29,6],[61,5,61,6],[34,10,34,11],[35,2,35,5],[36,2,36,3],[37,1,37,7],[43,1,43,3],[30,1,30,6],[31,1,31,6],[32,1,32,6],[34,1,34,3],[34,4,34,7],[82,10,82,11],[83,2,83,5],[62,1,62,6],[63,1,63,6],[64,1,64,6],[66,1,66,3],[66,4,66,7],[66,10,66,11],[67,2,67,5],[173,5,173,6],[174,1,174,6],[175,1,175,6],[176,1,176,6],[48,10,48,11],[49,2,49,5],[50,2,50,3],[51,1,51,7],[61,1,61,3],[69,1,69,7],[77,1,77,3],[146,10,146,11],[147,2,147,5],[148,2,148,3],[149,1,149,7],[160,1,160,3],[160,5,160,6],[161,1,161,6],[109,10,109,11],[110,2,110,5],[111,2,111,3],[112,1,112,7],[48,1,48,3],[48,4,48,7],[90,5,90,6],[91,1,91,6],[77,5,77,6],[78,1,78,6],[79,1,79,6],[80,1,80,6],[82,1,82,3],[82,4,82,7],[43,5,43,6],[44,1,44,6],[210,0,228,0],[191,1,191,3],[191,4,191,7],[191,0,209,0],[210,1,210,3],[210,4,210,7],[211,2,211,5],[212,2,212,3],[213,1,213,7],[224,1,224,3],[224,5,224,6],[225,1,225,6],[226,1,226,6],[227,1,227,6],[550,0,564,0],[550,1,550,3],[550,4,550,7],[551,2,551,5],[552,2,552,3],[553,1,553,7],[560,1,560,3],[560,5,560,6],[561,1,561,6],[562,1,562,6],[563,1,563,6],[582,1,582,6],[565,0,582,0],[565,1,565,3],[565,4,565,7],[566,2,566,5],[567,2,567,3],[568,1,568,7],[579,1,579,3],[579,5,579,6],[580,1,580,6],[581,1,581,6]]}
[1,"CODEVASF",null,null," COMPOSIÇÃO DE PREÇO UNITÁRIO",null,null,null,{"$f":"H12","v":14753.36},{"$f":"H14","v":17923.857064000003},"BDI CALCULADO:",null,{"$f":"ORÇAMENTO!I6","v":0.21489999999999998}]
[null,"OBRA:  ",{"$f":"ORÇAMENTO!C5","v":"PAVIMENTAÇÃO EM BLOQUETE SEXTAVADOS - RUA BOM JARDIM (BAIRRO SANTO ANTÔNIO) - SERRO/MG (ITEM 2)"},null,null,null,"DATA: ",{"$f":"ORÇAMENTO!C6","v":"OUTUBRO/2023"}]
[null,"SERVIÇO:  ",{"$f":"VLOOKUP(A1,ORÇAMENTO!A10:I26,3)","v":"MOBILIZAÇÃO E DESMOBILIZAÇÃO"},null,"Referência:",{"$f":"VLOOKUP(A1,ORÇAMENTO!A10:I26,4)","v":"CPU.1"},"UNIDADE: ",{"$f":"VLOOKUP(A1,ORÇAMENTO!A10:I26,5)","v":"GL"}]
[]
[null,"TIPO ITEM","CODIGO ITEM","DESCRIÇÃO ITEM","UNIDADE ITEM","COEFICIENTE","PRECO UNITARIO","CUSTO TOTAL"]
[null,"COMPOSICAO",5824,"CAMINHÃO TOCO, PBT 16.000 KG, CARGA ÚTIL MÁX. 10.685 KG, DIST. ENTRE EIXOS 4,8 M, POTÊNCIA 189 CV, INCLUSIVE CARROCERIA FIXA ABERTA DE MADEIRA P/ TRANSPORTE GERAL DE CARGA SECA ","CHP",16,202.74,{"$f":"ROUNDDOWN(F6*G6,2)","v":3243.84},{"$nulls":4},"."]
[null,"COMPOSICAO",5826,"CAMINHÃO TOCO, PBT 16.000 KG, CARGA ÚTIL MÁX. 10.685 KG, DIST. ENTRE EIXOS 4,8 M, POTÊNCIA 189 CV, INCLUSIVE CARROCERIA FIXA ABERTA DE MADEIRA P/ TRANSPORTE GERAL DE CARGA SECA ","CHI",16,60.95,{"$f":"ROUNDDOWN(F7*G7,2)","v":975.2}]
[null,"COMPOSICAO",5914640,"TRANSPORTE COM CAVALO MECÂNICO COM SEMIRREBOQUE COM CAPACIDADE DE 30 T - RODOVIA PAVIMENTADA","T.KM",4354,0.57999999999999996,{"$f":"ROUNDDOWN(F8*G8,2)","v":2525.3200000000002}]
[null,"COMPOSIÇÃO",88316,"SERVENTE COM ENCARGOS COMPLEMENTARES","H",32,19.760000000000002,{"$f":"ROUNDDOWN(F9*G9,2)","v":632.32000000000005}]
[{"$nulls":7},{"$f":"ROUNDDOWN(F10*G10,2)","v":0}]
[null,"PRODUÇÃO DA EQUIPE",null,null,0.5,"CUSTO ",null,{"$f":"SUM(H6:H10)","v":7376.68}]
[null,"TOTAL",{"$nulls":5},{"$f":"H11/E11","v":14753.36},"OK"]
[null,"BDI                %",{"$nulls":5},{"$f":"1+$M$1","v":1.2149000000000001}]
[null,"TOTAL DO SERVIÇO - R$",{"$nulls":5},{"$f":"H12*H13","v":17923.857064000003}]
[]
[{"$f":"A1+1","v":2},"CODEVASF",null,null," COMPOSIÇÃO DE PREÇO UNITÁRIO",null,null,null,{"$f":"H31","v":96005},{"$f":"H33","v":116636.47450000001}]
[null,"OBRA:  ",{"$f":"$C$2","v":"PAVIMENTAÇÃO EM BLOQUETE SEXTAVADOS - RUA BOM JARDIM (BAIRRO SANTO ANTÔNIO) - SERRO/MG (ITEM 2)"},null,null,null,"DATA: ",{"$f":"$H$2","v":"OUTUBRO/2023"}]
[null,"SERVIÇO:  ",{"$f":"VLOOKUP(A16,ORÇAMENTO!$A$10:$I$26,3)","v":"ADMINISTRAÇÃO LOCAL"},null,"SINAPI","CPU","UNIDADE: ",{"$f":"VLOOKUP(A16,ORÇAMENTO!$A$10:$I$26,5)","v":"GL"}]
[]
[null,"TIPO ITEM","CODIGO ITEM","DESCRIÇÃO ITEM","UNIDADE ITEM","COEFICIENTE","PRECO UNITARIO","CUSTO TOTAL"]
[null,"INSUMO",14250,"ENERGIA ELÉTRICA","kwh",50,0.94,{"$f":"ROUNDDOWN(F21*G21,2)","v":47}]
[null,"INSUMO",44480,"TARIFA FORNECIMENTO DE ÁGUA/ESGOTO ","M3",5,17.78,{"$f":"ROUNDDOWN(F22*G22,2)","v":88.9}]
[null,"COTAÇÃO","MERC.","TELEFONE (PLANO CONTROLE)","UNID",2,59.9,119.8]
[null,"COMPOSICAO",90777,"Engenheiro Civil Júnior com encargos complementares","H",55,114.12,6276.6]
[null,"COMPOSICAO",90776,"Encarregado Geral com encargos complementares","H",110,57.73,{"$f":"ROUNDDOWN(F25*G25,2)","v":6350.3}]
[null,"COMPOSICAO",88321,"Tecnico de Laboratório com encargos complementares","H",55,45.45,{"$f":"ROUNDDOWN(F26*G26,2)","v":2499.75}]
[null,"COMPOSICAO",100309,"Tecnico em Segurança do Trabalho com encargos complementares","H",55,45.71,{"$f":"ROUNDDOWN(F27*G27,2)","v":2514.0500000000002}]
[null,"COMPOSICAO",90772,"Auxiliar de escritório com encargos complementares","H",55,23.72,1304.5999999999999]
[{"$nulls":7},0]
[null,"PRODUÇÃO DA EQUIPE",null,null,0.2,"CUSTO ",null,{"$f":"SUM(H21:H29)","v":19201}]
[null,"TOTAL",{"$nulls":5},{"$f":"H30/E30","v":96005},"OK"]
[null,"BDI                %",{"$nulls":5},{"$f":"1+$M$1","v":1.2149000000000001}]
[null,"TOTAL DO SERVIÇO - R$",{"$nulls":5},{"$f":"H31*H32","v":116636.47450000001}]
[]
[{"$f":"A16+1","v":3},"CODEVASF",null,null," COMPOSIÇÃO DE PREÇO UNITÁRIO",null,null,null,{"$f":"H45","v":11337.75},{"$f":"H47","v":13774.232475000001}]
[null,"OBRA:  ",{"$f":"$C$2","v":"PAVIMENTAÇÃO EM BLOQUETE SEXTAVADOS - RUA BOM JARDIM (BAIRRO SANTO ANTÔNIO) - SERRO/MG (ITEM 2)"},null,null,null,"DATA: ",{"$f":"$H$2","v":"OUTUBRO/2023"}]
[null,"SERVIÇO:  ",{"$f":"VLOOKUP(A35,ORÇAMENTO!$A$10:$I$26,3)","v":"CANTEIRO DE OBRAS"},null,"SINAPI",{"$f":"VLOOKUP(A35,ORÇAMENTO!$A$10:$I$26,4)","v":"CPU.3"},"UNIDADE: ",{"$f":"VLOOKUP(A35,ORÇAMENTO!$A$10:$I$26,5)","v":"GL"}]
[]
[null,"TIPO ITEM","CODIGO ITEM","DESCRIÇÃO ITEM","UNIDADE ITEM","COEFICIENTE","PRECO UNITARIO","CUSTO TOTAL"]
[null,"COTAÇÃO",10775,"ALUGUEL DE IMÓVEL OU CONTEINER QUE ATENDA AOS REQUISITOS MÍNIMOS PARA INSTALAÇÃO DO CANTEIRO DE OBRAS ","MÊS",5,975,{"$f":"ROUNDDOWN(F40*G40,2)","v":4875}]
{"$rows_left_out":581}
{"sheet":"BDI SERV","index":2,"n_rows":36,"n_cols":5,"rows_kept":36,"cut":false,"hidden":false,"merged":[[7,7,17,12],[35,0,35,5],[3,1,4,1],[3,2,4,2],[0,1,2,4],[31,0,33,5],[27,0,27,5],[29,1,29,2],[30,1,30,2]]}
[null,"DETALHAMENTO DO BDI - SERVIÇOS"]
[]
[]
[null,"Item","Descrição dos Serviços","%","%"]
[null,null,null,"PV","CD"]
[]
[null,1,"ADMINISTRAÇÃO CENTRAL"," ",4.01]
[null,"1.1","ESCRITÓRIO CENTRAL"," "," "]
[null,"1.2","VIAGENS"," "," "]
[null,"1.3","OUTROS"," "," "]
[null," "," "," "," "]
[null,2,"IMPOSTOS E TAXAS",{"$f":"SUM(D13:D15)","v":5.65},{"$f":"SUM(E13:E15)","v":7.0600000000000005}]
[null,"2.1","ISS (*)",{"$f":"4*0.5","v":2},{"$f":"ROUND(D13*1.2515,2)","v":2.5}]
[null,"2.2","PIS",0.65,{"$f":"ROUND(D14*1.2515,2)","v":0.81}]
[null,"2.3","Cofins",3,{"$f":"ROUND(D15*1.2515,2)","v":3.75}]
[]
[null,3,"TAXA DE RISCO"," ",{"$f":"SUM(E18:E21)","v":0.96}]
[null,"3.1","SEGURO",null,0.2]
[null,"3.2","RISCO",null,0.56000000000000005]
[null,"3.3","GARANTIA",null,0.2]
[]
[null,4,"DESPESAS FINANCEIRAS"," ",1.1100000000000001]
[]
[null,5,"LUCRO",null,8]
[]
[null," ","BDI - CALCULADO"," ",{"$f":"ROUND((((1+(E7+E17)/100)*(1+E22/100)*(1+E24/100)/(1-D12/100)-1)*100),2)","v":21.49}]
[]
["BDI = ((1+((AC+S+R+G)/100))x(1+DF/100)x(1+L/100)/(1-I/100)-1)*100"]
[]
[null,"BDI (CALCULADO):",null,{"$f":"ROUND((((1+((E7+E17)/100))*(1+E22/100)*(1+E24/100))/(1-D12/100)-1)*100,2)","v":21.49},"%"]
[null," "]
["(*) ISS CONFORME LEI COMPLEMENTAR Nº 63/2005 - ART. 30\n(QUANT. ESTIMADA DE MATERIAIS = 50%)"]
[]
[]
[" "]
["BDI EM CONFORMIDADE COM OS ACÓRDÃOS Nº 2369/2011 e ACÓRDÃO Nº 2.622/2013 - TCU - PLENÁRIO"]

{"sheet":"CRONOGRAMA","index":3,"n_rows":17,"n_cols":11,"rows_kept":17,"cut":false,"hidden":false,"merged":[[13,1,14,2],[16,1,20,10],[7,2,8,2],[9,2,10,2],[11,2,12,2],[7,1,8,1],[9,1,10,1],[11,1,12,1],[7,0,8,0],[9,0,10,0],[11,0,12,0],[0,1,0,10],[1,6,1,10],[2,6,2,10],[3,1,3,6],[5,0,6,0],[5,2,6,2],[1,1,2,1],[5,1,6,1],[1,2,2,4]]}
[null,"CRONOGRAMA FÍSICO-FINANCEIRO"]
[null,"OBRA: ",{"$f":"ORÇAMENTO!C5","v":"PAVIMENTAÇÃO EM BLOQUETE SEXTAVADOS - RUA BOM JARDIM (BAIRRO SANTO ANTÔNIO) - SERRO/MG (ITEM 2)"},null,null,"VALOR:",{"$f":"ORÇAMENTO!I47","v":1971942.7700000005}]
[{"$nulls":5},"PRAZO: ","150 DIAS "]
[]
[null,"ITEM","ETAPAS/DESCRIÇAO","FISICO/  FINANCEIRO","TOTAL    ETAPAS","MÊS 1","MÊS 2","MÊS 3","MÊS 4","MÊS 5","TOTAL"]
["A",{"$f":"VLOOKUP(A6,ORÇAMENTO!$A$9:$I$47,2)","v":1},{"$f":"VLOOKUP(A6,ORÇAMENTO!$A$9:$I$47,3)","v":"SERVIÇOS PRELIMINARES "},"FISICO ",{"$f":"ROUND(E7/$G$2,4)","v":7.8E-2},0.2,0.2,0.2,0.2,0.2,{"$f":"SUM(F6:J6)","v":1}]
[null,null,null,"FINANCEIRO",{"$f":"ORÇAMENTO!I9","v":153884.53000000003},{"$f":"ROUND($E$7*F6,2)","v":30776.91},{"$f":"ROUND($E$7*G6,2)","v":30776.91},{"$f":"ROUND($E$7*H6,2)","v":30776.91},{"$f":"ROUND($E$7*I6,2)","v":30776.91},30776.91,{"$f":"SUM(F7:J7)","v":153884.54999999999}]
["B",{"$f":"VLOOKUP(A8,ORÇAMENTO!$A$9:$I$47,2)","v":2},{"$f":"VLOOKUP(A8,ORÇAMENTO!$A$9:$I$47,3)","v":"PAVIMENTAÇÃO"},"FISICO ",{"$f":"ROUND(E9/$G$2,4)","v":0.31369999999999998},0.2,0.2,0.2,0.2,0.2,{"$f":"SUM(F8:J8)","v":1}]
[null,null,null,"FINANCEIRO",{"$f":"ORÇAMENTO!I15","v":618619.80000000005},{"$f":"ROUND($E$9*F8,2)","v":123723.96},{"$f":"ROUND($E$9*G8,2)","v":123723.96},{"$f":"ROUND($E$9*H8,2)","v":123723.96},{"$f":"ROUND($E$9*I8,2)","v":123723.96},123723.96,{"$f":"SUM(F9:J9)","v":618619.80000000005}]
["C",{"$f":"VLOOKUP(A10,ORÇAMENTO!$A$9:$I$47,2)","v":3},{"$f":"VLOOKUP(A10,ORÇAMENTO!$A$9:$I$47,3)","v":"TRANSPORTE DE MATERIAIS"},"FISICO ",{"$f":"ROUND(E11/$G$2,4)","v":8.4099999999999994E-2},0.2,0.2,0.2,0.2,0.2,{"$f":"SUM(F10:J10)","v":1}]
[null,null,null,"FINANCEIRO",{"$f":"ORÇAMENTO!I21","v":165785.26},{"$f":"ROUND($E$11*F10,2)","v":33157.050000000003},{"$f":"ROUND($E$11*G10,2)","v":33157.050000000003},{"$f":"ROUND($E$11*H10,2)","v":33157.050000000003},{"$f":"ROUND($E$11*I10,2)","v":33157.050000000003},33157.050000000003,{"$f":"SUM(F11:J11)","v":165785.25}]
["D",{"$f":"VLOOKUP(A12,ORÇAMENTO!$A$9:$I$47,2)","v":4},{"$f":"VLOOKUP(A12,ORÇAMENTO!$A$9:$I$47,3)","v":"DRENAGEM E OBRAS COMPLEMENTARES"},"FISICO ",{"$f":"ROUND(E13/$G$2,4)","v":0.5242},0.2,0.2,0.2,0.2,0.2,{"$f":"SUM(F12:J12)","v":1}]
[null,null,null,"FINANCEIRO",{"$f":"ORÇAMENTO!I24","v":1033653.1800000003},{"$f":"ROUND($E$13*F12,2)","v":206730.64},{"$f":"ROUND($E$13*G12,2)","v":206730.64},{"$f":"ROUND($E$13*H12,2)","v":206730.64},{"$f":"ROUND($E$13*I12,2)","v":206730.64},206730.64,{"$f":"SUM(F13:J13)","v":1033653.2000000001}]
[null,"TOTAL",null,"FISICO ",{"$f":"SUM(F14:H14)","v":0.60000000912805396},{"$f":"F15/E15","v":0.20000000304268464},{"$f":"G15/$E$15","v":0.20000000304268464},{"$f":"H15/$E$15","v":0.20000000304268464},{"$f":"I15/$E$15","v":0.20000000304268464},0.20000000304268464,{"$f":"SUM(F14:J14)","v":1.0000000152134232}]
[null,null,null,"FINANCEIRO",{"$f":"E11+E9+E7+E13","v":1971942.7700000005},{"$f":"F11+F9+F7+F13","v":394388.56000000006},{"$f":"G11+G9+G7+G13","v":394388.56000000006},{"$f":"H11+H9+H7+H13","v":394388.56000000006},{"$f":"I11+I9+I7+I13","v":394388.56000000006},394388.56000000006,{"$f":"ROUNDUP(SUM(F15:J15),2)-0.03","v":1971942.77}]
[]
[null,"OBSERVAÇÕES:"]