{"text_format":"2","workbook":"xlsx","n_sheets":4,"sheets":["ORÇAMENTO","CPU","BDI SERV","CRONOGRAMA"],"not_rendered":{"charts":0,"images":7,"macros":0,"external_links":0,"defined_names":4,"comments":1,"pivot_tables":0},"unopened":[],"bounds":{"document_bytes":16777216,"sheet_cells":100000,"run_cost":"one","rows_first":2000,"rows_last":500,"rows_between":2000,"halvings":0,"cell_chars":16384,"cell_head_chars":4096},"cells_cut":0,"cells_raw":0,"read":"whole","date_system":"1900"}

{"sheet":"ORÇAMENTO","index":0,"n_rows":47,"n_cols":9,"rows_kept":47,"cut":false,"hidden":false,"merged":[[6,6,6,7],[46,1,46,2],[0,0,7,0],[0,2,0,8],[1,2,1,8],[2,2,2,8],[4,2,4,8],[5,6,5,7]]}
["<---- NUMERAR SERVIÇOS PARA CPU",null,"Ministério do Desenvolvimento Regional"]
[null,null,"Companhia de Desenvolvimento dos Vales do São Francisco e do Parnaíba"]
[null,null,"1ª Superintendência Regional"]
[]
[null,"OBRA: ","PAVIMENTAÇÃO EM BLOQUETE SEXTAVADOS - RUA BOM JARDIM (BAIRRO SANTO ANTÔNIO) - SERRO/MG (ITEM 2)"]
[null,"DATA:","OUTUBRO/2023",null,null,null,"BDI Serviços:",null,{"$f":"'BDI SERV'!D30/100","v":0.21489999999999998}]
[null,"PRAZO DE EXECUÇÃO:    150 DIAS"]
[null,"ITEM","DISCRIMINAÇÃO","REFER.","UNID.","QUANT.","P. UNITÁRIO","P.UNIT.C/ BDI","P. TOTAL"]
["A",1,"SERVIÇOS PRELIMINARES ",{"$nulls":5},{"$f":"SUM(I10:I14)","v":153884.53000000003}]
[1,"1.1","MOBILIZAÇÃO E DESMOBILIZAÇÃO","CPU.1","GL",1,{"$f":"VLOOKUP(A10,CPU!$A$1:$N$4885,9)","v":14753.36},{"$f":"VLOOKUP(A10,CPU!$A$1:$N$4885,10)","v":17923.857064000003},{"$f":"ROUND(F10*H10,2)","v":17923.86}]
[2,"1.2","ADMINISTRAÇÃO LOCAL","CPU.2","GL",1,{"$f":"VLOOKUP(A11,CPU!$A$1:$N$4885,9)","v":96005},{"$f":"VLOOKUP(A11,CPU!$A$1:$N$4885,10)","v":116636.47450000001},{"$f":"ROUND(F11*H11,2)","v":116636.47}]
[3,"1.3","CANTEIRO DE OBRAS","CPU.3","GL",1,{"$f":"VLOOKUP(A12,CPU!$A$1:$N$4885,9)","v":11337.75},{"$f":"VLOOKUP(A12,CPU!$A$1:$N$4885,10)","v":13774.232475000001},{"$f":"ROUND(F12*H12,2)","v":13774.23}]
[4,"1.4","PLACA DE OBRA EM CHAPA DE AÇO GALVANIZADO",103689,"M2",4.5,{"$f":"VLOOKUP(A13,CPU!$A$1:$N$4885,9)","v":340.5},{"$f":"VLOOKUP(A13,CPU!$A$1:$N$4885,10)","v":413.67345},{"$f":"ROUND(F13*H13,2)","v":1861.53}]
[5,"1.5","SERVIÇOS TOPOGRÁFICOS PARA PAVIMENTAÇÃO, INCLUSIVE NOTA DE SERVIÇO, ACOMPANHAMENTO E GREIDE",99064,"M2",9200,{"$f":"VLOOKUP(A14,CPU!$A$1:$N$4885,9)","v":0.32999999999999996},{"$f":"VLOOKUP(A14,CPU!$A$1:$N$4885,10)","v":0.40091699999999997},{"$f":"ROUND(F14*H14,2)","v":3688.44}]
["B",2,"PAVIMENTAÇÃO",{"$nulls":5},{"$f":"SUM(I16:I20)","v":618619.80000000005}]
[6,"2.1","ESCAVAÇÃO HORIZONTAL EM SOLO DE 1A CATEGORIA COM TRATOR DE ESTEIRAS",101116,"M3",7350,{"$f":"VLOOKUP(A16,CPU!$A$1:$N$4885,9)","v":2.2000000000000002},{"$f":"VLOOKUP(A16,CPU!$A$1:$N$4885,10)","v":2.6727800000000004},{"$f":"ROUND(F16*H16,2)","v":19644.93}]
[7,"2.2","CARGA, MANOBRA E DESCARGA DE SOLOS E MATERIAIS GRANULARES EM CAMINHÃO BASCULANTE - CARGA COM PÁ CARREGADEIRA E DESCARGA LIVRE",100976,"M3",7350,{"$f":"VLOOKUP(A17,CPU!$A$1:$N$4885,9)","v":8.7100000000000009},{"$f":"VLOOKUP(A17,CPU!$A$1:$N$4885,10)","v":10.581779000000003},{"$f":"ROUND(F17*H17,2)","v":77776.08}]
[8,"2.3","REGULARIZAÇÃO E COMPACTAÇÃO DE SUBLEITO",100576,"M2",9200,{"$f":"VLOOKUP(A18,CPU!$A$1:$N$4885,9)","v":2.57},{"$f":"VLOOKUP(A18,CPU!$A$1:$N$4885,10)","v":3.122293},{"$f":"ROUND(F18*H18,2)","v":28725.1}]
[8.5,"2.4","EXECUÇÃO E COMPACTAÇÃO DE BASE E OU SUB BASE PARA PAVIMENTAÇÃO DE SOLO DE COMPORTAMENTO LATERÍTICO - EXCLUSIVE SOLO, ESCAVAÇÃO, CARGA E TRANSPORTE",96388,"M3",1850,{"$f":"VLOOKUP(A19,CPU!$A$1:$N$4885,9)","v":12.469999999999999},{"$f":"VLOOKUP(A19,CPU!$A$1:$N$4885,10)","v":15.149803},{"$f":"ROUND(F19*H19,2)","v":28027.14}]
[9,"2.5","EXECUÇÃO DE PAVIMENTO EM PISO INTERTRAVADO, COM BLOCO SEXTAVADO DE CONCRETO DE 25 X 25 CM, ESPESSURA 8 CM",92394,"M2",6200,{"$f":"VLOOKUP(A20,CPU!$A$1:$N$4885,9)","v":61.66},{"$f":"VLOOKUP(A20,CPU!$A$1:$N$4885,10)","v":74.910734000000005},{"$f":"ROUND(F20*H20,2)","v":464446.55}]
["C",3,"TRANSPORTE DE MATERIAIS",{"$nulls":5},{"$f":"SUM(I22:I23)","v":165785.26}]
[10,"3.1","TRANSPORTE COM CAMINHÃO BASCULANTE, EM VIA URBANA PAVIMENTADA",95427,"M3XKM",49999.998100000004,{"$f":"VLOOKUP(A22,CPU!$A$1:$N$4885,9)","v":0.73},{"$f":"VLOOKUP(A22,CPU!$A$1:$N$4885,10)","v":0.88687700000000003},{"$f":"ROUND(F22*H22,2)","v":44343.85}]
[11,"3.2","TRANSPORTE COM CAMINHÃO CARROCERIA, EM VIA URBANA PAVIMENTADA",100948,"TXKM",119000.00369504001,{"$f":"VLOOKUP(A23,CPU!$A$1:$N$4885,9)","v":0.84},{"$f":"VLOOKUP(A23,CPU!$A$1:$N$4885,10)","v":1.020516},{"$f":"ROUND(F23*H23,2)","v":121441.41}]
["D",4,"DRENAGEM E OBRAS COMPLEMENTARES",{"$nulls":5},{"$f":"SUM(I25:I46)","v":1033653.1800000003}]
[12,"4.1","EXECUÇÃO DE PASSEIO (CALÇADA) OU PISO DE CONCRETO COM CONCRETO MOLDADO IN LOCO, FEITO EM OBRA, ACABAMENTO CONVENCIONAL, NÃO ARMADO.",94990,"M3",110,{"$f":"VLOOKUP(A25,CPU!$A$1:$N$4885,9)","v":773.45},{"$f":"VLOOKUP(A25,CPU!$A$1:$N$4885,10)","v":939.6644050000001},{"$f":"ROUND(F25*H25,2)","v":103363.08}]
[13,"4.2","GUIA (MEIO-FIO) E SARJETA CONJUGADOS DE CONCRETO, MOLDADA  IN LOCO  EM TRECHO RETO COM EXTRUSORA, 45 CM BASE (15 CM BASE DA GUIA + SARJETA (30 X 0,05))X 22 CM ALTURA",94267,"M",2300,{"$f":"VLOOKUP(A26,CPU!$A$1:$N$4885,9)","v":47.749999999999993},{"$f":"VLOOKUP(A26,CPU!$A$1:$N$4885,10)","v":58.011474999999997},{"$f":"ROUND(F26*H26,2)","v":133426.39000000001}]
[14,"4.3","GUIA (MEIO-FIO) CONCRETO, MOLDADA IN LOCO EM TRECHO RETO COM EXTRUSORA, 13 CM BASE X 22 CM ALTURA - PARA TRAVAMENTO",94263,"M",120,{"$f":"VLOOKUP(A27,CPU!$A$1:$N$4885,9)","v":35.590000000000003},{"$f":"VLOOKUP(A27,CPU!$A$1:$N$4885,10)","v":43.238291000000011},{"$f":"ROUND(F27*H27,2)","v":5188.59}]
[15,"4.4","LOCAÇÃO DE REDE DE ÁGUA OU ESGOTO",99063,"M",720,{"$f":"VLOOKUP(A28,CPU!$A$1:$N$4885,9)","v":5.92},{"$f":"VLOOKUP(A28,CPU!$A$1:$N$4885,10)","v":7.1922080000000008},{"$f":"ROUND(F28*H28,2)","v":5178.3900000000003}]
[16,"4.5","ESCAVAÇÃO MECANIZADA DE VALA COM PROFUNDIDADE ATÉ 1,5 M, EM SOLO DE 1A CATEGORIA",90105,"M3",1300,{"$f":"VLOOKUP(A29,CPU!$A$1:$N$4885,9)","v":9.34},{"$f":"VLOOKUP(A29,CPU!$A$1:$N$4885,10)","v":11.347166000000001},14751.32]
[17,"4.6","PREPARO DE FUNDO DE VALA COM LARGURA MENOR QUE 1,5 M (ACERTO DO SOLO NATURAL), INCLUSIVE LASTRO DE CONCRETO MAGRO PARA BERÇO","101616+\n95240","M2",900,{"$f":"VLOOKUP(A30,CPU!$A$1:$N$4885,9)","v":59.33},{"$f":"VLOOKUP(A30,CPU!$A$1:$N$4885,10)","v":72.080016999999998},64872.02]
[18,"4.7","ESCORAMENTO DE VALA, TIPO PONTALETEAMENTO",101570,"M2",2200,{"$f":"VLOOKUP(A31,CPU!$A$1:$N$4885,9)","v":26.27},{"$f":"VLOOKUP(A31,CPU!$A$1:$N$4885,10)","v":31.915423000000001},70213.929999999993]
[19,"4.8","TUBO DE CONCRETO PARA REDES COLETORAS DE ÁGUAS PLUVIAIS, DIÂMETRO DE 400 MM, JUNTA RÍGIDA - FORNECIMENTO E ASSENTAMENTO",92210,"M",160,{"$f":"VLOOKUP(A32,CPU!$A$1:$N$4885,9)","v":186.66999999999996},{"$f":"VLOOKUP(A32,CPU!$A$1:$N$4885,10)","v":226.78538299999997},36285.660000000003]
[20,"4.9","TUBO DE CONCRETO PARA REDES COLETORAS DE ÁGUAS PLUVIAIS, DIÂMETRO DE 600 MM, JUNTA RÍGIDA - FORNECIMENTO E ASSENTAMENTO",92212,"M",450,{"$f":"VLOOKUP(A33,CPU!$A$1:$N$4885,9)","v":337.5100000000001},{"$f":"VLOOKUP(A33,CPU!$A$1:$N$4885,10)","v":410.04089900000014},{"$f":"ROUND(F33*H33,2)","v":184518.39999999999}]
[21,"4.10","TUBO DE CONCRETO PARA REDES COLETORAS DE ÁGUAS PLUVIAIS, DIÂMETRO DE 800 MM, JUNTA RÍGIDA - FORNECIMENTO E ASSENTAMENTO",92214,"M",110,{"$f":"VLOOKUP(A34,CPU!$A$1:$N$4885,9)","v":348.86},{"$f":"VLOOKUP(A34,CPU!$A$1:$N$4885,10)","v":423.83001400000006},46621.3]
[22,"4.11","CAIXA PARA BOCA DE LOBO COMBINADA COM GRELHA RETANGULAR, EM ALVENARIA COM BLOCOS DE CONCRETO, DIMENSÕES INTERNAS: 1,3X1X1,2 M.",97961,"UNID.",30,{"$f":"VLOOKUP(A35,CPU!$A$1:$N$4885,9)","v":2438.16},{"$f":"VLOOKUP(A35,CPU!$A$1:$N$4885,10)","v":2962.1205840000002},{"$f":"ROUND(F35*H35,2)","v":88863.62}]
[23,"4.12","CAIXA PARA BOCA DE LOBO DUPLA COMBINADA COM GRELHA RETANGULAR, EM ALVENARIA COM BLOCOS DE CONCRETO, DIMENSÕES INTERNAS: 1,3X2,2X1,2 M",97973,"UNID.",2,{"$f":"VLOOKUP(A36,CPU!$A$1:$N$4885,9)","v":4583.45},{"$f":"VLOOKUP(A36,CPU!$A$1:$N$4885,10)","v":5568.4334049999998},{"$f":"ROUND(F36*H36,2)","v":11136.87}]
[24,"4.13","POÇO DE VISITA RETANGULAR PARA DRENAGEM, EM ALVENARIA COM BLOCOS DE CONCRETO, DIMENSÕES INTERNAS = 1X1 M, PROFUNDIDADE = 1,40 M, INCLUSIVE TAMPÃO EM FERRO FUNDIDO D = 600MM",99252,"UNID.",16,{"$f":"VLOOKUP(A37,CPU!$A$1:$N$4885,9)","v":2811.2100000000005},{"$f":"VLOOKUP(A37,CPU!$A$1:$N$4885,10)","v":3415.3390290000007},{"$f":"ROUND(F37*H37,2)","v":54645.42}]
[25,"4.14","BACIA DE DISSIPAÇÃO, TIPO BACIA EM PEDRA DE MÃO FIXADA COM CONCRETO (DEB 01, 02), COM PREPARO MANUAL, FCK = 20 MPA, LANÇADO MANUALMENTE, INCLUINDO MATERIAIS E FÔRMAS",103930,"M3",7.9999999999999991,{"$f":"VLOOKUP(A38,CPU!$A$1:$N$4885,9)","v":781.01},{"$f":"VLOOKUP(A38,CPU!$A$1:$N$4885,10)","v":948.84904900000004},{"$f":"ROUND(F38*H38,2)","v":7590.79}]
[26,"4.15","ESCADA HIDRÁULICA, LARGURA ATÉ 1M, TIPO DESCIDA DÁGUA DE CORTE OU ATERRO EM DEGRAUS (DCD 02, 04 E DAD 02), EM CONCRETO USINADO, FCK = 20 MPA, INCLUINDO ARMAÇÃO, MATERIAIS E FÔRMAS",103925,"M3",25,{"$f":"VLOOKUP(A39,CPU!$A$1:$N$4885,9)","v":1523.0700000000002},{"$f":"VLOOKUP(A39,CPU!$A$1:$N$4885,10)","v":1850.3777430000002},46259.44]
[27,"4.16","REATERRO MANUAL DE VALAS COM COMPACTAÇÃO MECANIZADA",93382,"M3",1300,{"$f":"VLOOKUP(A40,CPU!$A$1:$N$4885,9)","v":25.169999999999998},{"$f":"VLOOKUP(A40,CPU!$A$1:$N$4885,10)","v":30.579032999999999},{"$f":"ROUND(F40*H40,2)","v":39752.74}]
[28,"4.17","BOCA PARA BUEIRO SIMPLES TUBULAR D = 80 CM EM CONCRETO, ALAS COM ESCONSIDADE DE 0°, INCLUINDO FÔRMAS E MATERIAIS",102739,"UNID.",5,{"$f":"VLOOKUP(A41,CPU!$A$1:$N$4885,9)","v":3650.96},{"$f":"VLOOKUP(A41,CPU!$A$1:$N$4885,10)","v":4435.5513040000005},{"$f":"ROUND(F41*H41,2)","v":22177.759999999998}]
[29,"4.18","FAIXA ELEVADA PARA TRAVESSIA DE PEDESTRES - CONF. PROJETO, INCLUSIVE PINTURA DE SINALIZAÇÃO","CPU.4","UNID.",1,{"$f":"VLOOKUP(A42,CPU!$A$1:$N$4885,9)","v":6466.73},{"$f":"VLOOKUP(A42,CPU!$A$1:$N$4885,10)","v":7856.4302770000004},{"$f":"ROUND(F42*H42,2)","v":7856.43}]
[30,"4.19","ESTACA BROCA DE CONCRETO, DIÂMETRO DE 30CM, ESCAVAÇÃO MANUAL COM TRADO CONCHA, COM ARMADURA DE ARRANQUE",101175,"M",120,{"$f":"VLOOKUP(A43,CPU!$A$1:$N$4885,9)","v":113.27000000000001},{"$f":"VLOOKUP(A43,CPU!$A$1:$N$4885,10)","v":137.61172300000001},{"$f":"ROUND(F43*H43,2)","v":16513.41}]
[31,"4.20","CONTENÇÃO EM CORTINA COM ESTACAS ESPAÇADAS COM 30 CM DE DIÂMETRO E PROFUNDIDADE MENOR OU IGUAL A 10 M.",98615,"M2",360,{"$f":"VLOOKUP(A44,CPU!$A$1:$N$4885,9)","v":158.82999999999998},{"$f":"VLOOKUP(A44,CPU!$A$1:$N$4885,10)","v":192.96256700000001},69466.52]
[32,"4.3","FORNECIMENTO E INSTALAÇÃO DE PLACA DE SINALIZAÇÃO VIÁRIA - REGULAMENTAÇÃO 0,60MX0,60M, SUPORTE INCLUSO","CPU.5","UNID.",6,{"$f":"VLOOKUP(A45,CPU!$A$1:$N$4885,9)","v":386.98},{"$f":"VLOOKUP(A45,CPU!$A$1:$N$4885,10)","v":470.14200200000005},{"$f":"ROUND(F45*H45,2)","v":2820.85}]
[33,"4.4","FORNECIMENTO E INSTALAÇÃO DE PLACA DE IDENTIFICAÇÃO DE LOGRADOURO, SUPORTE INCLUSO - CONFORME PROJETO","CPU.6","UNID.",5,{"$f":"VLOOKUP(A46,CPU!$A$1:$N$4885,9)","v":353.98},{"$f":"VLOOKUP(A46,CPU!$A$1:$N$4885,10)","v":430.05030200000004},{"$f":"ROUND(F46*H46,2)","v":2150.25}]
[null,"TOTAL GERAL DA OBRA COM BDI ",{"$nulls":6},{"$f":"SUM(I9,I15,I21,I24)","v":1971942.7700000005}]

{"sheet":"CPU","index":1,"n_rows":620,"n_cols":13,"rows_kept":620,"cut":false,"hidden":false,"merged":[[547,1,547,6],[548,1,548,6],[528,0,549,0],[528,1,528,3],[528,4,528,7],[528,10,528,11],[529,2,529,5],[530,2,530,3],[531,1,531,7],[545,1,545,3],[545,5,545,6],[546,1,546,6],[509,0,527,0],[509,1,509,3],[509,4,509,7],[510,2,510,5],[511,2,511,3],[512,1,512,7],[523,1,523,3],[523,5,523,6],[524,1,524,6],[525,1,525,6],[526,1,526,6],[494,0,508,0],[494,1,494,3],[494,4,494,7],[495,2,495,5],[496,2,496,3],[497,1,497,7],[504,1,504,3],[504,5,504,6],[505,1,505,6],[506,1,506,6],[507,1,507,6],[479,0,493,0],[479,1,479,3],[479,4,479,7],[480,2,480,5],[481,2,481,3],[482,1,482,7],[489,1,489,3],[489,5,489,6],[490,1,490,6],[491,1,491,6],[492,1,492,6],[465,0,478,0],[465,1,465,3],[465,4,465,7],[466,2,466,5],[467,2,467,3],[468,1,468,7],[474,1,474,3],[474,5,474,6],[475,1,475,6],[476,1,476,6],[477,1,477,6],[431,0,464,0],[431,1,431,3],[431,4,431,7],[432,2,432,5],[433,2,433,3],[434,1,434,7],[460,1,460,3],[460,5,460,6],[461,1,461,6],[462,1,462,6],[463,1,463,6],[397,0,430,0],[397,1,397,3],[397,4,397,7],[398,2,398,5],[399,2,399,3],[400,1,400,7],[426,1,426,3],[426,5,426,6],[427,1,427,6],[428,1,428,6],[429,1,429,6],[364,0,396,0],[364,1,364,3],[364,4,364,7],[365,2,365,5],[366,2,366,3],[367,1,367,7],[392,1,392,3],[392,5,392,6],[393,1,393,6],[394,1,394,6],[395,1,395,6],[347,0,363,0],[347,1,347,3],[347,4,347,7],[348,2,348,5],[349,2,349,3],[350,1,350,7],[359,1,359,3],[359,5,359,6],[360,1,360,6],[361,1,361,6],[362,1,362,6],[330,0,346,0],[330,1,330,3],[330,4,330,7],[331,2,331,5],[332,2,332,3],[333,1,333,7],[342,1,342,3],[342,5,342,6],[343,1,343,6],[344,1,344,6],[345,1,345,6],[313,0,329,0],[313,1,313,3],[313,4,313,7],[314,2,314,5],[315,2,315,3],[316,1,316,7],[325,1,325,3],[325,5,325,6],[326,1,326,6],[327,1,327,6],[328,1,328,6],[297,0,312,0],[297,1,297,3],[297,4,297,7],[298,2,298,5],[299,2,299,3],[300,1,300,7],[308,1,308,3],[308,5,308,6],[309,1,309,6],[310,1,310,6],[311,1,311,6],[281,0,296,0],[281,1,281,3],[281,4,281,7],[282,2,282,5],[283,2,283,3],[284,1,284,7],[292,1,292,3],[292,5,292,6],[293,1,293,6],[294,1,294,6],[295,1,295,6],[267,0,280,0],[267,1,267,3],[267,4,267,7],[268,2,268,5],[269,2,269,3],[270,1,270,7],[276,1,276,3],[276,5,276,6],[277,1,277,6],[278,1,278,6],[279,1,279,6],[248,0,266,0],[248,1,248,3],[248,4,248,7],[249,2,249,5],[250,2,250,3],[251,1,251,7],[262,1,262,3],[262,5,262,6],[263,1,263,6],[264,1,264,6],[265,1,265,6],[229,0,247,0],[229,1,229,3],[229,4,229,7],[230,2,230,5],[231,2,231,3],[232,1,232,7],[243,1,243,3],[243,5,243,6],[244,1,244,6],[245,1,245,6],[246,1,246,6],[126,0,142,0],[602,0,620,0],[602,1,602,3],[602,4,602,7],[603,2,603,5],[604,2,604,3],[605,1,605,7],[616,1,616,3],[616,5,616,6],[617,1,617,6],[618,1,618,6],[619,1,619,6],[584,0,601,0],[584,1,584,3],[584,4,584,7],[585,2,585,5],[586,2,586,3],[587,1,587,7],[597,1,597,3],[597,5,597,6],[598,1,598,6],[599,1,599,6],[600,1,600,6],[178,0,190,0],[178,1,178,3],[178,4,178,7],[178,10,178,11],[179,2,179,5],[180,2,180,3],[181,1,181,7],[186,1,186,3],[186,5,186,6],[187,1,187,6],[188,1,188,6],[189,1,189,6],[92,1,92,6],[93,1,93,6],[95,0,107,0],[95,1,95,3],[95,4,95,7],[96,2,96,5],[97,2,97,3],[98,1,98,7],[104,1,104,3],[104,5,104,6],[105,1,105,6],[106,1,106,6],[121,1,121,3],[121,5,121,6],[122,1,122,6],[123,1,123,6],[124,1,124,6],[109,1,109,3],[109,4,109,7],[109,0,124,0],[167,2,167,3],[168,1,168,7],[191,10,191,11],[192,2,192,5],[193,2,193,3],[194,1,194,7],[205,1,205,3],[205,5,205,6],[206,1,206,6],[207,1,207,6],[208,1,208,6],[0,0,14,0],[15,0,33,0],[34,0,47,0],[48,0,65,0],[66,0,81,0],[146,0,164,0],[173,1,173,3],[162,1,162,6],[163,1,163,6],[165,1,165,3],[165,4,165,7],[146,1,146,3],[146,4,146,7],[84,2,84,3],[85,1,85,7],[90,1,90,3],[0,1,0,3],[0,4,0,7],[165,0,177,0],[45,1,45,6],[46,1,46,6],[68,2,68,3],[107,1,107,6],[82,0,93,0],[165,10,165,11],[166,2,166,5],[126,1,126,3],[126,4,126,7],[126,10,126,11],[127,2,127,5],[128,2,128,3],[129,1,129,7],[141,1,141,3],[141,5,141,6],[142,1,142,6],[143,1,143,6],[144,1,144,6],[0,10,0,11],[1,2,1,5],[2,2,2,3],[3,1,3,7],[10,1,10,3],[10,5,10,6],[11,1,11,6],[12,1,12,6],[13,1,13,6],[15,1,15,3],[15,4,15,7],[15,10,15,11],[16,2,16,5],[17,2,17,3],[18,1,18,7],[29,1,29,3],[29,5,29,6],[61,5,61,6],[34,10,34,11],[35,2,35,5],[36,2,36,3],[37,1,37,7],[43,1,43,3],[30,1,30,6],[31,1,31,6],[32,1,32,6],[34,1,34,3],[34,4,34,7],[82,10,82,11],[83,2,83,5],[62,1,62,6],[63,1,63,6],[64,1,64,6],[66,1,66,3],[66,4,66,7],[66,10,66,11],[67,2,67,5],[173,5,173,6],[174,1,174,6],[175,1,175,6],[176,1,176,6],[48,10,48,11],[49,2,49,5],[50,2,50,3],[51,1,51,7],[61,1,61,3],[69,1,69,7],[77,1,77,3],[146,10,146,11],[147,2,147,5],[148,2,148,3],[149,1,149,7],[160,1,160,3],[160,5,160,6],[161,1,161,6],[109,10,109,11],[110,2,110,5],[111,2,111,3],[112,1,112,7],[48,1,48,3],[48,4,48,7],[90,5,90,6],[91,1,91,6],[77,5,77,6],[78,1,78,6],[79,1,79,6],[80,1,80,6],[82,1,82,3],[82,4,82,7],[43,5,43,6],[44,1,44,6],[210,0,228,0],[191,1,191,3],[191,4,191,7],[191,0,209,0],[210,1,210,3],[210,4,210,7],[211,2,211,5],[212,2,212,3],[213,1,213,7],[224,1,224,3],[224,5,224,6],[225,1,225,6],[226,1,226,6],[227,1,227,6],[550,0,564,0],[550,1,550,3],[550,4,550,7],[551,2,551,5],[552,2,552,3],[553,1,553,7],[560,1,560,3],[560,5,560,6],[561,1,561,6],[562,1,562,6],[563,1,563,6],[582,1,582,6],[565,0,582,0],[565,1,565,3],[565,4,565,7],[566,2,566,5],[567,2,567,3],[568,1,568,7],[579,1,579,3],[579,5,579,6],[580,1,580,6],[581,1,581,6]]}
[1,"CODEVASF",null,null," COMPOSIÇÃO DE PREÇO UNITÁRIO",null,null,null,{"$f":"H12","v":14753.36},{"$f":"H14","v":17923.857064000003},"BDI CALCULADO:",null,{"$f":"ORÇAMENTO!I6","v":0.21489999999999998}]
[null,"OBRA:  ",{"$f":"ORÇAMENTO!C5","v":"PAVIMENTAÇÃO EM BLOQUETE SEXTAVADOS - RUA BOM JARDIM (BAIRRO SANTO ANTÔNIO) - SERRO/MG (ITEM 2)"},null,null,null,"DATA: ",{"$f":"ORÇAMENTO!C6","v":"OUTUBRO/2023"}]
[null,"SERVIÇO:  ",{"$f":"VLOOKUP(A1,ORÇAMENTO!A10:I26,3)","v":"MOBILIZAÇÃO E DESMOBILIZAÇÃO"},null,"Referência:",{"$f":"VLOOKUP(A1,ORÇAMENTO!A10:I26,4)","v":"CPU.1"},"UNIDADE: ",{"$f":"VLOOKUP(A1,ORÇAMENTO!A10:I26,5)","v":"GL"}]
[]
[null,"TIPO ITEM","CODIGO ITEM","DESCRIÇÃO ITEM","UNIDADE ITEM","COEFICIENTE","PRECO UNITARIO","CUSTO TOTAL"]
[null,"COMPOSICAO",5824,"CAMINHÃO TOCO, PBT 16.000 KG, CARGA ÚTIL MÁX. 10.685 KG, DIST. ENTRE EIXOS 4,8 M, POTÊNCIA 189 CV, INCLUSIVE CARROCERIA FIXA ABERTA DE MADEIRA P/ TRANSPORTE GERAL DE CARGA SECA ","CHP",16,202.74,{"$f":"ROUNDDOWN(F6*G6,2)","v":3243.84},{"$nulls":4},"."]
[null,"COMPOSICAO",5826,"CAMINHÃO TOCO, PBT 16.000 KG, CARGA ÚTIL MÁX. 10.685 KG, DIST. ENTRE EIXOS 4,8 M, POTÊNCIA 189 CV, INCLUSIVE CARROCERIA FIXA ABERTA DE MADEIRA P/ TRANSPORTE GERAL DE CARGA SECA ","CHI",16,60.95,{"$f":"ROUNDDOWN(F7*G7,2)","v":975.2}]
[null,"COMPOSICAO",5914640,"TRANSPORTE COM CAVALO MECÂNICO COM SEMIRREBOQUE COM CAPACIDADE DE 30 T - RODOVIA PAVIMENTADA","T.KM",4354,0.57999999999999996,{"$f":"ROUNDDOWN(F8*G8,2)","v":2525.3200000000002}]
[null,"COMPOSIÇÃO",88316,"SERVENTE COM ENCARGOS COMPLEMENTARES","H",32,19.760000000000002,{"$f":"ROUNDDOWN(F9*G9,2)","v":632.32000000000005}]
[{"$nulls":7},{"$f":"ROUNDDOWN(F10*G10,2)","v":0}]
[null,"PRODUÇÃO DA EQUIPE",null,null,0.5,"CUSTO ",null,{"$f":"SUM(H6:H10)","v":7376.68}]
[null,"TOTAL",{"$nulls":5},{"$f":"H11/E11","v":14753.36},"OK"]
[null,"BDI                %",{"$nulls":5},{"$f":"1+$M$1","v":1.2149000000000001}]
[null,"TOTAL DO SERVIÇO - R$",{"$nulls":5},{"$f":"H12*H13","v":17923.857064000003}]
[]
[{"$f":"A1+1","v":2},"CODEVASF",null,null," COMPOSIÇÃO DE PREÇO UNITÁRIO",null,null,null,{"$f":"H31","v":96005},{"$f":"H33","v":116636.47450000001}]
[null,"OBRA:  ",{"$f":"$C$2","v":"PAVIMENTAÇÃO EM BLOQUETE SEXTAVADOS - RUA BOM JARDIM (BAIRRO SANTO ANTÔNIO) - SERRO/MG (ITEM 2)"},null,null,null,"DATA: ",{"$f":"$H$2","v":"OUTUBRO/2023"}]
[null,"SERVIÇO:  ",{"$f":"VLOOKUP(A16,ORÇAMENTO!$A$10:$I$26,3)","v":"ADMINISTRAÇÃO LOCAL"},null,"SINAPI","CPU","UNIDADE: ",{"$f":"VLOOKUP(A16,ORÇAMENTO!$A$10:$I$26,5)","v":"GL"}]
[]
[null,"TIPO ITEM","CODIGO ITEM","DESCRIÇÃO ITEM","UNIDADE ITEM","COEFICIENTE","PRECO UNITARIO","CUSTO TOTAL"]
[null,"INSUMO",14250,"ENERGIA ELÉTRICA","kwh",50,0.94,{"$f":"ROUNDDOWN(F21*G21,2)","v":47}]
[null,"INSUMO",44480,"TARIFA FORNECIMENTO DE ÁGUA/ESGOTO ","M3",5,17.78,{"$f":"ROUNDDOWN(F22*G22,2)","v":88.9}]
[null,"COTAÇÃO","MERC.","TELEFONE (PLANO CONTROLE)","UNID",2,59.9,119.8]
[null,"COMPOSICAO",90777,"Engenheiro Civil Júnior com encargos complementares","H",55,114.12,6276.6]
[null,"COMPOSICAO",90776,"Encarregado Geral com encargos complementares","H",110,57.73,{"$f":"ROUNDDOWN(F25*G25,2)","v":6350.3}]
[null,"COMPOSICAO",88321,"Tecnico de Laboratório com encargos complementares","H",55,45.45,{"$f":"ROUNDDOWN(F26*G26,2)","v":2499.75}]
[null,"COMPOSICAO",100309,"Tecnico em Segurança do Trabalho com encargos complementares","H",55,45.71,{"$f":"ROUNDDOWN(F27*G27,2)","v":2514.0500000000002}]
[null,"COMPOSICAO",90772,"Auxiliar de escritório com encargos complementares","H",55,23.72,1304.5999999999999]
[{"$nulls":7},0]
[null,"PRODUÇÃO DA EQUIPE",null,null,0.2,"CUSTO ",null,{"$f":"SUM(H21:H29)","v":19201}]
[null,"TOTAL",{"$nulls":5},{"$f":"H30/E30","v":96005},"OK"]
[null,"BDI                %",{"$nulls":5},{"$f":"1+$M$1","v":1.2149000000000001}]
[null,"TOTAL DO SERVIÇO - R$",{"$nulls":5},{"$f":"H31*H32","v":116636.47450000001}]
[]
[{"$f":"A16+1","v":3},"CODEVASF",null,null," COMPOSIÇÃO DE PREÇO UNITÁRIO",null,null,null,{"$f":"H45","v":11337.75},{"$f":"H47","v":13774.232475000001}]
[null,"OBRA:  ",{"$f":"$C$2","v":"PAVIMENTAÇÃO EM BLOQUETE SEXTAVADOS - RUA BOM JARDIM (BAIRRO SANTO ANTÔNIO) - SERRO/MG (ITEM 2)"},null,null,null,"DATA: ",{"$f":"$H$2","v":"OUTUBRO/2023"}]
[null,"SERVIÇO:  ",{"$f":"VLOOKUP(A35,ORÇAMENTO!$A$10:$I$26,3)","v":"CANTEIRO DE OBRAS"},null,"SINAPI",{"$f":"VLOOKUP(A35,ORÇAMENTO!$A$10:$I$26,4)","v":"CPU.3"},"UNIDADE: ",{"$f":"VLOOKUP(A35,ORÇAMENTO!$A$10:$I$26,5)","v":"GL"}]
[]
[null,"TIPO ITEM","CODIGO ITEM","DESCRIÇÃO ITEM","UNIDADE ITEM","COEFICIENTE","PRECO UNITARIO","CUSTO TOTAL"]
[null,"COTAÇÃO",10775,"ALUGUEL DE IMÓVEL OU CONTEINER QUE ATENDA AOS REQUISITOS MÍNIMOS PARA INSTALAÇÃO DO CANTEIRO DE OBRAS ","MÊS",5,975,{"$f":"ROUNDDOWN(F40*G40,2)","v":4875}]
[null,"INSUMO",10779,"LOCACAO DE CONTAINER 2,30 X 4,30 M, ALT. 2,50 M, P/ SANITARIO, C/ 5 BACIAS, 1 LAVATORIO E 4 MICTORIOS","MÊS",5,1218.75,{"$f":"ROUNDDOWN(F41*G41,2)","v":6093.75}]
[null,"INSUMO","37525","TELA PLASTICA TECIDA LISTRADA BRANCA E LARANJA, TIPO GUARDA CORPO, EM POLIETILENO MONOFILADO, ROLO 1,20 X 50 M (L X C)","M",100,3.69,369]
[{"$nulls":7},0]
[null,"PRODUÇÃO DA EQUIPE",null,null,1,"CUSTO ",null,{"$f":"SUM(H40:H43)","v":11337.75}]
[null,"TOTAL",{"$nulls":5},{"$f":"H44/E44","v":11337.75},"OK"]
[null,"BDI                %",{"$nulls":5},{"$f":"1+$M$1","v":1.2149000000000001}]
[null,"TOTAL DO SERVIÇO - R$",{"$nulls":5},{"$f":"H45*H46","v":13774.232475000001}]
[]
[{"$f":"A35+1","v":4},"CODEVASF",null,null," COMPOSIÇÃO DE PREÇO UNITÁRIO",null,null,null,{"$f":"H63","v":340.5},{"$f":"H65","v":413.67345}]
[null,"OBRA:  ",{"$f":"$C$2","v":"PAVIMENTAÇÃO EM BLOQUETE SEXTAVADOS - RUA BOM JARDIM (BAIRRO SANTO ANTÔNIO) - SERRO/MG (ITEM 2)"},null,null,null,"DATA: ",{"$f":"$H$2","v":"OUTUBRO/2023"}]
[null,"SERVIÇO:  ",{"$f":"VLOOKUP(A49,ORÇAMENTO!$A$10:$I$26,3)","v":"PLACA DE OBRA EM CHAPA DE AÇO GALVANIZADO"},null,"SINAPI",{"$f":"VLOOKUP(A49,ORÇAMENTO!$A$10:$I$26,4)","v":103689},"UNIDADE: ",{"$f":"VLOOKUP(A49,ORÇAMENTO!$A$10:$I$26,5)","v":"M2"}]
[]
[null,"TIPO ITEM","CODIGO ITEM","DESCRIÇÃO ITEM","UNIDADE ITEM","COEFICIENTE","PRECO UNITARIO","CUSTO TOTAL"]
[null,"INSUMO","4509","SARRAFO *2,5 X 10* CM EM PINUS, MISTA OU EQUIVALENTE DA REGIAO - BRUTA","M","3,2083000","4,41",{"$f":"ROUNDDOWN(F54*G54,2)","v":14.14}]
[null,"INSUMO","4813","PLACA DE OBRA (PARA CONSTRUCAO CIVIL) EM CHAPA GALVANIZADA *N. 22*, ADESIVADA, DE *2,4 X 1,2* M (SEM POSTES PARA FIXACAO)","M2","1,0000000","250,00",{"$f":"ROUNDDOWN(F55*G55,2)","v":250}]
[null,"INSUMO","5065","PREGO DE ACO POLIDO COM CABECA 10 X 10 ","KG","0,0113000","36,57",0.41]
[null,"INSUMO","5069","PREGO DE ACO POLIDO COM CABECA 17 X 27 ","KG","0,0132000","19,59",0.25]
[null,"COMPOSICAO","88262","CARPINTEIRO DE FORMAS COM ENCARGOS COMPLEMENTARES","H","0,3729000","27,05",10.08]
[null,"COMPOSICAO","88316","SERVENTE COM ENCARGOS COMPLEMENTARES","H","1,1186000","19,76",22.1]
[null,"COMPOSICAO",4115,"MADEIRA ROLICA TRATADA, D = 12 A 15 CM, H = 3,00 M, EM EUCALIPTO OU EQUIVALENTE","M",2,21.76,{"$f":"ROUNDDOWN(F60*G60,2)","v":43.52}]
[{"$nulls":7},0]
[null,"PRODUÇÃO DA EQUIPE",null,null,1,"CUSTO ",null,{"$f":"SUM(H54:H61)","v":340.5}]
[null,"TOTAL",{"$nulls":5},{"$f":"H62/E62","v":340.5},"OK"]
[null,"BDI                %",{"$nulls":5},{"$f":"1+$M$1","v":1.2149000000000001}]
[null,"TOTAL DO SERVIÇO - R$",{"$nulls":5},{"$f":"H63*H64","v":413.67345}]
[]
[{"$f":"A49+1","v":5},"CODEVASF",null,null," COMPOSIÇÃO DE PREÇO UNITÁRIO",null,null,null,{"$f":"H79","v":0.32999999999999996},{"$f":"H81","v":0.40091699999999997}]
[null,"OBRA:  ",{"$f":"$C$2","v":"PAVIMENTAÇÃO EM BLOQUETE SEXTAVADOS - RUA BOM JARDIM (BAIRRO SANTO ANTÔNIO) - SERRO/MG (ITEM 2)"},null,null,null,"DATA: ",{"$f":"$H$2","v":"OUTUBRO/2023"}]
[null,"SERVIÇO:  ",{"$f":"VLOOKUP(A67,ORÇAMENTO!$A$10:$I$26,3)","v":"SERVIÇOS TOPOGRÁFICOS PARA PAVIMENTAÇÃO, INCLUSIVE NOTA DE SERVIÇO, ACOMPANHAMENTO E GREIDE"},null,"SINAPI",{"$f":"VLOOKUP(A67,ORÇAMENTO!$A$10:$I$26,4)","v":99064},"UNIDADE: ",{"$f":"VLOOKUP(A67,ORÇAMENTO!$A$10:$I$26,5)","v":"M2"}]
[]
[null,"TIPO ITEM","CODIGO ITEM","DESCRIÇÃO ITEM","UNIDADE ITEM","COEFICIENTE","PRECO UNITARIO","CUSTO TOTAL"]
[null,"COMPOSICAO",88253,"AUXILIAR DE TOPÓGRAFO COM ENCARGOS COMPLEMENTARES","H",2.5000000000000001E-3,21.57,{"$f":"ROUNDDOWN(F72*G72,2)","v":0.05}]
[null,"COMPOSICAO",88288,"NIVELADOR COM ENCARGOS COMPLEMENTARES","H",2.5000000000000001E-3,26.99,{"$f":"ROUNDDOWN(F73*G73,2)","v":0.06}]
[null,"COMPOSICAO",88316,"SERVENTE COM ENCARGOS COMPLEMENTARES","H",7.4999999999999997E-3,19.760000000000002,0.14000000000000001]
[null,"COMPOSICAO",88597,"DESENHISTA DETALHISTA COM ENCARGOS COMPLEMENTARES ","H",2E-3,29.72,0.05]
[null,"COMPOSICAO",92145,"CAMINHONETE CABINE SIMPLES COM MOTOR 1.6 FLEX, CÂMBIO MANUAL, POTÊNCIA 101/104 CV, 2 PORTAS","CHP",5.0000000000000001E-4,75.75,0.03]
[{"$nulls":7},0]
[null,"PRODUÇÃO DA EQUIPE",null,null,1,"CUSTO ",null,{"$f":"SUM(H72:H77)","v":0.32999999999999996}]
[null,"TOTAL",{"$nulls":5},{"$f":"H78/E78","v":0.32999999999999996},"OK"]
[null,"BDI                %",{"$nulls":5},{"$f":"1+$M$1","v":1.2149000000000001}]
[null,"TOTAL DO SERVIÇO - R$",{"$nulls":5},{"$f":"H79*H80","v":0.40091699999999997}]
[]
[{"$f":"A67+1","v":6},"CODEVASF",null,null," COMPOSIÇÃO DE PREÇO UNITÁRIO",null,null,null,{"$f":"H92","v":2.2000000000000002},{"$f":"H94","v":2.6727800000000004}]
[null,"OBRA:  ",{"$f":"$C$2","v":"PAVIMENTAÇÃO EM BLOQUETE SEXTAVADOS - RUA BOM JARDIM (BAIRRO SANTO ANTÔNIO) - SERRO/MG (ITEM 2)"},null,null,null,"DATA: ",{"$f":"$H$2","v":"OUTUBRO/2023"}]
[null,"SERVIÇO:  ",{"$f":"VLOOKUP(A83,ORÇAMENTO!$A$10:$I$26,3)","v":"ESCAVAÇÃO HORIZONTAL EM SOLO DE 1A CATEGORIA COM TRATOR DE ESTEIRAS"},null,"SINAPI",{"$f":"VLOOKUP(A83,ORÇAMENTO!$A$10:$I$26,4)","v":101116},"UNIDADE: ",{"$f":"VLOOKUP(A83,ORÇAMENTO!$A$10:$I$26,5)","v":"M3"}]
[]
[null,"TIPO ITEM","CODIGO ITEM","DESCRIÇÃO ITEM","UNIDADE ITEM","COEFICIENTE","PRECO UNITARIO","CUSTO TOTAL"]
[null,"COMPOSICAO",5847,"TRATOR DE ESTEIRAS, POTÊNCIA 170 HP, PESO OPERACIONAL 19 T, CAÇAMBA 5,2 M3 ","CHP","0,0048000","253,93",{"$f":"ROUNDDOWN(F88*G88,2)","v":1.21}]
[null,"COMPOSICAO",5849,"TRATOR DE ESTEIRAS, POTÊNCIA 170 HP, PESO OPERACIONAL 19 T, CAÇAMBA 5,2 M3","CHI","0,0082000","90,40",{"$f":"ROUNDDOWN(F89*G89,2)","v":0.74}]
[null,"COMPOSICAO",88316,"SERVENTE COM ENCARGOS COMPLEMENTARES","H","0,0131000","19,76",{"$f":"ROUNDDOWN(F90*G90,2)","v":0.25}]
[null,"PRODUÇÃO DA EQUIPE",null,null,1,"CUSTO ",null,{"$f":"SUM(H88:H90)","v":2.2000000000000002}]
[null,"TOTAL",{"$nulls":5},{"$f":"H91/E91","v":2.2000000000000002},"OK"]
[null,"BDI                %",{"$nulls":5},{"$f":"1+$M$1","v":1.2149000000000001}]
[null,"TOTAL DO SERVIÇO - R$",{"$nulls":5},{"$f":"H92*H93","v":2.6727800000000004}]
[]
[7,"CODEVASF",null,null," COMPOSIÇÃO DE PREÇO UNITÁRIO",null,null,null,{"$f":"H106","v":8.7100000000000009},{"$f":"H108","v":10.581779000000003}]
[null,"OBRA:  ",{"$f":"$C$2","v":"PAVIMENTAÇÃO EM BLOQUETE SEXTAVADOS - RUA BOM JARDIM (BAIRRO SANTO ANTÔNIO) - SERRO/MG (ITEM 2)"},null,null,null,"DATA: ",{"$f":"$H$2","v":"OUTUBRO/2023"}]
[null,"SERVIÇO:  ",{"$f":"VLOOKUP(A96,ORÇAMENTO!$A$10:$I$26,3)","v":"CARGA, MANOBRA E DESCARGA DE SOLOS E MATERIAIS GRANULARES EM CAMINHÃO BASCULANTE - CARGA COM PÁ CARREGADEIRA E DESCARGA LIVRE"},null,"SINAPI",{"$f":"VLOOKUP(A96,ORÇAMENTO!$A$10:$I$26,4)","v":100976},"UNIDADE: ",{"$f":"VLOOKUP(A96,ORÇAMENTO!$A$10:$I$26,5)","v":"M3"}]
[]
[null,"TIPO ITEM","CODIGO ITEM","DESCRIÇÃO ITEM","UNIDADE ITEM","COEFICIENTE","PRECO UNITARIO","CUSTO TOTAL"]
[null,"COMPOSICAO",5940,"PÁ CARREGADEIRA SOBRE RODAS, POTÊNCIA LÍQUIDA 128 HP, CAPACIDADE DA CAÇAMBA 1,7 A 2,8 M3, PESO OPERACIONAL 11632 KG","CHP","0,0083000","217,72",{"$f":"ROUNDDOWN(F101*G101,2)","v":1.8}]
[null,"COMPOSICAO",5942,"PÁ CARREGADEIRA SOBRE RODAS, POTÊNCIA LÍQUIDA 128 HP, CAPACIDADE DA CAÇAMBA 1,7 A 2,8 M3, PESO OPERACIONAL 11632 KG","CHI","0,0074000","95,85",{"$f":"ROUNDDOWN(F102*G102,2)","v":0.7}]
[null,"COMPOSICAO",89883,"CAMINHÃO BASCULANTE 18 M3, COM CAVALO MECÂNICO DE CAPACIDADE MÁXIMA DE TRAÇÃO COMBINADO DE 45000 KG, POTÊNCIA 330 CV, INCLUSIVE SEMIREBOQUE COM CAÇAMBA METÁLICA","CHP","0,0153000","348,45",{"$f":"ROUNDDOWN(F103*G103,2)","v":5.33}]
[null,"COMPOSICAO",89884,"CAMINHÃO BASCULANTE 18 M3, COM CAVALO MECÂNICO DE CAPACIDADE MÁXIMA DE TRAÇÃO COMBINADO DE 45000 KG, POTÊNCIA 330 CV, INCLUSIVE SEMIREBOQUE COM CAÇAMBA METÁLICA","CHI","0,0095000","93,65",{"$f":"ROUNDDOWN(F104*G104,2)","v":0.88}]
[null,"PRODUÇÃO DA EQUIPE",null,null,1,"CUSTO ",null,{"$f":"SUM(H101:H104)","v":8.7100000000000009}]
[null,"TOTAL",{"$nulls":5},{"$f":"H105/E105","v":8.7100000000000009},"OK"]
[null,"BDI                %",{"$nulls":5},{"$f":"1+$M$1","v":1.2149000000000001}]
[null,"TOTAL DO SERVIÇO - R$",{"$nulls":5},{"$f":"H106*H107","v":10.581779000000003}]
[]
[8,"CODEVASF",null,null," COMPOSIÇÃO DE PREÇO UNITÁRIO",null,null,null,{"$f":"H123","v":2.57},{"$f":"H125","v":3.122293}]
[null,"OBRA:  ",{"$f":"$C$2","v":"PAVIMENTAÇÃO EM BLOQUETE SEXTAVADOS - RUA BOM JARDIM (BAIRRO SANTO ANTÔNIO) - SERRO/MG (ITEM 2)"},null,null,null,"DATA: ",{"$f":"$H$2","v":"OUTUBRO/2023"}]
[null,"SERVIÇO:  ",{"$f":"VLOOKUP(A110,ORÇAMENTO!$A$10:$I$26,3)","v":"REGULARIZAÇÃO E COMPACTAÇÃO DE SUBLEITO"},null,"SINAPI",{"$f":"VLOOKUP(A110,ORÇAMENTO!$A$10:$I$26,4)","v":100576},"UNIDADE: ",{"$f":"VLOOKUP(A110,ORÇAMENTO!$A$10:$I$26,5)","v":"M2"}]
[]
[null,"TIPO ITEM","CODIGO ITEM","DESCRIÇÃO ITEM","UNIDADE ITEM","COEFICIENTE","PRECO UNITARIO","CUSTO TOTAL"]
[null,"COMPOSICAO",5901,"CAMINHÃO PIPA 10.000 L TRUCADO, PESO BRUTO TOTAL 23.000 KG, CARGA ÚTIL MÁXIMA 15.935 KG, DISTÂNCIA ENTRE EIXOS 4,8 M, POTÊNCIA 230 CV, INCLUSIVE TANQUE DE AÇO PARA TRANSPORTE DE ÁGUA ","CHP","0,0010000","294,94",{"$f":"ROUNDDOWN(F115*G115,2)","v":0.28999999999999998}]
[null,"COMPOSICAO",5903,"CAMINHÃO PIPA 10.000 L TRUCADO, PESO BRUTO TOTAL 23.000 KG, CARGA ÚTIL MÁXIMA 15.935 KG, DISTÂNCIA ENTRE EIXOS 4,8 M, POTÊNCIA 230 CV, INCLUSIVE TANQUE DE AÇO PARA TRANSPORTE DE ÁGUA ","CHI","0,0070000","72,55",0.5]
[null,"COMPOSICAO",5932,"MOTONIVELADORA POTÊNCIA BÁSICA LÍQUIDA (PRIMEIRA MARCHA) 125 HP, PESO BRUTO 13032 KG, LARGURA DA LÂMINA DE 3,7 M ","CHP","0,0001000","262,71",0.02]
[null,"COMPOSICAO",5934,"MOTONIVELADORA POTÊNCIA BÁSICA LÍQUIDA (PRIMEIRA MARCHA) 125 HP, PESO BRUTO 13032 KG, LARGURA DA LÂMINA DE 3,7 M ","CHI","0,0080000","109,40",0.87]
[null,"COMPOSICAO",73436,"ROLO COMPACTADOR VIBRATÓRIO PÉ DE CARNEIRO PARA SOLOS, POTÊNCIA 80 HP, PESO OPERACIONAL SEM/COM LASTRO 7,4 / 8,8 T, LARGURA DE TRABALHO 1,68 M","CHP","0,0020000","163,19",0.32]
[null,"COMPOSICAO",88316,"SERVENTE COM ENCARGOS COMPLEMENTARES","H","0,0080000","19,76",0.15]
[null,"COMPOSICAO",93244,"ROLO COMPACTADOR VIBRATÓRIO PÉ DE CARNEIRO PARA SOLOS, POTÊNCIA 80 HP, PESO OPERACIONAL SEM/COM LASTRO 7,4 / 8,8 T, LARGURA DE TRABALHO 1,68 M ","CHI","0,0060000","71,18",0.42]
[null,"PRODUÇÃO DA EQUIPE",null,null,1,"CUSTO ",null,{"$f":"SUM(H115:H121)","v":2.57}]
[null,"TOTAL",{"$nulls":5},{"$f":"H122/E122","v":2.57},"OK"]
[null,"BDI                %",{"$nulls":5},{"$f":"1+$M$1","v":1.2149000000000001}]
[null,"TOTAL DO SERVIÇO - R$",{"$nulls":5},{"$f":"H123*H124","v":3.122293}]
[]
[8.5,"CODEVASF",null,null," COMPOSIÇÃO DE PREÇO UNITÁRIO",null,null,null,{"$f":"H143","v":12.469999999999999},{"$f":"H145","v":15.149803}]
[null,"OBRA:  ",{"$f":"$C$2","v":"PAVIMENTAÇÃO EM BLOQUETE SEXTAVADOS - RUA BOM JARDIM (BAIRRO SANTO ANTÔNIO) - SERRO/MG (ITEM 2)"},null,null,null,"DATA: ",{"$f":"$H$2","v":"OUTUBRO/2023"}]
[null,"SERVIÇO:  ",{"$f":"VLOOKUP(A127,ORÇAMENTO!$A$10:$I$26,3)","v":"EXECUÇÃO E COMPACTAÇÃO DE BASE E OU SUB BASE PARA PAVIMENTAÇÃO DE SOLO DE COMPORTAMENTO LATERÍTICO - EXCLUSIVE SOLO, ESCAVAÇÃO, CARGA E TRANSPORTE"},null,"SINAPI",{"$f":"VLOOKUP(A127,ORÇAMENTO!$A$10:$I$26,4)","v":96388},"UNIDADE: ",{"$f":"VLOOKUP(A127,ORÇAMENTO!$A$10:$I$26,5)","v":"M3"}]
[]
[null,"TIPO ITEM","CODIGO ITEM","DESCRIÇÃO ITEM","UNIDADE ITEM","COEFICIENTE","PRECO UNITARIO","CUSTO TOTAL"]
[null,"COMPOSICAO",5684,"ROLO COMPACTADOR VIBRATÓRIO DE UM CILINDRO AÇO LISO, POTÊNCIA 80 HP, PESO OPERACIONAL MÁXIMO 8,1 T, IMPACTO DINÂMICO 16,15 / 9,5 T, LARGURA DE TRABALHO 1,68 M","CHP","0,0030000","159,98",{"$f":"ROUNDDOWN(F132*G132,2)","v":0.47}]
[null,"COMPOSICAO",5685,"ROLO COMPACTADOR VIBRATÓRIO DE UM CILINDRO AÇO LISO, POTÊNCIA 80 HP, PESO OPERACIONAL MÁXIMO 8,1 T, IMPACTO DINÂMICO 16,15 / 9,5 T, LARGURA DE TRABALHO 1,68 M","CHI","0,0230000","69,53",1.59]
[null,"COMPOSICAO",5901,"CAMINHÃO PIPA 10.000 L TRUCADO, PESO BRUTO TOTAL 23.000 KG, CARGA ÚTIL MÁXIMA 15.935 KG, DISTÂNCIA ENTRE EIXOS 4,8 M, POTÊNCIA 230 CV, INCLUSIVE TANQUE DE AÇO PARA TRANSPORTE DE ÁGUA","CHP","0,0040000","294,94",1.17]
[null,"COMPOSICAO",5903,"CAMINHÃO PIPA 10.000 L TRUCADO, PESO BRUTO TOTAL 23.000 KG, CARGA ÚTIL MÁXIMA 15.935 KG, DISTÂNCIA ENTRE EIXOS 4,8 M, POTÊNCIA 230 CV, INCLUSIVE TANQUE DE AÇO PARA TRANSPORTE DE ÁGUA","CHI","0,0220000","72,55",1.59]
[null,"COMPOSICAO",5932,"MOTONIVELADORA POTÊNCIA BÁSICA LÍQUIDA (PRIMEIRA MARCHA) 125 HP, PESO BRUTO 13032 KG, LARGURA DA LÂMINA DE 3,7 M","CHP","0,0080000","262,71",2.1]
[null,"COMPOSICAO",5934,"MOTONIVELADORA POTÊNCIA BÁSICA LÍQUIDA (PRIMEIRA MARCHA) 125 HP, PESO BRUTO 13032 KG, LARGURA DA LÂMINA DE 3,7 M","CHI","0,0190000","109,40",2.0699999999999998]
[null,"COMPOSICAO",88316,"SERVENTE COM ENCARGOS COMPLEMENTARES","H","0,0260000","19,76",0.51]
[null,"INSUMO",4743,"CASCALHO DE CAVA (FORNECIMENTO PREFEITURA)","M3",1,null,0]
[null,"COMPOSICAO",96463,"ROLO COMPACTADOR DE PNEUS, ESTATICO, PRESSAO VARIAVEL, POTENCIA 110 HP, PESO SEM/COM LASTRO 10,8/27 T","CHP","0,0040000","218,21",0.87]
[null,"COMPOSICAO",96464,"ROLO COMPACTADOR DE PNEUS, ESTATICO, PRESSAO VARIAVEL, POTENCIA 110 HP, PESO SEM/COM LASTRO 10,8/27 T","CHI","0,0220000","95,83",2.1]
[null,"PRODUÇÃO DA EQUIPE",null,null,1,"CUSTO ",null,{"$f":"SUM(H132:H141)","v":12.469999999999999}]
[null,"TOTAL",{"$nulls":5},{"$f":"H142/E142","v":12.469999999999999},"OK"]
[null,"BDI                %",{"$nulls":5},{"$f":"1+$M$1","v":1.2149000000000001}]
[null,"TOTAL DO SERVIÇO - R$",{"$nulls":5},{"$f":"H143*H144","v":15.149803}]
[]
[9,"CODEVASF",null,null," COMPOSIÇÃO DE PREÇO UNITÁRIO",null,null,null,{"$f":"H162","v":61.66},{"$f":"H164","v":74.910734000000005}]
[null,"OBRA:  ",{"$f":"$C$2","v":"PAVIMENTAÇÃO EM BLOQUETE SEXTAVADOS - RUA BOM JARDIM (BAIRRO SANTO ANTÔNIO) - SERRO/MG (ITEM 2)"},null,null,null,"DATA: ",{"$f":"$H$2","v":"OUTUBRO/2023"}]
[null,"SERVIÇO:  ",{"$f":"VLOOKUP(A147,ORÇAMENTO!$A$10:$I$26,3)","v":"EXECUÇÃO DE PAVIMENTO EM PISO INTERTRAVADO, COM BLOCO SEXTAVADO DE CONCRETO DE 25 X 25 CM, ESPESSURA 8 CM"},null,"SINAPI",{"$f":"VLOOKUP(A147,ORÇAMENTO!$A$10:$I$26,4)","v":92394},"UNIDADE: ",{"$f":"VLOOKUP(A147,ORÇAMENTO!$A$10:$I$26,5)","v":"M2"}]
[]
[null,"TIPO ITEM","CODIGO ITEM","DESCRIÇÃO ITEM","UNIDADE ITEM","COEFICIENTE","PRECO UNITARIO","CUSTO TOTAL"]
[null,"INSUMO",370,"AREIA MEDIA - POSTO JAZIDA/FORNECEDOR (RETIRADO NA JAZIDA, SEM TRANSPORTE)","M3","0,0568000",90,{"$f":"ROUNDDOWN(F152*G152,2)","v":5.1100000000000003}]
[null,"INSUMO",712,"BLOQUETE/PISO INTERTRAVADO DE CONCRETO - MODELO SEXTAVADO / HEXAGONAL, 25 CM X 25 CM, E = 8 CM, RESISTENCIA DE 35 MPA (NBR 9781), COR NATURAL","M2","1,0038000",48.6,48.78]
[null,"INSUMO",4741,"PO DE PEDRA (POSTO PEDREIRA/FORNECEDOR, SEM FRETE)","M3","0,0066000","111,12",0.73]
[null,"COMPOSICAO",88260,"CALCETEIRO COM ENCARGOS COMPLEMENTARES","H","0,1683000","21,06",3.54]
[null,"COMPOSICAO",88316,"SERVENTE COM ENCARGOS COMPLEMENTARES","H","0,1683000","19,76",3.32]
[null,"COMPOSICAO",91277,"PLACA VIBRATÓRIA REVERSÍVEL COM MOTOR 4 TEMPOS A GASOLINA, FORÇA CENTRÍFUGA DE 25 KN (2500 KGF), POTÊNCIA 5,5 CV","CHP","0,0055000","8,77",0.04]
[null,"COMPOSICAO",91278,"PLACA VIBRATÓRIA REVERSÍVEL COM MOTOR 4 TEMPOS A GASOLINA, FORÇA CENTRÍFUGA DE 25 KN (2500 KGF), POTÊNCIA 5,5 CV","CHI","0,0787000","0,52",0.04]
[null,"COMPOSICAO",91283,"CORTADORA DE PISO COM MOTOR 4 TEMPOS A GASOLINA, POTÊNCIA DE 13 HP, COM DISCO DE CORTE DIAMANTADO SEGMENTADO PARA CONCRETO, DIÂMETRO DE 350 MM, FURO DE 1\" (14 X 1\")","CHP","0,0038000","9,69",0.03]
[null,"COMPOSICAO",91285,"CORTADORA DE PISO COM MOTOR 4 TEMPOS A GASOLINA, POTÊNCIA DE 13 HP, COM DISCO DE CORTE DIAMANTADO SEGMENTADO PARA CONCRETO, DIÂMETRO DE 350 MM, FURO DE 1\" (14 X 1\")","CHI","0,0804000","0,92",7.0000000000000007E-2]
[null,"PRODUÇÃO DA EQUIPE",null,null,1,"CUSTO ",null,{"$f":"SUM(H152:H160)","v":61.66}]
[null,"TOTAL",{"$nulls":5},{"$f":"H161/E161","v":61.66},"OK"]
[null,"BDI                %",{"$nulls":5},{"$f":"1+$M$1","v":1.2149000000000001}]
[null,"TOTAL DO SERVIÇO - R$",{"$nulls":5},{"$f":"H162*H163","v":74.910734000000005}]
[]
[10,"CODEVASF",null,null," COMPOSIÇÃO DE PREÇO UNITÁRIO",null,null,null,{"$f":"H175","v":0.73},{"$f":"H177","v":0.88687700000000003}]
[null,"OBRA:  ",{"$f":"$C$2","v":"PAVIMENTAÇÃO EM BLOQUETE SEXTAVADOS - RUA BOM JARDIM (BAIRRO SANTO ANTÔNIO) - SERRO/MG (ITEM 2)"},null,null,null,"DATA: ",{"$f":"$H$2","v":"OUTUBRO/2023"}]
[null,"SERVIÇO:  ",{"$f":"VLOOKUP(A166,ORÇAMENTO!$A$10:$I$26,3)","v":"TRANSPORTE COM CAMINHÃO BASCULANTE, EM VIA URBANA PAVIMENTADA"},null,"SINAPI",{"$f":"VLOOKUP(A166,ORÇAMENTO!$A$10:$I$26,4)","v":95427},"UNIDADE: ",{"$f":"VLOOKUP(A166,ORÇAMENTO!$A$10:$I$26,5)","v":"M3XKM"}]
[]
[null,"TIPO ITEM","CODIGO ITEM","DESCRIÇÃO ITEM","UNIDADE ITEM","COEFICIENTE","PRECO UNITARIO","CUSTO TOTAL"]
[null,"COMPOSICAO",89883,"CAMINHÃO BASCULANTE 18 M3, COM CAVALO MECÂNICO DE CAPACIDADE MÁXIMA DE TRAÇÃO COMBINADO DE 45000 KG, POTÊNCIA 330 CV, INCLUSIVE SEMIREBOQUE COM CAÇAMBA METÁLICA","CHP","0,0019000","348,45",{"$f":"ROUNDDOWN(F171*G171,2)","v":0.66}]
[null,"COMPOSICAO",89884,"CAMINHÃO BASCULANTE 18 M3, COM CAVALO MECÂNICO DE CAPACIDADE MÁXIMA DE TRAÇÃO COMBINADO DE 45000 KG, POTÊNCIA 330 CV, INCLUSIVE SEMIREBOQUE COM CAÇAMBA METÁLICA","CHI","0,0008000","93,65",{"$f":"ROUNDDOWN(F172*G172,2)","v":7.0000000000000007E-2}]
[{"$nulls":7},{"$f":"F173*G173","v":0}]
[null,"PRODUÇÃO DA EQUIPE",null,null,1,"CUSTO ",null,{"$f":"SUM(H171:H173)","v":0.73}]
[null,"TOTAL",{"$nulls":5},{"$f":"H174/E174","v":0.73},"OK"]
[null,"BDI                %",{"$nulls":5},{"$f":"1+$M$1","v":1.2149000000000001}]
[null,"TOTAL DO SERVIÇO - R$",{"$nulls":5},{"$f":"H175*H176","v":0.88687700000000003}]
[]
[11,"CODEVASF",null,null," COMPOSIÇÃO DE PREÇO UNITÁRIO",null,null,null,{"$f":"H188","v":0.84},{"$f":"H190","v":1.020516}]
[null,"OBRA:  ",{"$f":"$C$2","v":"PAVIMENTAÇÃO EM BLOQUETE SEXTAVADOS - RUA BOM JARDIM (BAIRRO SANTO ANTÔNIO) - SERRO/MG (ITEM 2)"},null,null,null,"DATA: ",{"$f":"$H$2","v":"OUTUBRO/2023"}]
[null,"SERVIÇO:  ","TRANSPORTE COM CAMINHÃO CARROCERIA 9T, EM VIA URBANA PAVIMENTADA",null,"SINAPI",{"$f":"VLOOKUP(A179,ORÇAMENTO!$A$10:$I$26,4)","v":100948},"UNIDADE: ",{"$f":"VLOOKUP(A179,ORÇAMENTO!$A$10:$I$26,5)","v":"TXKM"}]
[]
[null,"TIPO ITEM","CODIGO ITEM","DESCRIÇÃO ITEM","UNIDADE ITEM","COEFICIENTE","PRECO UNITARIO","CUSTO TOTAL"]
[null,"COMPOSICAO",5824,"CAMINHÃO TOCO, PBT 16.000 KG, CARGA ÚTIL MÁX. 10.685 KG, DIST. ENTRE EIXOS 4,8 M, POTÊNCIA 189 CV, INCLUSIVE CARROCERIA FIXA ABERTA DE MADEIRA P/ TRANSPORTE GERAL DE CARGA SECA","CHP","0,0037000","202,74",{"$f":"ROUNDDOWN(F184*G184,2)","v":0.75}]
[null,"COMPOSICAO",5826,"CAMINHÃO TOCO, PBT 16.000 KG, CARGA ÚTIL MÁX. 10.685 KG, DIST. ENTRE EIXOS 4,8 M, POTÊNCIA 189 CV, INCLUSIVE CARROCERIA FIXA ABERTA DE MADEIRA P/ TRANSPORTE GERAL DE CARGA SECA","CHI","0,0016000","60,95",{"$f":"ROUNDDOWN(F185*G185,2)","v":0.09}]
[{"$nulls":7},{"$f":"F186*G186","v":0}]
[null,"PRODUÇÃO DA EQUIPE",null,null,1,"CUSTO ",null,{"$f":"SUM(H184:H186)","v":0.84}]
[null,"TOTAL",{"$nulls":5},{"$f":"H187/E187","v":0.84},"OK"]
[null,"BDI                %",{"$nulls":5},{"$f":"1+$M$1","v":1.2149000000000001}]
[null,"TOTAL DO SERVIÇO - R$",{"$nulls":5},{"$f":"H188*H189","v":1.020516}]
[]
[12,"CODEVASF",null,null," COMPOSIÇÃO DE PREÇO UNITÁRIO",null,null,null,{"$f":"H207","v":773.45},{"$f":"H209","v":939.6644050000001}]
[null,"OBRA:  ",{"$f":"$C$2","v":"PAVIMENTAÇÃO EM BLOQUETE SEXTAVADOS - RUA BOM JARDIM (BAIRRO SANTO ANTÔNIO) - SERRO/MG (ITEM 2)"},null,null,null,"DATA: ",{"$f":"$H$2","v":"OUTUBRO/2023"}]
[null,"SERVIÇO:  ",{"$f":"VLOOKUP(A192,ORÇAMENTO!$A$10:$I$26,3)","v":"EXECUÇÃO DE PASSEIO (CALÇADA) OU PISO DE CONCRETO COM CONCRETO MOLDADO IN LOCO, FEITO EM OBRA, ACABAMENTO CONVENCIONAL, NÃO ARMADO."},null,"SINAPI",{"$f":"VLOOKUP(A192,ORÇAMENTO!$A$10:$I$26,4)","v":94990},"UNIDADE: ",{"$f":"VLOOKUP(A192,ORÇAMENTO!$A$10:$I$48,5)","v":"M3"}]
[]
[null,"TIPO ITEM","CODIGO ITEM","DESCRIÇÃO ITEM","UNIDADE ITEM","COEFICIENTE","PRECO UNITARIO","CUSTO TOTAL"]
[null,"INSUMO",2692,"DESMOLDANTE PROTETOR PARA FORMAS DE MADEIRA, DE BASE OLEOSA EMULSIONADA EM AGUA","L","0,0213000","5,92",{"$f":"ROUNDDOWN(F197*G197,2)","v":0.12}]
[null,"INSUMO",4509,"SARRAFO *2,5 X 10* CM EM PINUS, MISTA OU EQUIVALENTE DA REGIAO - BRUTA","M","3,1250000","4,41",{"$f":"ROUNDDOWN(F198*G198,2)","v":13.78}]
[null,"INSUMO",4517,"SARRAFO *2,5 X 7,5* CM EM PINUS, MISTA OU EQUIVALENTE DA REGIAO - BRUTA","M","2,5000000","3,04",7.6]
[null,"INSUMO",5068,"PREGO DE ACO POLIDO COM CABECA 17 X 21 (2 X 11)","KG","0,2994000","19,23",5.75]
[null,"COMPOSICAO",88262,"CARPINTEIRO DE FORMAS COM ENCARGOS COMPLEMENTARES","H","1,6268000","27,05",44]
[null,"COMPOSICAO",88309,"PEDREIRO COM ENCARGOS COMPLEMENTARES","H","1,4149000","27,45",38.83]
[null,"COMPOSICAO",88316,"SERVENTE COM ENCARGOS COMPLEMENTARES","H","3,0417000","19,76",60.1]
[null,"COMPOSICAO",94964,"CONCRETO FCK = 20MPA, TRAÇO 1:2,7:3 (EM MASSA SECA DE CIMENTO/ AREIA MÉDIA/ BRITA 1) - PREPARO MECÂNICO COM BETONEIRA 400 L.","M3","1,2315000","489,87",603.27]
[]
[null,"PRODUÇÃO DA EQUIPE",null,null,1,"CUSTO ",null,{"$f":"SUM(H197:H205)","v":773.45}]
[null,"TOTAL",{"$nulls":5},{"$f":"H206/E206","v":773.45},"OK"]
[null,"BDI                %",{"$nulls":5},{"$f":"1+$M$1","v":1.2149000000000001}]
[null,"TOTAL DO SERVIÇO - R$",{"$nulls":5},{"$f":"H207*H208","v":939.6644050000001}]
[]
[13,"CODEVASF",null,null," COMPOSIÇÃO DE PREÇO UNITÁRIO",null,null,null,{"$f":"H226","v":47.749999999999993},{"$f":"H228","v":58.011474999999997}]
[null,"OBRA:  ",{"$f":"$C$2","v":"PAVIMENTAÇÃO EM BLOQUETE SEXTAVADOS - RUA BOM JARDIM (BAIRRO SANTO ANTÔNIO) - SERRO/MG (ITEM 2)"},null,null,null,"DATA: ",{"$f":"$H$2","v":"OUTUBRO/2023"}]
[null,"SERVIÇO:  ",{"$f":"VLOOKUP(A211,ORÇAMENTO!$A$10:$I$26,3)","v":"GUIA (MEIO-FIO) E SARJETA CONJUGADOS DE CONCRETO, MOLDADA  IN LOCO  EM TRECHO RETO COM EXTRUSORA, 45 CM BASE (15 CM BASE DA GUIA + SARJETA (30 X 0,05))X 22 CM ALTURA"},null,"SINAPI",{"$f":"VLOOKUP(A211,ORÇAMENTO!$A$10:$I$26,4)","v":94267},"UNIDADE: ",{"$f":"VLOOKUP(A211,ORÇAMENTO!$A$10:$I$48,5)","v":"M"}]
[]
[null,"TIPO ITEM","CODIGO ITEM","DESCRIÇÃO ITEM","UNIDADE ITEM","COEFICIENTE","PRECO UNITARIO","CUSTO TOTAL"]
[null,"INSUMO",370,"AREIA MEDIA - POSTO JAZIDA/FORNECEDOR (RETIRADO NA JAZIDA, SEM TRANSPORTE)","M3","0,0150000",90,{"$f":"ROUNDDOWN(F216*G216,2)","v":1.35}]
[null,"INSUMO","34492a","CONCRETO USINADO BOMBEAVEL, CLASSE DE RESISTENCIA C20, COM BRITA 0 E 1, SLUMP = 100 +/- 20 MM","M3",{"$f":"(0.15+0.13)*0.22 /2 + (0.3 *0.05)","v":4.5800000000000007E-2},"550,00",25.19]
[null,"COMPOSICAO",88243,"AJUDANTE ESPECIALIZADO COM ENCARGOS COMPLEMENTARES","H","0,1090000","21,76",2.37]
[null,"COMPOSICAO",88309,"PEDREIRO COM ENCARGOS COMPLEMENTARES","H","0,2440000","27,45",6.69]
[null,"COMPOSICAO",88316,"SERVENTE COM ENCARGOS COMPLEMENTARES","H","0,4870000","19,76",9.6199999999999992]
[null,"COMPOSICAO",88631,"ARGAMASSA TRAÇO 1:4 (EM VOLUME DE CIMENTO E AREIA MÉDIA ÚMIDA), PREPARO MANUAL","M3","0,0030000","575,87",1.72]
[null,"COMPOSICAO",92960,"MÁQUINA EXTRUSORA DE CONCRETO PARA GUIAS E SARJETAS, MOTOR A DIESEL, POTÊNCIA 14 CV","CHP","0,0180000","18,46",0.33]
[null,"COMPOSICAO",92961,"MÁQUINA EXTRUSORA DE CONCRETO PARA GUIAS E SARJETAS, MOTOR A DIESEL, POTÊNCIA 14 CV","CHI","0,0910000","5,38",0.48]
[]
[null,"PRODUÇÃO DA EQUIPE",null,null,1,"CUSTO ",null,{"$f":"SUM(H216:H224)","v":47.749999999999993}]
[null,"TOTAL",{"$nulls":5},{"$f":"H225/E225","v":47.749999999999993},"OK"]
[null,"BDI                %",{"$nulls":5},{"$f":"1+$M$1","v":1.2149000000000001}]
[null,"TOTAL DO SERVIÇO - R$",{"$nulls":5},{"$f":"H226*H227","v":58.011474999999997}]
[]
[14,"CODEVASF",null,null," COMPOSIÇÃO DE PREÇO UNITÁRIO",null,null,null,{"$f":"H245","v":35.590000000000003},{"$f":"H247","v":43.238291000000011}]
[null,"OBRA:  ",{"$f":"$C$2","v":"PAVIMENTAÇÃO EM BLOQUETE SEXTAVADOS - RUA BOM JARDIM (BAIRRO SANTO ANTÔNIO) - SERRO/MG (ITEM 2)"},null,null,null,"DATA: ",{"$f":"$H$2","v":"OUTUBRO/2023"}]
[null,"SERVIÇO:  ",{"$f":"VLOOKUP(A230,ORÇAMENTO!$A$10:$I$47,3)","v":"GUIA (MEIO-FIO) CONCRETO, MOLDADA IN LOCO EM TRECHO RETO COM EXTRUSORA, 13 CM BASE X 22 CM ALTURA - PARA TRAVAMENTO"},null,"SINAPI",{"$f":"VLOOKUP(A230,ORÇAMENTO!$A$10:$I$47,4)","v":94263},"UNIDADE: ",{"$f":"VLOOKUP(A230,ORÇAMENTO!$A$10:$I$48,5)","v":"M"}]
[]
[null,"TIPO ITEM","CODIGO ITEM","DESCRIÇÃO ITEM","UNIDADE ITEM","COEFICIENTE","PRECO UNITARIO","CUSTO TOTAL"]
[null,"INSUMO",370,"AREIA MEDIA - POSTO JAZIDA/FORNECEDOR (RETIRADO NA JAZIDA, SEM TRANSPORTE)","M3","0,0070000",90,{"$f":"ROUNDDOWN(F235*G235,2)","v":0.63}]
[null,"INSUMO",34492,"CONCRETO USINADO BOMBEAVEL, CLASSE DE RESISTENCIA C20, COM BRITA 0 E 1, SLUMP = 100 +/- 20 MM","M3","0,0300000","550,00",16.5]
[null,"COMPOSICAO",88243,"AJUDANTE ESPECIALIZADO COM ENCARGOS COMPLEMENTARES","H","0,0870000","21,76",1.89]
[null,"COMPOSICAO",88309,"PEDREIRO COM ENCARGOS COMPLEMENTARES","H","0,2210000","27,45",6.06]
[null,"COMPOSICAO",88316,"SERVENTE COM ENCARGOS COMPLEMENTARES","H","0,4420000","19,76",8.73]
[null,"COMPOSICAO",88631,"ARGAMASSA TRAÇO 1:4 (EM VOLUME DE CIMENTO E AREIA MÉDIA ÚMIDA), PREPARO MANUAL","M3","0,0020000","575,87",1.1499999999999999]
[null,"COMPOSICAO",92960,"MÁQUINA EXTRUSORA DE CONCRETO PARA GUIAS E SARJETAS, MOTOR A DIESEL, POTÊNCIA 14 CV","CHP","0,0140000","18,46",0.25]
[null,"COMPOSICAO",92961,"MÁQUINA EXTRUSORA DE CONCRETO PARA GUIAS E SARJETAS, MOTOR A DIESEL, POTÊNCIA 14 CV","CHI","0,0720000","5,38",0.38]
[]
[null,"PRODUÇÃO DA EQUIPE",null,null,1,"CUSTO ",null,{"$f":"SUM(H235:H243)","v":35.590000000000003}]
[null,"TOTAL",{"$nulls":5},{"$f":"H244/E244","v":35.590000000000003},"OK"]
[null,"BDI                %",{"$nulls":5},{"$f":"1+$M$1","v":1.2149000000000001}]
[null,"TOTAL DO SERVIÇO - R$",{"$nulls":5},{"$f":"H245*H246","v":43.238291000000011}]
[]
[15,"CODEVASF",null,null," COMPOSIÇÃO DE PREÇO UNITÁRIO",null,null,null,{"$f":"H264","v":5.92},{"$f":"H266","v":7.1922080000000008}]
[null,"OBRA:  ",{"$f":"$C$2","v":"PAVIMENTAÇÃO EM BLOQUETE SEXTAVADOS - RUA BOM JARDIM (BAIRRO SANTO ANTÔNIO) - SERRO/MG (ITEM 2)"},null,null,null,"DATA: ",{"$f":"$H$2","v":"OUTUBRO/2023"}]
[null,"SERVIÇO:  ",{"$f":"VLOOKUP(A249,ORÇAMENTO!$A$10:$I$47,3)","v":"LOCAÇÃO DE REDE DE ÁGUA OU ESGOTO"},null,"SINAPI",{"$f":"VLOOKUP(A249,ORÇAMENTO!$A$10:$I$47,4)","v":99063},"UNIDADE: ",{"$f":"VLOOKUP(A249,ORÇAMENTO!$A$10:$I$48,5)","v":"M"}]
[]
[null,"TIPO ITEM","CODIGO ITEM","DESCRIÇÃO ITEM","UNIDADE ITEM","COEFICIENTE","PRECO UNITARIO","CUSTO TOTAL"]
[null,"INSUMO","4433","CAIBRO NAO APARELHADO *6 X 6* CM, EM MACARANDUBA OU EQUIV. REGIAO - BRUTA","M",{"$f":"0.05*1.1","v":5.5000000000000007E-2},"40,97",{"$f":"ROUNDDOWN(F254*G254,2)","v":2.25}]
[null,"INSUMO","5068","PREGO DE ACO POLIDO COM CABECA 17 X 21 ","KG",{"$f":"0.05*0.0452","v":2.2599999999999999E-3},"19,23",0.04]
[null,"INSUMO","10567","TABUA *2,5 X 23* CM EM PINUS, MISTA OU EQUIVALENTE DA REGIAO - BRUTA","M",{"$f":"0.05*0.8663","v":4.3314999999999999E-2},"9,83",0.42]
[null,"COMPOSICAO","88239","AJUDANTE DE CARPINTEIRO COM ENCARGOS COMPLEMENTARES","H",{"$f":"0.05*0.8044","v":4.0220000000000006E-2},"21,78",0.87]
[null,"COMPOSICAO","88262","CARPINTEIRO DE FORMAS COM ENCARGOS COMPLEMENTARES","H",{"$f":"0.05*1.6088","v":8.0440000000000011E-2},"27,05",2.17]
[null,"COMPOSICAO","91692","SERRA CIRCULAR DE BANCADA COM MOTOR ELÉTRICO POTÊNCIA DE 5HP, COM COIFA","CHP",{"$f":"0.05*0.0066","v":3.3E-4},"35,12",0.01]
[null,"COMPOSICAO","91693","SERRA CIRCULAR DE BANCADA COM MOTOR ELÉTRICO POTÊNCIA DE 5HP, COM COIFA","CHI",{"$f":"0.05*0.0289","v":1.4450000000000001E-3},"33,81",0.04]
[null,"COMPOSICAO","99062","MARCAÇÃO DE PONTOS EM GABARITO OU CAVALETE","UN",{"$f":"0.05*1","v":0.05},"2,50",0.12]
[]
[null,"PRODUÇÃO DA EQUIPE",null,null,1,"CUSTO ",null,{"$f":"SUM(H254:H262)","v":5.92}]
[null,"TOTAL",{"$nulls":5},{"$f":"H263/E263","v":5.92},"OK"]
[null,"BDI                %",{"$nulls":5},{"$f":"1+$M$1","v":1.2149000000000001}]
[null,"TOTAL DO SERVIÇO - R$",{"$nulls":5},{"$f":"H264*H265","v":7.1922080000000008}]
[]
[16,"CODEVASF",null,null," COMPOSIÇÃO DE PREÇO UNITÁRIO",null,null,null,{"$f":"H278","v":9.34},{"$f":"H280","v":11.347166000000001}]
[null,"OBRA:  ",{"$f":"$C$2","v":"PAVIMENTAÇÃO EM BLOQUETE SEXTAVADOS - RUA BOM JARDIM (BAIRRO SANTO ANTÔNIO) - SERRO/MG (ITEM 2)"},null,null,null,"DATA: ",{"$f":"$H$2","v":"OUTUBRO/2023"}]
[null,"SERVIÇO:  ",{"$f":"VLOOKUP(A268,ORÇAMENTO!$A$10:$I$47,3)","v":"ESCAVAÇÃO MECANIZADA DE VALA COM PROFUNDIDADE ATÉ 1,5 M, EM SOLO DE 1A CATEGORIA"},null,"SINAPI",{"$f":"VLOOKUP(A268,ORÇAMENTO!$A$10:$I$47,4)","v":90105},"UNIDADE: ",{"$f":"VLOOKUP(A268,ORÇAMENTO!$A$10:$I$48,5)","v":"M3"}]
[]
[null,"TIPO ITEM","CODIGO ITEM","DESCRIÇÃO ITEM","UNIDADE ITEM","COEFICIENTE","PRECO UNITARIO","CUSTO TOTAL"]
[null,"COMPOSICAO","5678","RETROESCAVADEIRA SOBRE RODAS COM CARREGADEIRA, TRAÇÃO 4X4, POTÊNCIA LÍQ. 88 HP, CAÇAMBA CARREG. CAP. MÍN. 1 M3, CAÇAMBA RETRO CAP. 0,26 M3, PESO OPERACIONAL MÍN. 6.674 KG, PROFUNDIDADE ESCAVAÇÃO MÁX. 4,37 M","CHP",3.2399999999999998E-2,"155,17",{"$f":"ROUNDDOWN(F273*G273,2)","v":5.0199999999999996}]
[null,"COMPOSICAO","5679","RETROESCAVADEIRA SOBRE RODAS COM CARREGADEIRA, TRAÇÃO 4X4, POTÊNCIA LÍQ. 88 HP, CAÇAMBA CARREG. CAP. MÍN. 1 M3, CAÇAMBA RETRO CAP. 0,26 M3, PESO OPERACIONAL MÍN. 6.674 KG, PROFUNDIDADE ESCAVAÇÃO MÁX. 4,37 M","CHI",3.9199999999999999E-2,"74,35",2.91]
[null,"COMPOSICAO","88316","SERVENTE COM ENCARGOS COMPLEMENTARES","H",7.17E-2,"19,76",1.41]
[]
[null,"PRODUÇÃO DA EQUIPE",null,null,1,"CUSTO ",null,{"$f":"SUM(H273:H276)","v":9.34}]
[null,"TOTAL",{"$nulls":5},{"$f":"H277/E277","v":9.34},"OK"]
[null,"BDI                %",{"$nulls":5},{"$f":"1+$M$1","v":1.2149000000000001}]
[null,"TOTAL DO SERVIÇO - R$",{"$nulls":5},{"$f":"H278*H279","v":11.347166000000001}]
[]
[17,"CODEVASF",null,null," COMPOSIÇÃO DE PREÇO UNITÁRIO",null,null,null,{"$f":"H294","v":59.33},{"$f":"H296","v":72.080016999999998}]
[null,"OBRA:  ",{"$f":"$C$2","v":"PAVIMENTAÇÃO EM BLOQUETE SEXTAVADOS - RUA BOM JARDIM (BAIRRO SANTO ANTÔNIO) - SERRO/MG (ITEM 2)"},null,null,null,"DATA: ",{"$f":"$H$2","v":"OUTUBRO/2023"}]
[null,"SERVIÇO:  ",{"$f":"VLOOKUP(A282,ORÇAMENTO!$A$10:$I$47,3)","v":"PREPARO DE FUNDO DE VALA COM LARGURA MENOR QUE 1,5 M (ACERTO DO SOLO NATURAL), INCLUSIVE LASTRO DE CONCRETO MAGRO PARA BERÇO"},null,"SINAPI",{"$f":"VLOOKUP(A282,ORÇAMENTO!$A$10:$I$47,4)","v":"101616+\n95240"},"UNIDADE: ",{"$f":"VLOOKUP(A282,ORÇAMENTO!$A$10:$I$48,5)","v":"M2"}]
[]
[null,"TIPO ITEM","CODIGO ITEM","DESCRIÇÃO ITEM","UNIDADE ITEM","COEFICIENTE","PRECO UNITARIO","CUSTO TOTAL"]
[null,"COMPOSICAO","88309","PEDREIRO COM ENCARGOS COMPLEMENTARES","H",{"$f":"0.1631+0.102","v":0.2651},"27,45",{"$f":"ROUNDDOWN(F287*G287,2)","v":7.27}]
[null,"COMPOSICAO","88316","SERVENTE COM ENCARGOS COMPLEMENTARES","H",{"$f":"0.0444+0.1531","v":0.19750000000000001},"19,76",3.9]
[null,"COMPOSICAO","91533","COMPACTADOR DE SOLOS DE PERCUSSÃO (SOQUETE) COM MOTOR A GASOLINA 4 TEMPOS, POTÊNCIA 4 CV","CHP","0,0036000","40,78",0.14000000000000001]
[null,"COMPOSICAO","91534","COMPACTADOR DE SOLOS DE PERCUSSÃO (SOQUETE) COM MOTOR A GASOLINA 4 TEMPOS, POTÊNCIA 4 CV","CHI","0,0036000","34,48",0.12]
[null,"COMPOSICAO","94968","CONCRETO MAGRO PARA LASTRO, TRAÇO 1:4,5:4,5 (EM MASSA SECA DE CIMENTO/ AREIA MÉDIA/ BRITA 1) - PREPARO COM BETONEIRA ","M3",0.12,"399,21",47.9]
[]
[null,"PRODUÇÃO DA EQUIPE",null,null,1,"CUSTO ",null,{"$f":"SUM(H287:H292)","v":59.33}]
[null,"TOTAL",{"$nulls":5},{"$f":"H293/E293","v":59.33},"OK"]
[null,"BDI                %",{"$nulls":5},{"$f":"1+$M$1","v":1.2149000000000001}]
[null,"TOTAL DO SERVIÇO - R$",{"$nulls":5},{"$f":"H294*H295","v":72.080016999999998}]
[]
[18,"CODEVASF",null,null," COMPOSIÇÃO DE PREÇO UNITÁRIO",null,null,null,{"$f":"H310","v":26.27},{"$f":"H312","v":31.915423000000001}]
[null,"OBRA:  ",{"$f":"$C$2","v":"PAVIMENTAÇÃO EM BLOQUETE SEXTAVADOS - RUA BOM JARDIM (BAIRRO SANTO ANTÔNIO) - SERRO/MG (ITEM 2)"},null,null,null,"DATA: ",{"$f":"$H$2","v":"OUTUBRO/2023"}]
[null,"SERVIÇO:  ",{"$f":"VLOOKUP(A298,ORÇAMENTO!$A$10:$I$47,3)","v":"ESCORAMENTO DE VALA, TIPO PONTALETEAMENTO"},null,"SINAPI",{"$f":"VLOOKUP(A298,ORÇAMENTO!$A$10:$I$47,4)","v":101570},"UNIDADE: ",{"$f":"VLOOKUP(A298,ORÇAMENTO!$A$10:$I$48,5)","v":"M2"}]
[]
[null,"TIPO ITEM","CODIGO ITEM","DESCRIÇÃO ITEM","UNIDADE ITEM","COEFICIENTE","PRECO UNITARIO","CUSTO TOTAL"]
[null,"INSUMO","5061","PREGO DE ACO POLIDO COM CABECA 18 X 27 (2 1/2 X 10)","KG","0,0096000","18,90",{"$f":"ROUNDDOWN(F303*G303,2)","v":0.18}]
[null,"INSUMO","6189","TABUA NAO APARELHADA *2,5 X 30* CM, EM MACARANDUBA, ANGELIM OU EQUIVALENTE DA REGIAO - BRUTA","M","0,2173000","43,21",9.3800000000000008]
[null,"INSUMO","21138","MOURAO ROLICO DE MADEIRA TRATADA, D = 8 A 11 CM, H = 2,20 M, EM EUCALIPTO OU EQUIVALENTE DA REGIAO (PARA CERCA)","M","0,0543000","7,82",0.42]
[null,"COMPOSICAO","88262","CARPINTEIRO DE FORMAS COM ENCARGOS COMPLEMENTARES","H","0,4591000","27,05",12.41]
[null,"COMPOSICAO","88316","SERVENTE COM ENCARGOS COMPLEMENTARES","H","0,1967000","19,76",3.88]
[]
[null,"PRODUÇÃO DA EQUIPE",null,null,1,"CUSTO ",null,{"$f":"SUM(H303:H308)","v":26.27}]
[null,"TOTAL",{"$nulls":5},{"$f":"H309/E309","v":26.27},"OK"]
[null,"BDI                %",{"$nulls":5},{"$f":"1+$M$1","v":1.2149000000000001}]
[null,"TOTAL DO SERVIÇO - R$",{"$nulls":5},{"$f":"H310*H311","v":31.915423000000001}]
[]
[19,"CODEVASF",null,null," COMPOSIÇÃO DE PREÇO UNITÁRIO",null,null,null,{"$f":"H327","v":186.66999999999996},{"$f":"H329","v":226.78538299999997}]
[null,"OBRA:  ",{"$f":"$C$2","v":"PAVIMENTAÇÃO EM BLOQUETE SEXTAVADOS - RUA BOM JARDIM (BAIRRO SANTO ANTÔNIO) - SERRO/MG (ITEM 2)"},null,null,null,"DATA: ",{"$f":"$H$2","v":"OUTUBRO/2023"}]
[null,"SERVIÇO:  ",{"$f":"VLOOKUP(A314,ORÇAMENTO!$A$10:$I$47,3)","v":"TUBO DE CONCRETO PARA REDES COLETORAS DE ÁGUAS PLUVIAIS, DIÂMETRO DE 400 MM, JUNTA RÍGIDA - FORNECIMENTO E ASSENTAMENTO"},null,"SINAPI",{"$f":"VLOOKUP(A314,ORÇAMENTO!$A$10:$I$47,4)","v":92210},"UNIDADE: ",{"$f":"VLOOKUP(A314,ORÇAMENTO!$A$10:$I$48,5)","v":"M"}]
[]
[null,"TIPO ITEM","CODIGO ITEM","DESCRIÇÃO ITEM","UNIDADE ITEM","COEFICIENTE","PRECO UNITARIO","CUSTO TOTAL"]
[null,"COMPOSICAO",5678,"RETROESCAVADEIRA SOBRE RODAS COM CARREGADEIRA, TRAÇÃO 4X4, POTÊNCIA LÍQ. 88 HP, CAÇAMBA CARREG. CAP. MÍN. 1 M3, CAÇAMBA RETRO CAP. 0,26 M3","CHP","0,0740000","155,17",{"$f":"ROUNDDOWN(F319*G319,2)","v":11.48}]
[null,"COMPOSICAO",5679,"RETROESCAVADEIRA SOBRE RODAS COM CARREGADEIRA, TRAÇÃO 4X4, POTÊNCIA LÍQ. 88 HP, CAÇAMBA CARREG. CAP. MÍN. 1 M3, CAÇAMBA RETRO CAP. 0,26 M3","CHI","0,1550000","74,35",11.52]
[null,"INSUMO","7745","TUBO DE CONCRETO ARMADO PARA AGUAS PLUVIAIS, CLASSE PA-1, COM ENCAIXE PONTA E BOLSA, DIAMETRO NOMINAL DE 400 MM","M","1,0300000",133.57,137.57]
[null,"COMPOSICAO","88246","ASSENTADOR DE TUBOS COM ENCARGOS COMPLEMENTARES","H","0,3460000","32,20",11.14]
[null,"COMPOSICAO","88316","SERVENTE COM ENCARGOS COMPLEMENTARES","H","0,6920000","19,76",13.67]
[null,"COMPOSICAO",88629,"ARGAMASSA TRAÇO 1:3 (EM VOLUME DE CIMENTO E AREIA MÉDIA ÚMIDA), PREPARO MANUAL","M3","0,0020000","645,53",1.29]
[]
[null,"PRODUÇÃO DA EQUIPE",null,null,1,"CUSTO ",null,{"$f":"SUM(H319:H325)","v":186.66999999999996}]
[null,"TOTAL",{"$nulls":5},{"$f":"H326/E326","v":186.66999999999996},"OK"]
[null,"BDI                %",{"$nulls":5},{"$f":"1+$M$1","v":1.2149000000000001}]
[null,"TOTAL DO SERVIÇO - R$",{"$nulls":5},{"$f":"H327*H328","v":226.78538299999997}]
[]
[20,"CODEVASF",null,null," COMPOSIÇÃO DE PREÇO UNITÁRIO",null,null,null,{"$f":"H344","v":337.5100000000001},{"$f":"H346","v":410.04089900000014}]
[null,"OBRA:  ",{"$f":"$C$2","v":"PAVIMENTAÇÃO EM BLOQUETE SEXTAVADOS - RUA BOM JARDIM (BAIRRO SANTO ANTÔNIO) - SERRO/MG (ITEM 2)"},null,null,null,"DATA: ",{"$f":"$H$2","v":"OUTUBRO/2023"}]
[null,"SERVIÇO:  ",{"$f":"VLOOKUP(A331,ORÇAMENTO!$A$10:$I$47,3)","v":"TUBO DE CONCRETO PARA REDES COLETORAS DE ÁGUAS PLUVIAIS, DIÂMETRO DE 600 MM, JUNTA RÍGIDA - FORNECIMENTO E ASSENTAMENTO"},null,"SINAPI",{"$f":"VLOOKUP(A331,ORÇAMENTO!$A$10:$I$47,4)","v":92212},"UNIDADE: ",{"$f":"VLOOKUP(A331,ORÇAMENTO!$A$10:$I$48,5)","v":"M"}]
[]
[null,"TIPO ITEM","CODIGO ITEM","DESCRIÇÃO ITEM","UNIDADE ITEM","COEFICIENTE","PRECO UNITARIO","CUSTO TOTAL"]
[null,"COMPOSICAO",5678,"RETROESCAVADEIRA SOBRE RODAS COM CARREGADEIRA, TRAÇÃO 4X4, POTÊNCIA LÍQ. 88 HP, CAÇAMBA CARREG. CAP. MÍN. 1 M3, CAÇAMBA RETRO CAP. 0,26 M3","CHP","0,1050000","155,17",{"$f":"ROUNDDOWN(F336*G336,2)","v":16.29}]
[null,"COMPOSICAO",5679,"RETROESCAVADEIRA SOBRE RODAS COM CARREGADEIRA, TRAÇÃO 4X4, POTÊNCIA LÍQ. 88 HP, CAÇAMBA CARREG. CAP. MÍN. 1 M3, CAÇAMBA RETRO CAP. 0,26 M3","CHI","0,2210000","74,35",16.43]
[null,"INSUMO","7745","TUBO DE CONCRETO ARMADO PARA AGUAS PLUVIAIS, CLASSE PA-1, COM ENCAIXE PONTA E BOLSA, DIAMETRO NOMINAL DE 400 MM","M","1,0300000",258.47000000000003,266.22000000000003]
[null,"COMPOSICAO","88246","ASSENTADOR DE TUBOS COM ENCARGOS COMPLEMENTARES","H","0,4930000","32,20",15.87]
[null,"COMPOSICAO","88316","SERVENTE COM ENCARGOS COMPLEMENTARES","H","0,9860000","19,76",19.48]
[null,"COMPOSICAO",88629,"ARGAMASSA TRAÇO 1:3 (EM VOLUME DE CIMENTO E AREIA MÉDIA ÚMIDA), PREPARO MANUAL","M3","0,0050000","645,53",3.22]
[]
[null,"PRODUÇÃO DA EQUIPE",null,null,1,"CUSTO ",null,{"$f":"SUM(H336:H342)","v":337.5100000000001}]
[null,"TOTAL",{"$nulls":5},{"$f":"H343/E343","v":337.5100000000001},"OK"]
[null,"BDI                %",{"$nulls":5},{"$f":"1+$M$1","v":1.2149000000000001}]
[null,"TOTAL DO SERVIÇO - R$",{"$nulls":5},{"$f":"H344*H345","v":410.04089900000014}]
[]
[21,"CODEVASF",null,null," COMPOSIÇÃO DE PREÇO UNITÁRIO",null,null,null,{"$f":"H361","v":348.86},{"$f":"H363","v":423.83001400000006}]
[null,"OBRA:  ",{"$f":"$C$2","v":"PAVIMENTAÇÃO EM BLOQUETE SEXTAVADOS - RUA BOM JARDIM (BAIRRO SANTO ANTÔNIO) - SERRO/MG (ITEM 2)"},null,null,null,"DATA: ",{"$f":"$H$2","v":"OUTUBRO/2023"}]
[null,"SERVIÇO:  ",{"$f":"VLOOKUP(A348,ORÇAMENTO!$A$10:$I$47,3)","v":"TUBO DE CONCRETO PARA REDES COLETORAS DE ÁGUAS PLUVIAIS, DIÂMETRO DE 800 MM, JUNTA RÍGIDA - FORNECIMENTO E ASSENTAMENTO"},null,"SINAPI",{"$f":"VLOOKUP(A348,ORÇAMENTO!$A$10:$I$47,4)","v":92214},"UNIDADE: ",{"$f":"VLOOKUP(A348,ORÇAMENTO!$A$10:$I$48,5)","v":"M"}]
[]
[null,"TIPO ITEM","CODIGO ITEM","DESCRIÇÃO ITEM","UNIDADE ITEM","COEFICIENTE","PRECO UNITARIO","CUSTO TOTAL"]
[null,"COMPOSICAO",5678,"RETROESCAVADEIRA SOBRE RODAS COM CARREGADEIRA, TRAÇÃO 4X4, POTÊNCIA LÍQ. 88 HP, CAÇAMBA CARREG. CAP. MÍN. 1 M3, CAÇAMBA RETRO CAP. 0,26 M3","CHP","0,1200000","155,17",{"$f":"ROUNDDOWN(F353*G353,2)","v":18.62}]
[null,"COMPOSICAO",5679,"RETROESCAVADEIRA SOBRE RODAS COM CARREGADEIRA, TRAÇÃO 4X4, POTÊNCIA LÍQ. 88 HP, CAÇAMBA CARREG. CAP. MÍN. 1 M3, CAÇAMBA RETRO CAP. 0,26 M3","CHI","0,2540000","74,35",18.88]
[null,"INSUMO","7745","TUBO DE CONCRETO ARMADO PARA AGUAS PLUVIAIS, CLASSE PA-1, COM ENCAIXE PONTA E BOLSA, DIAMETRO NOMINAL DE 400 MM","M","1,0300000",258.47000000000003,266.22000000000003]
[null,"COMPOSICAO","88246","ASSENTADOR DE TUBOS COM ENCARGOS COMPLEMENTARES","H","0,5670000","32,20",18.25]
[null,"COMPOSICAO","88316","SERVENTE COM ENCARGOS COMPLEMENTARES","H","1,1330000","19,76",22.38]
[null,"COMPOSICAO",88629,"ARGAMASSA TRAÇO 1:3 (EM VOLUME DE CIMENTO E AREIA MÉDIA ÚMIDA), PREPARO MANUAL","M3","0,0070000","645,53",4.51]
[]
[null,"PRODUÇÃO DA EQUIPE",null,null,1,"CUSTO ",null,{"$f":"SUM(H353:H359)","v":348.86}]
[null,"TOTAL",{"$nulls":5},{"$f":"H360/E360","v":348.86},"OK"]
[null,"BDI                %",{"$nulls":5},{"$f":"1+$M$1","v":1.2149000000000001}]
[null,"TOTAL DO SERVIÇO - R$",{"$nulls":5},{"$f":"H361*H362","v":423.83001400000006}]
[]
[22,"CODEVASF",null,null," COMPOSIÇÃO DE PREÇO UNITÁRIO",null,null,null,{"$f":"H394","v":2438.16},{"$f":"H396","v":2962.1205840000002}]
[null,"OBRA:  ",{"$f":"$C$2","v":"PAVIMENTAÇÃO EM BLOQUETE SEXTAVADOS - RUA BOM JARDIM (BAIRRO SANTO ANTÔNIO) - SERRO/MG (ITEM 2)"},null,null,null,"DATA: ",{"$f":"$H$2","v":"OUTUBRO/2023"}]
[null,"SERVIÇO:  ",{"$f":"VLOOKUP(A365,ORÇAMENTO!$A$10:$I$47,3)","v":"CAIXA PARA BOCA DE LOBO COMBINADA COM GRELHA RETANGULAR, EM ALVENARIA COM BLOCOS DE CONCRETO, DIMENSÕES INTERNAS: 1,3X1X1,2 M."},null,"SINAPI",{"$f":"VLOOKUP(A365,ORÇAMENTO!$A$10:$I$47,4)","v":97961},"UNIDADE: ",{"$f":"VLOOKUP(A365,ORÇAMENTO!$A$10:$I$48,5)","v":"UNID."}]
[]
[null,"TIPO ITEM","CODIGO ITEM","DESCRIÇÃO ITEM","UNIDADE ITEM","COEFICIENTE","PRECO UNITARIO","CUSTO TOTAL"]
[null,"INSUMO","660","CANALETA DE CONCRETO 19 X 19 X 19 CM ","UN","28,3500000","3,02",{"$f":"ROUNDDOWN(F370*G370,2)","v":85.61}]
[null,"INSUMO","2692","DESMOLDANTE PROTETOR PARA FORMAS DE MADEIRA, DE BASE OLEOSA EMULSIONADA EM AGUA","L","0,0105000","5,92",0.06]
[null,"INSUMO","4491","PONTALETE *7,5 X 7,5* CM EM PINUS, MISTA OU EQUIVALENTE DA REGIAO - BRUTA","M","0,2294000","8,69",1.99]
[null,"INSUMO","4517","SARRAFO *2,5 X 7,5* CM EM PINUS, MISTA OU EQUIVALENTE DA REGIAO - BRUTA","M","0,2728000","3,04",0.82]
[null,"INSUMO","5069","PREGO DE ACO POLIDO COM CABECA 17 X 27 ","KG","0,0242000","19,59",0.47]
[null,"COMPOSICAO","5678","RETROESCAVADEIRA SOBRE RODAS COM CARREGADEIRA, TRAÇÃO 4X4, POTÊNCIA LÍQ. 88 HP, CAÇAMBA CARREG. CAP. MÍN. 1 M3, CAÇAMBA RETRO CAP. 0,26 M3, PESO OPERACIONAL MÍN. 6.674 KG, PROFUNDIDADE ESCAVAÇÃO MÁX. 4,37 M","CHP","0,0528000","155,17",8.19]
[null,"COMPOSICAO","5679","RETROESCAVADEIRA SOBRE RODAS COM CARREGADEIRA, TRAÇÃO 4X4, POTÊNCIA LÍQ. 88 HP, CAÇAMBA CARREG. CAP. MÍN. 1 M3, CAÇAMBA RETRO CAP. 0,26 M3, PESO OPERACIONAL MÍN. 6.674 KG, PROFUNDIDADE ESCAVAÇÃO MÁX. 4,37 M","CHI","0,1075000","74,35",7.99]
[null,"INSUMO","6193","TABUA NAO APARELHADA *2,5 X 20* CM, EM MACARANDUBA/MASSARANDUBA, ANGELIM OU EQUIVALENTE DA REGIAO - BRUTA","M","0,8556000","29,60",25.32]
[null,"INSUMO","25067","BLOCO DE CONCRETO ESTRUTURAL 19 X 19 X 39 CM","UN","61,8757000","4,87",301.33]
[null,"INSUMO","43386","MEIO-FIO OU GUIA DE CONCRETO PRE-MOLDADO, TIPO CHAPEU PARA BOCA DE LOBO,  DIMENSOES *1,20* X 0,15 X 0,30 M","UN","1,0000000","71,11",71.11]
[null,"INSUMO","43440","CONJUNTO PRE-MOLDADO COMPOSTO POR GRELHA (0,99 X 0,45 M), QUADRO (1,10 X 0,52 M) E CANTONEIRA (1,10 X 0,35 M), EM CONCRETO ARMADO, COM FCK DE 21 MPA","UN","1,0000000","524,54",524.54]
[null,"COMPOSICAO","87316","ARGAMASSA TRAÇO 1:4 (EM VOLUME DE CIMENTO E AREIA GROSSA ÚMIDA) PARA CHAPISCO CONVENCIONAL","M3","0,0588000","503,10",29.58]
[null,"COMPOSICAO","88309","PEDREIRO COM ENCARGOS COMPLEMENTARES","H","13,8543000","27,45",380.3]
[null,"COMPOSICAO","88316","SERVENTE COM ENCARGOS COMPLEMENTARES","H","10,8855000","19,76",215.09]
[null,"COMPOSICAO","88628","ARGAMASSA TRAÇO 1:3 (EM VOLUME DE CIMENTO E AREIA MÉDIA ÚMIDA)","M3","0,5972000","578,37",345.4]
[null,"COMPOSICAO","89993","GRAUTEAMENTO VERTICAL EM ALVENARIA ESTRUTURAL","M3","0,0299000","1.035,54",30.96]
[null,"COMPOSICAO","89995","GRAUTEAMENTO DE CINTA SUPERIOR OU DE VERGA EM ALVENARIA ESTRUTURAL","M3","0,0831000","999,68",83.07]
[null,"COMPOSICAO","89996","ARMAÇÃO VERTICAL DE ALVENARIA ESTRUTURAL; DIÂMETRO DE 10,0 MM","KG","0,9872000","10,08",9.9499999999999993]
[null,"COMPOSICAO","89998","ARMAÇÃO DE CINTA DE ALVENARIA ESTRUTURAL; DIÂMETRO DE 10,0 MM","KG","3,3318000","9,56",31.85]
[null,"COMPOSICAO","94970","CONCRETO FCK = 20MPA, TRAÇO 1:2,7:3 (EM MASSA SECA DE CIMENTO/ AREIA MÉDIA/ BRITA 1) - PREPARO MECÂNICO COM BETONEIRA 600 L","M3","0,2768000","475,96",131.74]
[null,"COMPOSICAO","97735","PEÇA RETANGULAR PRÉ-MOLDADA, VOLUME DE CONCRETO DE 30 A 100 LITROS, TAXA DE AÇO APROXIMADA DE 30KG/M³","M3","0,0616000","2.379,22",146.55000000000001]
[null,"COMPOSICAO","101617","PREPARO DE FUNDO DE VALA COM LARGURA MAIOR OU IGUAL A 1,5 M E MENOR QUE 2,5 M (ACERTO DO SOLO NATURAL)","M2","2,0800000","3,00",6.24]
[{"$nulls":7},0]
[null,"PRODUÇÃO DA EQUIPE",null,null,1,"CUSTO ",null,{"$f":"SUM(H370:H392)","v":2438.16}]
[null,"TOTAL",{"$nulls":5},{"$f":"H393/E393","v":2438.16},"OK"]
[null,"BDI                %",{"$nulls":5},{"$f":"1+$M$1","v":1.2149000000000001}]
[null,"TOTAL DO SERVIÇO - R$",{"$nulls":5},{"$f":"H394*H395","v":2962.1205840000002}]
[]
[23,"CODEVASF",null,null," COMPOSIÇÃO DE PREÇO UNITÁRIO",null,null,null,{"$f":"H428","v":4583.45},{"$f":"H430","v":5568.4334049999998}]
[null,"OBRA:  ",{"$f":"$C$2","v":"PAVIMENTAÇÃO EM BLOQUETE SEXTAVADOS - RUA BOM JARDIM (BAIRRO SANTO ANTÔNIO) - SERRO/MG (ITEM 2)"},null,null,null,"DATA: ",{"$f":"$H$2","v":"OUTUBRO/2023"}]
[null,"SERVIÇO:  ",{"$f":"VLOOKUP(A398,ORÇAMENTO!$A$10:$I$47,3)","v":"CAIXA PARA BOCA DE LOBO DUPLA COMBINADA COM GRELHA RETANGULAR, EM ALVENARIA COM BLOCOS DE CONCRETO, DIMENSÕES INTERNAS: 1,3X2,2X1,2 M"},null,"SINAPI",{"$f":"VLOOKUP(A398,ORÇAMENTO!$A$10:$I$47,4)","v":97973},"UNIDADE: ",{"$f":"VLOOKUP(A398,ORÇAMENTO!$A$10:$I$48,5)","v":"UNID."}]
[]
[null,"TIPO ITEM","CODIGO ITEM","DESCRIÇÃO ITEM","UNIDADE ITEM","COEFICIENTE","PRECO UNITARIO","CUSTO TOTAL"]
[null,"INSUMO","660","CANALETA DE CONCRETO 19 X 19 X 19 CM ","UN","40,9500000","3,02",{"$f":"ROUNDDOWN(F403*G403,2)","v":123.66}]
[null,"INSUMO","2692","DESMOLDANTE PROTETOR PARA FORMAS DE MADEIRA, DE BASE OLEOSA EMULSIONADA EM AGUA","L","0,0146000","5,92",0.08]
[null,"INSUMO","4491","PONTALETE *7,5 X 7,5* CM EM PINUS, MISTA OU EQUIVALENTE DA REGIAO - BRUTA","M","0,3182000","8,69",2.76]
[null,"INSUMO","4517","SARRAFO *2,5 X 7,5* CM EM PINUS, MISTA OU EQUIVALENTE DA REGIAO - BRUTA","M","0,3784000","3,04",1.1499999999999999]
[null,"INSUMO","5069","PREGO DE ACO POLIDO COM CABECA 17 X 27 ","KG","0,0335000","19,59",0.65]
[null,"COMPOSICAO","5678","RETROESCAVADEIRA SOBRE RODAS COM CARREGADEIRA, TRAÇÃO 4X4, POTÊNCIA LÍQ. 88 HP, CAÇAMBA CARREG. CAP. MÍN. 1 M3, CAÇAMBA RETRO CAP. 0,26 M3, PESO OPERACIONAL MÍN. 6.674 KG, PROFUNDIDADE ESCAVAÇÃO MÁX. 4,37 M ","CHP","0,1303000","155,17",20.21]
[null,"COMPOSICAO","5679","RETROESCAVADEIRA SOBRE RODAS COM CARREGADEIRA, TRAÇÃO 4X4, POTÊNCIA LÍQ. 88 HP, CAÇAMBA CARREG. CAP. MÍN. 1 M3, CAÇAMBA RETRO CAP. 0,26 M3, PESO OPERACIONAL MÍN. 6.674 KG, PROFUNDIDADE ESCAVAÇÃO MÁX. 4,37 M ","CHI","0,2656000","74,35",19.739999999999998]
[null,"INSUMO","6193","TABUA NAO APARELHADA *2,5 X 20* CM, EM MACARANDUBA/MASSARANDUBA, ANGELIM OU EQUIVALENTE DA REGIAO - BRUTA","M","1,1868000","29,60",35.119999999999997]
[null,"INSUMO","25067","BLOCO DE CONCRETO ESTRUTURAL 19 X 19 X 39 CM","UN","89,8319000","4,87",437.48]
[null,"INSUMO","43386","MEIO-FIO OU GUIA DE CONCRETO PRE-MOLDADO, TIPO CHAPEU PARA BOCA DE LOBO,  DIMENSOES *1,20* X 0,15 X 0,30 M","UN","2,0000000","71,11",142.22]
[null,"INSUMO","43440","CONJUNTO PRE-MOLDADO COMPOSTO POR GRELHA (0,99 X 0,45 M), QUADRO (1,10 X 0,52 M) E CANTONEIRA (1,10 X 0,35 M), EM CONCRETO ARMADO, COM FCK DE 21 MPA","UN","2,0000000","524,54",1049.08]
[null,"COMPOSICAO","87316","ARGAMASSA TRAÇO 1:4 (EM VOLUME DE CIMENTO E AREIA GROSSA ÚMIDA) PARA CHAPISCO CONVENCIONAL","M3","0,0896000","503,10",45.07]
[null,"COMPOSICAO","88309","PEDREIRO COM ENCARGOS COMPLEMENTARES","H","22,0984000","27,45",606.6]
[null,"COMPOSICAO","88316","SERVENTE COM ENCARGOS COMPLEMENTARES","H","17,3630000","19,76",343.09]
[null,"COMPOSICAO","88628","ARGAMASSA TRAÇO 1:3 (EM VOLUME DE CIMENTO E AREIA MÉDIA ÚMIDA)","M3","1,3110000","578,37",758.24]
[null,"COMPOSICAO","89993","GRAUTEAMENTO VERTICAL EM ALVENARIA ESTRUTURAL","M3","0,0523000","1.035,54",54.15]
[null,"COMPOSICAO","89995","GRAUTEAMENTO DE CINTA SUPERIOR OU DE VERGA EM ALVENARIA ESTRUTURAL","M3","0,1200000","999,68",119.96]
[null,"COMPOSICAO","89996","ARMAÇÃO VERTICAL DE ALVENARIA ESTRUTURAL; DIÂMETRO DE 10,0 MM","KG","1,7276000","10,08",17.41]
[null,"COMPOSICAO","89998","ARMAÇÃO DE CINTA DE ALVENARIA ESTRUTURAL; DIÂMETRO DE 10,0 MM","KG","4,8126000","9,56",46]
[null,"COMPOSICAO","94970","CONCRETO FCK = 20MPA, TRAÇO 1:2,7:3 (EM MASSA SECA DE CIMENTO/ AREIA MÉDIA/ BRITA 1) - PREPARO MECÂNICO COM BETONEIRA 600 L","M3","0,5140000","475,96",244.64]
[null,"COMPOSICAO","97735","PEÇA RETANGULAR PRÉ-MOLDADA, VOLUME DE CONCRETO DE 30 A 100 LITROS, TAXA DE AÇO APROXIMADA DE 30KG/M³","M3","0,1232000","2.379,22",293.11]
[null,"COMPOSICAO","97737","PEÇA RETANGULAR PRÉ-MOLDADA, VOLUME DE CONCRETO DE 30 A 70 LITROS , TAXA DE AÇO APROXIMADA DE 70KG/M³","M3","0,0680000","3.103,52",211.03]
[null,"COMPOSICAO","101617","PREPARO DE FUNDO DE VALA COM LARGURA MAIOR OU IGUAL A 1,5 M E MENOR QUE 2,5 M (ACERTO DO SOLO NATURAL)","M2","4,0000000","3,00",12]
[{"$nulls":7},0]
[null,"PRODUÇÃO DA EQUIPE",null,null,1,"CUSTO ",null,{"$f":"SUM(H403:H426)","v":4583.45}]
[null,"TOTAL",{"$nulls":5},{"$f":"H427/E427","v":4583.45},"OK"]
[null,"BDI                %",{"$nulls":5},{"$f":"1+$M$1","v":1.2149000000000001}]
[null,"TOTAL DO SERVIÇO - R$",{"$nulls":5},{"$f":"H428*H429","v":5568.4334049999998}]
[]
[24,"CODEVASF",null,null," COMPOSIÇÃO DE PREÇO UNITÁRIO",null,null,null,{"$f":"H462","v":2811.2100000000005},{"$f":"H464","v":3415.3390290000007}]
[null,"OBRA:  ",{"$f":"$C$2","v":"PAVIMENTAÇÃO EM BLOQUETE SEXTAVADOS - RUA BOM JARDIM (BAIRRO SANTO ANTÔNIO) - SERRO/MG (ITEM 2)"},null,null,null,"DATA: ",{"$f":"$H$2","v":"OUTUBRO/2023"}]
[null,"SERVIÇO:  ",{"$f":"VLOOKUP(A432,ORÇAMENTO!$A$10:$I$47,3)","v":"POÇO DE VISITA RETANGULAR PARA DRENAGEM, EM ALVENARIA COM BLOCOS DE CONCRETO, DIMENSÕES INTERNAS = 1X1 M, PROFUNDIDADE = 1,40 M, INCLUSIVE TAMPÃO EM FERRO FUNDIDO D = 600MM"},null,"SINAPI",{"$f":"VLOOKUP(A432,ORÇAMENTO!$A$10:$I$47,4)","v":99252},"UNIDADE: ",{"$f":"VLOOKUP(A432,ORÇAMENTO!$A$10:$I$48,5)","v":"UNID."}]
[]
[null,"TIPO ITEM","CODIGO ITEM","DESCRIÇÃO ITEM","UNIDADE ITEM","COEFICIENTE","PRECO UNITARIO","CUSTO TOTAL"]
[null,"INSUMO","660","CANALETA DE CONCRETO 19 X 19 X 19 CM (CLASSE C - NBR 6136)","UN","25,2000000","3,02",{"$f":"ROUNDDOWN(F437*G437,2)","v":76.099999999999994}]
[null,"INSUMO","2692","DESMOLDANTE PROTETOR PARA FORMAS DE MADEIRA, DE BASE OLEOSA EMULSIONADA EM AGUA","L","0,0143000","5,92",0.08]
[null,"INSUMO","4491","PONTALETE *7,5 X 7,5* CM EM PINUS, MISTA OU EQUIVALENTE DA REGIAO - BRUTA","M","0,3108000","8,69",2.7]
[null,"INSUMO","4517","SARRAFO *2,5 X 7,5* CM EM PINUS, MISTA OU EQUIVALENTE DA REGIAO - BRUTA","M","0,3696000","3,04",1.1200000000000001]
[null,"INSUMO","5069","PREGO DE ACO POLIDO COM CABECA 17 X 27 (2 1/2 X 11)","KG","0,0328000","19,59",0.64]
[null,"COMPOSICAO","5678","RETROESCAVADEIRA SOBRE RODAS COM CARREGADEIRA, TRAÇÃO 4X4, POTÊNCIA LÍQ. 88 HP, CAÇAMBA CARREG. CAP. MÍN. 1 M3, CAÇAMBA RETRO CAP. 0,26 M3, PESO OPERACIONAL MÍN. 6.674 KG, PROFUNDIDADE ESCAVAÇÃO MÁX. 4,37 M","CHP","0,0993000","155,17",15.4]
[null,"COMPOSICAO","5679","RETROESCAVADEIRA SOBRE RODAS COM CARREGADEIRA, TRAÇÃO 4X4, POTÊNCIA LÍQ. 88 HP, CAÇAMBA CARREG. CAP. MÍN. 1 M3, CAÇAMBA RETRO CAP. 0,26 M3, PESO OPERACIONAL MÍN. 6.674 KG, PROFUNDIDADE ESCAVAÇÃO MÁX. 4,37 M","CHI","0,2024000","74,35",15.04]
[null,"INSUMO","6193","TABUA NAO APARELHADA *2,5 X 20* CM, EM MACARANDUBA/MASSARANDUBA, ANGELIM OU EQUIVALENTE DA REGIAO - BRUTA","M","1,1592000","29,60",34.31]
[null,"INSUMO","25067","BLOCO DE CONCRETO ESTRUTURAL 19 X 19 X 39 CM, FBK 4,5 MPA (NBR 6136)","UN","54,3233000","4,87",264.55]
[null,"COMPOSICAO","87316","ARGAMASSA TRAÇO 1:4 (EM VOLUME DE CIMENTO E AREIA GROSSA ÚMIDA) PARA CHAPISCO CONVENCIONAL, PREPARO COM BETONEIRA ","M3","0,0372000","503,10",18.71]
[null,"COMPOSICAO","88309","PEDREIRO COM ENCARGOS COMPLEMENTARES","H",13.9453,"27,45",382.79]
[null,"COMPOSICAO","88316","SERVENTE COM ENCARGOS COMPLEMENTARES","H","11,7428000","19,76",232.03]
[null,"COMPOSICAO","88628","ARGAMASSA TRAÇO 1:3 (EM VOLUME DE CIMENTO E AREIA MÉDIA ÚMIDA), PREPARO COM BETONEIRA","M3",5.7000000000000002E-2,"578,37",32.96]
[null,"COMPOSICAO","89993","GRAUTEAMENTO VERTICAL EM ALVENARIA ESTRUTURAL","M3","0,0598000","1.035,54",61.92]
[null,"COMPOSICAO","89995","GRAUTEAMENTO DE CINTA SUPERIOR OU DE VERGA EM ALVENARIA ESTRUTURAL","M3","0,0738000","999,68",73.77]
[null,"COMPOSICAO","89996","ARMAÇÃO VERTICAL DE ALVENARIA ESTRUTURAL; DIÂMETRO DE 10,0 MM","KG","1,9744000","10,08",19.899999999999999]
[null,"COMPOSICAO","89998","ARMAÇÃO DE CINTA DE ALVENARIA ESTRUTURAL; DIÂMETRO DE 10,0 MM","KG","2,9616000","9,56",28.31]
[null,"COMPOSICAO","92767","ARMAÇÃO DE LAJE DE ESTRUTURA CONVENCIONAL DE CONCRETO ARMADO UTILIZANDO AÇO CA-60 DE 4,2 MM - MONTAGEM","KG","12,6004000","14,93",188.12]
[null,"COMPOSICAO","94970","CONCRETO FCK = 20MPA, TRAÇO 1:2,7:3 (EM MASSA SECA DE CIMENTO/ AREIA MÉDIA/ BRITA 1) - PREPARO COM BETONEIRA","M3","0,4747000","475,96",225.93]
[null,"COMPOSICAO","97736","PEÇA RETANGULAR PRÉ-MOLDADA, VOLUME DE CONCRETO ACIMA DE 100 LITROS, TAXA DE AÇO APROXIMADA DE 30KG/M³","M3","0,2516000","1.447,42",364.17]
[null,"COMPOSICAO","97738","PEÇA CIRCULAR PRÉ-MOLDADA, VOLUME DE CONCRETO DE 10 A 30 LITROS, TAXA DE FIBRA DE POLIPROPILENO APROXIMADA DE 6 KG/M³","M3","0,0221000","4.856,07",107.31]
[null,"COMPOSICAO","101624","PREPARO DE FUNDO DE VALA COM LARGURA MAIOR OU IGUAL A 1,5 M E MENOR QUE 2,5 M, COM CAMADA DE BRITA, LANÇAMENTO MECANIZADO","M3","0,6348000","226,26",143.62]
[null,"INSUMO",6240,"TAMPAO FOFO SIMPLES COM BASE / REQUADRO, CLASSE D400 CARGA MAX. 40 T, UN 521,73\nREDONDO, TAMPA 600 MM, REDE PLUVIAL/ESGOTO (COM INSCRICAO EM RELEVO DO TIPO DE REDE)","UNID.",1,521.73,521.73]
[{"$nulls":7},0]
[null,"PRODUÇÃO DA EQUIPE",null,null,1,"CUSTO ",null,{"$f":"SUM(H437:H460)","v":2811.2100000000005}]
[null,"TOTAL",{"$nulls":5},{"$f":"H461/E461","v":2811.2100000000005},"OK"]
[null,"BDI                %",{"$nulls":5},{"$f":"1+$M$1","v":1.2149000000000001}]
[null,"TOTAL DO SERVIÇO - R$",{"$nulls":5},{"$f":"H462*H463","v":3415.3390290000007}]
[]
[25,"CODEVASF",null,null," COMPOSIÇÃO DE PREÇO UNITÁRIO",null,null,null,{"$f":"H476","v":781.01},{"$f":"H478","v":948.84904900000004}]
[null,"OBRA:  ",{"$f":"$C$2","v":"PAVIMENTAÇÃO EM BLOQUETE SEXTAVADOS - RUA BOM JARDIM (BAIRRO SANTO ANTÔNIO) - SERRO/MG (ITEM 2)"},null,null,null,"DATA: ",{"$f":"$H$2","v":"OUTUBRO/2023"}]
[null,"SERVIÇO:  ",{"$f":"VLOOKUP(A466,ORÇAMENTO!$A$10:$I$47,3)","v":"BACIA DE DISSIPAÇÃO, TIPO BACIA EM PEDRA DE MÃO FIXADA COM CONCRETO (DEB 01, 02), COM PREPARO MANUAL, FCK = 20 MPA, LANÇADO MANUALMENTE, INCLUINDO MATERIAIS E FÔRMAS"},null,"SINAPI",{"$f":"VLOOKUP(A466,ORÇAMENTO!$A$10:$I$47,4)","v":103930},"UNIDADE: ",{"$f":"VLOOKUP(A466,ORÇAMENTO!$A$10:$I$48,5)","v":"M3"}]
[]
[null,"TIPO ITEM","CODIGO ITEM","DESCRIÇÃO ITEM","UNIDADE ITEM","COEFICIENTE","PRECO UNITARIO","CUSTO TOTAL"]
[null,"COMPOSICAO","103796","FABRICAÇÃO, MONTAGEM E DESMONTAGEM DE FÔRMA PARA BACIA DE DISSIPAÇÃO, EM MADEIRA SERRADA, E = 25 MM","M2","4,1235000","60,26",{"$f":"ROUNDDOWN(F471*G471,2)","v":248.48}]
[null,"COMPOSICAO","103799","PEDRA DE MÃO FIXADA COM CONCRETO PARA BACIA DE DISSIPAÇÃO, 40% DE CONCRETO EM VOLUME, FCK = 20 MPA, COM USO DE JERICA E PREPARO EM BETONEIRA DE 600 L - AREIA, BRITA E PEDRA DE MÃO COMERCIAIS - LANÇAMENTO, ADENSAMENTO E ACABAMENTO","M3","0,5387000","432,56",233.02]
[null,"COMPOSICAO","103801","CONCRETAGEM DE DISSIPADOR DE ENERGIA, FCK = 20 MPA, COM USO DE JERICAS E PREPARO EM BETONEIRA DE 600 L - AREIA E BRITA COMERCIAIS - LANÇAMENTO, ADENSAMENTO E ACABAMENTO","M3","0,4613000","649,28",299.51]
[]
[null,"PRODUÇÃO DA EQUIPE",null,null,1,"CUSTO ",null,{"$f":"SUM(H471:H474)","v":781.01}]
[null,"TOTAL",{"$nulls":5},{"$f":"H475/E475","v":781.01},"OK"]
[null,"BDI                %",{"$nulls":5},{"$f":"1+$M$1","v":1.2149000000000001}]
[null,"TOTAL DO SERVIÇO - R$",{"$nulls":5},{"$f":"H476*H477","v":948.84904900000004}]
[]
[26,"CODEVASF",null,null," COMPOSIÇÃO DE PREÇO UNITÁRIO",null,null,null,{"$f":"H491","v":1523.0700000000002},{"$f":"H493","v":1850.3777430000002}]
[null,"OBRA:  ",{"$f":"$C$2","v":"PAVIMENTAÇÃO EM BLOQUETE SEXTAVADOS - RUA BOM JARDIM (BAIRRO SANTO ANTÔNIO) - SERRO/MG (ITEM 2)"},null,null,null,"DATA: ",{"$f":"$H$2","v":"OUTUBRO/2023"}]
[null,"SERVIÇO:  ",{"$f":"VLOOKUP(A480,ORÇAMENTO!$A$10:$I$47,3)","v":"ESCADA HIDRÁULICA, LARGURA ATÉ 1M, TIPO DESCIDA DÁGUA DE CORTE OU ATERRO EM DEGRAUS (DCD 02, 04 E DAD 02), EM CONCRETO USINADO, FCK = 20 MPA, INCLUINDO ARMAÇÃO, MATERIAIS E FÔRMAS"},null,"SINAPI",{"$f":"VLOOKUP(A480,ORÇAMENTO!$A$10:$I$47,4)","v":103925},"UNIDADE: ",{"$f":"VLOOKUP(A480,ORÇAMENTO!$A$10:$I$48,5)","v":"M3"}]
[]
[null,"TIPO ITEM","CODIGO ITEM","DESCRIÇÃO ITEM","UNIDADE ITEM","COEFICIENTE","PRECO UNITARIO","CUSTO TOTAL"]
[null,"COMPOSICAO","98576","TRATAMENTO DE JUNTA DE DILATAÇÃO COM MANTA ASFÁLTICA ADERIDA COM MAÇARICO","M","0,4350000","21,15",{"$f":"ROUNDDOWN(F485*G485,2)","v":9.1999999999999993}]
[null,"COMPOSICAO","103795","FABRICAÇÃO, MONTAGEM E DESMONTAGEM DE FÔRMA PARA ESCADA HIDRÁULICA, EM CHAPA DE MADEIRA COMPENSADA RESINADA, E = 17 MM","M2",6.4255000000000004,"81,34",522.65]
[null,"COMPOSICAO","103797","ARMAÇÃO DE DESCIDA D\u0092ÁGUA UTILIZANDO AÇO CA-60 DE 5 MM - MONTAGEM","KG","24,6980000","15,53",383.55]
[null,"COMPOSICAO","103798","CONCRETAGEM DE DISSIPADOR DE ENERGIA, CONCRETO USINADO, FCK = 20 MPA, COM USO DE BOMBA - LANÇAMENTO, ADENSAMENTO E ACABAMENTO","M3",0.85,"714,91",607.66999999999996]
[]
[null,"PRODUÇÃO DA EQUIPE",null,null,1,"CUSTO ",null,{"$f":"SUM(H485:H489)","v":1523.0700000000002}]
[null,"TOTAL",{"$nulls":5},{"$f":"H490/E490","v":1523.0700000000002},"OK"]
[null,"BDI                %",{"$nulls":5},{"$f":"1+$M$1","v":1.2149000000000001}]
[null,"TOTAL DO SERVIÇO - R$",{"$nulls":5},{"$f":"H491*H492","v":1850.3777430000002}]
[]
[27,"CODEVASF",null,null," COMPOSIÇÃO DE PREÇO UNITÁRIO",null,null,null,{"$f":"H506","v":25.169999999999998},{"$f":"H508","v":30.579032999999999}]
[null,"OBRA:  ",{"$f":"$C$2","v":"PAVIMENTAÇÃO EM BLOQUETE SEXTAVADOS - RUA BOM JARDIM (BAIRRO SANTO ANTÔNIO) - SERRO/MG (ITEM 2)"},null,null,null,"DATA: ",{"$f":"$H$2","v":"OUTUBRO/2023"}]
[null,"SERVIÇO:  ",{"$f":"VLOOKUP(A495,ORÇAMENTO!$A$10:$I$47,3)","v":"REATERRO MANUAL DE VALAS COM COMPACTAÇÃO MECANIZADA"},null,"SINAPI",{"$f":"VLOOKUP(A495,ORÇAMENTO!$A$10:$I$47,4)","v":93382},"UNIDADE: ",{"$f":"VLOOKUP(A495,ORÇAMENTO!$A$10:$I$48,5)","v":"M3"}]
[]
[null,"TIPO ITEM","CODIGO ITEM","DESCRIÇÃO ITEM","UNIDADE ITEM","COEFICIENTE","PRECO UNITARIO","CUSTO TOTAL"]
[null,"COMPOSICAO","5901","CAMINHÃO PIPA 10.000 L TRUCADO, PESO BRUTO TOTAL 23.000 KG POTÊNCIA 230 CV, INCLUSIVE TANQUE DE AÇO PARA TRANSPORTE DE ÁGUA","CHP","0,0054000","294,94",{"$f":"ROUNDDOWN(F500*G500,2)","v":1.59}]
[null,"COMPOSICAO","5903","CAMINHÃO PIPA 10.000 L TRUCADO, PESO BRUTO TOTAL 23.000 KG POTÊNCIA 230 CV, INCLUSIVE TANQUE DE AÇO PARA TRANSPORTE DE ÁGUA","CHI","0,0006000","72,55",0.04]
[null,"COMPOSICAO","88316","SERVENTE COM ENCARGOS COMPLEMENTARES","H","0,7866000","19,76",15.54]
[null,"COMPOSICAO","91533","COMPACTADOR DE SOLOS DE PERCUSSÃO (SOQUETE) COM MOTOR A GASOLINA 4 TEMPOS, POTÊNCIA 4 CV","CHP","0,1962000","40,78",8]
[]
[null,"PRODUÇÃO DA EQUIPE",null,null,1,"CUSTO ",null,{"$f":"SUM(H500:H504)","v":25.169999999999998}]
[null,"TOTAL",{"$nulls":5},{"$f":"H505/E505","v":25.169999999999998},"OK"]
[null,"BDI                %",{"$nulls":5},{"$f":"1+$M$1","v":1.2149000000000001}]
[null,"TOTAL DO SERVIÇO - R$",{"$nulls":5},{"$f":"H506*H507","v":30.579032999999999}]
[]
[28,"CODEVASF",null,null," COMPOSIÇÃO DE PREÇO UNITÁRIO",null,null,null,{"$f":"H525","v":3650.96},{"$f":"H527","v":4435.5513040000005}]
[null,"OBRA:  ",{"$f":"$C$2","v":"PAVIMENTAÇÃO EM BLOQUETE SEXTAVADOS - RUA BOM JARDIM (BAIRRO SANTO ANTÔNIO) - SERRO/MG (ITEM 2)"},null,null,null,"DATA: ",{"$f":"$H$2","v":"OUTUBRO/2023"}]
[null,"SERVIÇO:  ",{"$f":"VLOOKUP(A510,ORÇAMENTO!$A$10:$I$47,3)","v":"BOCA PARA BUEIRO SIMPLES TUBULAR D = 80 CM EM CONCRETO, ALAS COM ESCONSIDADE DE 0°, INCLUINDO FÔRMAS E MATERIAIS"},null,"SINAPI",{"$f":"VLOOKUP(A510,ORÇAMENTO!$A$10:$I$47,4)","v":102739},"UNIDADE: ",{"$f":"VLOOKUP(A510,ORÇAMENTO!$A$10:$I$48,5)","v":"UNID."}]
[]
[null,"TIPO ITEM","CODIGO ITEM","DESCRIÇÃO ITEM","UNIDADE ITEM","COEFICIENTE","PRECO UNITARIO","CUSTO TOTAL"]
[null,"COMPOSICAO","96620","LASTRO DE CONCRETO MAGRO, APLICADO EM PISOS, LAJES SOBRE SOLO OU RADIERS","M3","0,2880000","629,64",{"$f":"ROUNDDOWN(F515*G515,2)","v":181.33}]
[null,"COMPOSICAO","102727","FABRICAÇÃO, MONTAGEM E DESMONTAGEM DE FÔRMA PARA BOCA PARA BUEIRO, EM CHAPA DE MADEIRA COMPENSADA RESINADA, E = 17 MM","M2","9,2667000","91,89",851.51]
[null,"COMPOSICAO","102728","ARMAÇÃO DE MURO ALA E MURO TESTA UTILIZANDO AÇO CA-50 DE 6,3 MM - MONTAGEM","KG","65,0389000","14,00",910.54]
[null,"COMPOSICAO","102729","ARMAÇÃO DE MURO ALA E MURO TESTA UTILIZANDO AÇO CA-50 DE 8 MM - MONTAGEM","KG","3,7320000","12,94",48.29]
[null,"COMPOSICAO","102730","ARMAÇÃO DE MURO ALA E MURO TESTA UTILIZANDO AÇO CA-50 DE 10 MM - MONTAGEM","KG","10,6874000","11,45",122.37]
[null,"COMPOSICAO","102731","ARMAÇÃO DE MURO ALA E MURO TESTA UTILIZANDO AÇO CA-50 DE 12,5 MM - MONTAGEM","KG","26,3330000","9,63",253.58]
[null,"COMPOSICAO","102734","ARMAÇÃO DE SOLEIRA UTILIZANDO AÇO CA-50 DE 6,3 MM - MONTAGEM","KG","11,5309000","13,07",150.69999999999999]
[null,"COMPOSICAO","102736","CONCRETAGEM DE BOCA PARA BUEIRO, FCK = 20 MPA, COM USO DE BOMBA - LANÇAMENTO, ADENSAMENTO E ACABAMENTO","M3","1,6202000","699,08",1132.6400000000001]
[{"$nulls":7},0]
[null,"PRODUÇÃO DA EQUIPE",null,null,1,"CUSTO ",null,{"$f":"SUM(H515:H523)","v":3650.96}]
[null,"TOTAL",{"$nulls":5},{"$f":"H524/E524","v":3650.96},"OK"]
[null,"BDI                %",{"$nulls":5},{"$f":"1+$M$1","v":1.2149000000000001}]
[null,"TOTAL DO SERVIÇO - R$",{"$nulls":5},{"$f":"H525*H526","v":4435.5513040000005}]
[]
[29,"CODEVASF",null,null," COMPOSIÇÃO DE PREÇO UNITÁRIO",null,null,null,{"$f":"H547","v":6466.73},{"$f":"H549","v":7856.4302770000004}]
[null,"OBRA:  ",{"$f":"$C$2","v":"PAVIMENTAÇÃO EM BLOQUETE SEXTAVADOS - RUA BOM JARDIM (BAIRRO SANTO ANTÔNIO) - SERRO/MG (ITEM 2)"},null,null,null,"DATA: ",{"$f":"$H$2","v":"OUTUBRO/2023"}]
[null,"SERVIÇO:  ",{"$f":"VLOOKUP(A529,ORÇAMENTO!$A$10:$I$48,3)","v":"FAIXA ELEVADA PARA TRAVESSIA DE PEDESTRES - CONF. PROJETO, INCLUSIVE PINTURA DE SINALIZAÇÃO"},null,"SINAPI",{"$f":"VLOOKUP(A529,ORÇAMENTO!$A$10:$I$48,4)","v":"CPU.4"},"UNIDADE: ",{"$f":"VLOOKUP(A529,ORÇAMENTO!$A$10:$I$48,5)","v":"UNID."}]
[]
[null,"TIPO ITEM","CODIGO ITEM","DESCRIÇÃO ITEM","UNIDADE ITEM","COEFICIENTE","PRECO UNITARIO","CUSTO TOTAL"]
[null,"INSUMO",2692,"DESMOLDANTE PROTETOR PARA FORMAS DE MADEIRA, DE BASE OLEOSA EMULSIONADA EM AGUA","L","0,0213000","5,92",{"$f":"ROUNDDOWN(F534*G534,2)","v":0.12}]
[null,"INSUMO",4509,"SARRAFO *2,5 X 10* CM EM PINUS, MISTA OU EQUIVALENTE DA REGIAO - BRUTA","M",{"$f":"6*0.25+6*0.15","v":2.4},"4,41",{"$f":"ROUNDDOWN(F535*G535,2)","v":10.58}]
[null,"INSUMO",4517,"SARRAFO *2,5 X 7,5* CM EM PINUS, MISTA OU EQUIVALENTE DA REGIAO - BRUTA","M",5,"3,04",15.2]
[null,"INSUMO",5068,"PREGO DE ACO POLIDO COM CABECA 17 X 21 (2 X 11)","KG","0,2994000","19,23",5.75]
[null,"COMPOSICAO",88262,"CARPINTEIRO DE FORMAS COM ENCARGOS COMPLEMENTARES","H","1,6268000","27,05",44]
[null,"COMPOSICAO",88309,"PEDREIRO COM ENCARGOS COMPLEMENTARES","H","1,4149000","27,45",38.83]
[null,"COMPOSICAO",88316,"SERVENTE COM ENCARGOS COMPLEMENTARES","H","3,0417000","19,76",60.1]
[null,"COMPOSICAO",94964,"CONCRETO FCK = 20MPA, TRAÇO 1:2,7:3 (EM MASSA SECA DE CIMENTO/ AREIA MÉDIA/ BRITA 1) - PREPARO MECÂNICO COM BETONEIRA 400 L.","M3",{"$f":"3*6*0.15+(6*(0.15+0.1)*1.5/2)*2","v":4.9499999999999993},"489,87",2424.85]
[null,"COMPOSICAO",97093,"ARMAÇÃO PARA EXECUÇÃO DE RADIER, PISO DE CONCRETO OU LAJE SOBRE SOLO, COM USO DE TELA","KG",{"$f":"F541*40","v":197.99999999999997},13.71,2714.58]
[null,"COMPOSICAO",102491,"PINTURA DE PISO COM TINTA ACRÍLICA, APLICAÇÃO MANUAL, 2 DEMÃOS, INCLUSO FUNDO PREPARADOR","M2",{"$f":"6*6","v":36},19.260000000000002,693.36]
[null,"COMPOSICAO",102509,"PINTURA DE FAIXA DE PEDESTRE OU ZEBRADA TINTA RETRORREFLETIVA A BASE DE RESINA ACRÍLICA COM MICROESFERAS DE VIDRO, E = 30 CM, APLICAÇÃO MANUAL","M2",{"$f":"3*6","v":18},25.52,459.36]
[null,"COMPOSICAO",{"$nulls":5},0]
[null,"PRODUÇÃO DA EQUIPE",null,null,1,"CUSTO ",null,{"$f":"SUM(H534:H545)","v":6466.73}]
[null,"TOTAL",{"$nulls":5},{"$f":"H546/E546","v":6466.73},"OK"]
[null,"BDI                %",{"$nulls":5},{"$f":"1+$M$1","v":1.2149000000000001}]
[null,"TOTAL DO SERVIÇO - R$",{"$nulls":5},{"$f":"H547*H548","v":7856.4302770000004}]
[]
[30,"CODEVASF",null,null," COMPOSIÇÃO DE PREÇO UNITÁRIO",null,null,null,{"$f":"H562","v":113.27000000000001},{"$f":"H564","v":137.61172300000001}]
[null,"OBRA:  ",{"$f":"$C$2","v":"PAVIMENTAÇÃO EM BLOQUETE SEXTAVADOS - RUA BOM JARDIM (BAIRRO SANTO ANTÔNIO) - SERRO/MG (ITEM 2)"},null,null,null,"DATA: ",{"$f":"$H$2","v":"OUTUBRO/2023"}]
[null,"SERVIÇO:  ",{"$f":"VLOOKUP(A551,ORÇAMENTO!$A$10:$I$47,3)","v":"ESTACA BROCA DE CONCRETO, DIÂMETRO DE 30CM, ESCAVAÇÃO MANUAL COM TRADO CONCHA, COM ARMADURA DE ARRANQUE"},null,"SINAPI",{"$f":"VLOOKUP(A551,ORÇAMENTO!$A$10:$I$47,4)","v":101175},"UNIDADE: ",{"$f":"VLOOKUP(A551,ORÇAMENTO!$A$10:$I$47,5)","v":"M"}]
[]
[null,"TIPO ITEM","CODIGO ITEM","DESCRIÇÃO ITEM","UNIDADE ITEM","COEFICIENTE","PRECO UNITARIO","CUSTO TOTAL"]
[null,"COMPOSICAO","88309","PEDREIRO COM ENCARGOS COMPLEMENTARES","H","1,1030000","27,45",{"$f":"ROUNDDOWN(F556*G556,2)","v":30.27}]
[null,"COMPOSICAO","88316","SERVENTE COM ENCARGOS COMPLEMENTARES","H","1,3300000","19,76",26.28]
[null,"COMPOSICAO","92804","CORTE E DOBRA DE AÇO CA-50, DIÂMETRO DE 12,5 MM","KG","2,1230000","7,44",15.79]
[null,"COMPOSICAO","94970","CONCRETO FCK = 20MPA, TRAÇO 1:2,7:3 (EM MASSA SECA DE CIMENTO/ AREIA MÉDIA/ BRITA 1) - PREPARO MECÂNICO COM BETONEIRA ","M3","0,0860000","475,96",40.93]
[]
[null,"PRODUÇÃO DA EQUIPE",null,null,1,"CUSTO ",null,{"$f":"SUM(H556:H560)","v":113.27000000000001}]
[null,"TOTAL",{"$nulls":5},{"$f":"H561/E561","v":113.27000000000001},"OK"]
[null,"BDI                %",{"$nulls":5},{"$f":"1+$M$1","v":1.2149000000000001}]
[null,"TOTAL DO SERVIÇO - R$",{"$nulls":5},{"$f":"H562*H563","v":137.61172300000001}]
[]
[31,"CODEVASF",null,null," COMPOSIÇÃO DE PREÇO UNITÁRIO",null,null,null,{"$f":"H581","v":158.82999999999998},{"$f":"H583","v":192.96256700000001}]
[null,"OBRA:  ",{"$f":"$C$2","v":"PAVIMENTAÇÃO EM BLOQUETE SEXTAVADOS - RUA BOM JARDIM (BAIRRO SANTO ANTÔNIO) - SERRO/MG (ITEM 2)"},null,null,null,"DATA: ",{"$f":"$H$2","v":"OUTUBRO/2023"}]
[null,"SERVIÇO:  ",{"$f":"VLOOKUP(A566,ORÇAMENTO!$A$10:$I$47,3)","v":"CONTENÇÃO EM CORTINA COM ESTACAS ESPAÇADAS COM 30 CM DE DIÂMETRO E PROFUNDIDADE MENOR OU IGUAL A 10 M."},null,"SINAPI",{"$f":"VLOOKUP(A566,ORÇAMENTO!$A$10:$I$47,4)","v":98615},"UNIDADE: ",{"$f":"VLOOKUP(A566,ORÇAMENTO!$A$10:$I$47,5)","v":"M2"}]
[]
[null,"TIPO ITEM","CODIGO ITEM","DESCRIÇÃO ITEM","UNIDADE ITEM","COEFICIENTE","PRECO UNITARIO","CUSTO TOTAL"]
[null,"INSUMO","34493","CONCRETO USINADO BOMBEAVEL, CLASSE DE RESISTENCIA C25, COM BRITA 0 E 1, SLUMP = 100 +/- 20 MM","M3","0,1446000","565,50",{"$f":"ROUNDDOWN(F571*G571,2)","v":81.77}]
[null,"COMPOSICAO","88309","PEDREIRO COM ENCARGOS COMPLEMENTARES","H","0,1233000","27,45",3.38]
[null,"COMPOSICAO","88316","SERVENTE COM ENCARGOS COMPLEMENTARES","H","0,3700000","19,76",7.31]
[null,"COMPOSICAO","90680","PERFURATRIZ HIDRÁULICA SOBRE CAMINHÃO COM TRADO CURTO ACOPLADO, PROFUNDIDADE MÁXIMA DE 20 M, DIÂMETRO MÁXIMO DE 1500 MM, POTÊNCIA INSTALADA DE 137 HP, MESA ROTATIVA COM TORQUE MÁXIMO DE 30 KNM","CHP","0,0785000","426,94",33.51]
[null,"COMPOSICAO","90681","PERFURATRIZ HIDRÁULICA SOBRE CAMINHÃO COM TRADO CURTO ACOPLADO, PROFUNDIDADE MÁXIMA DE 20 M, DIÂMETRO MÁXIMO DE 1500 MM, POTÊNCIA INSTALADA DE 137 HP, MESA ROTATIVA COM TORQUE MÁXIMO DE 30 KNM","CHI","0,0449000","191,54",8.6]
[null,"COMPOSICAO","91634","GUINDAUTO HIDRÁULICO, CAPACIDADE MÁXIMA DE CARGA 6500 KG, MOMENTO MÁXIMO DE CARGA 5,8 TM, ALCANCE MÁXIMO HORIZONTAL 7,60 M, INCLUSIVE CAMINHÃO TOCO PBT 9.700 KG, POTÊNCIA DE 160 CV","CHP","0,0700000","219,40",15.35]
[null,"COMPOSICAO","91635","GUINDAUTO HIDRÁULICO, CAPACIDADE MÁXIMA DE CARGA 6500 KG, MOMENTO MÁXIMO DE CARGA 5,8 TM, ALCANCE MÁXIMO HORIZONTAL 7,60 M, INCLUSIVE CAMINHÃO TOCO PBT 9.700 KG, POTÊNCIA DE 160 CV","CHI","0,1163000","63,86",7.42]
[null,"COMPOSICAO","97913","TRANSPORTE COM CAMINHÃO BASCULANTE DE 6 M³, EM VIA URBANA EM REVESTIMENTO PRIMÁRIO","M3XKM","0,0442000","3,11",0.13]
[null,"COMPOSICAO","100973","CARGA, MANOBRA E DESCARGA DE SOLOS E MATERIAIS GRANULARES EM CAMINHÃO BASCULANTE 6 M³ - CARGA COM PÁ CARREGADEIRA (CAÇAMBA DE 1,7 A 2,8 M³ / 128 HP) E DESCARGA LIVRE","M3","0,1473000","9,28",1.36]
[null,"PRODUÇÃO DA EQUIPE",null,null,1,"CUSTO ",null,{"$f":"SUM(H571:H579)","v":158.82999999999998}]
[null,"TOTAL",{"$nulls":5},{"$f":"H580/E580","v":158.82999999999998},"OK"]
[null,"BDI                %",{"$nulls":5},{"$f":"1+$M$1","v":1.2149000000000001}]
[null,"TOTAL DO SERVIÇO - R$",{"$nulls":5},{"$f":"H581*H582","v":192.96256700000001}]
[]
[32,"CODEVASF",null,null," COMPOSIÇÃO DE PREÇO UNITÁRIO",null,null,null,{"$f":"H599","v":386.98},{"$f":"H601","v":470.14200200000005}]
[null,"OBRA:  ",{"$f":"$C$2","v":"PAVIMENTAÇÃO EM BLOQUETE SEXTAVADOS - RUA BOM JARDIM (BAIRRO SANTO ANTÔNIO) - SERRO/MG (ITEM 2)"},null,null,null,"DATA: ",{"$f":"$H$2","v":"OUTUBRO/2023"}]
[null,"SERVIÇO:  ",{"$f":"VLOOKUP(A585,ORÇAMENTO!$A$10:$I$47,3)","v":"FORNECIMENTO E INSTALAÇÃO DE PLACA DE SINALIZAÇÃO VIÁRIA - REGULAMENTAÇÃO 0,60MX0,60M, SUPORTE INCLUSO"},null,"SINAPI",{"$f":"VLOOKUP(A585,ORÇAMENTO!$A$10:$I$47,4)","v":"CPU.5"},"UNIDADE: ",{"$f":"VLOOKUP(A585,ORÇAMENTO!$A$10:$I$47,5)","v":"UNID."}]
[]
[null,"TIPO ITEM","CODIGO ITEM","DESCRIÇÃO ITEM","UNIDADE ITEM","COEFICIENTE","PRECO UNITARIO","CUSTO TOTAL"]
[null,"COMPOSICAO",94962,"CONCRETO MAGRO PARA LASTRO, TRAÇO 1:4,5:4,5 (EM MASSA SECA DE CIMENTO/ AREIA MÉDIA/ BRITA 1)","M3",2.4E-2,"402,82",{"$f":"ROUNDDOWN(F590*G590,2)","v":9.66}]
[null,"COMPOSICAO",93358,"ESCAVAÇÃO MANUAL DE VALA COM PROFUNDIDADE MENOR OU IGUAL A 1,30 M","M3",2.4E-2,"78,17",1.87]
[null,"COMPOSICAO",88309,"PEDREIRO COM ENCARGOS COMPLEMENTARES","H",0.2,"27,45",5.49]
[null,"COMPOSICAO",88316,"SERVENTE COM ENCARGOS COMPLEMENTARES","H",1,"19,76",19.760000000000002]
[null,"COMPOSICAO",103670,"LANÇAMENTO COM USO DE BALDES, ADENSAMENTO E ACABAMENTO DE CONCRETO EM ESTRUTURAS","M3",2.4E-2,"281,78",6.76]
[null,"INSUMO",34723,"PLACA DE SINALIZACAO EM CHAPA DE ACO NUM 16 COM PINTURA REFLETIVA (CIRCULAR - D=50CM) ","M2",0.2,"577,50",115.5]
[null,"INSUMO",21013,"TUBO AÇO GALVANIZADO COM COSTURA, CLASSE LEVE, DN 50 MM ( 2\")E = 3,00 MM, *4,40* KG/M (NBR 5580)","M",3,"75,98",227.94]
[]
[null,"PRODUÇÃO DA EQUIPE",null,null,1,"CUSTO ",null,{"$f":"SUM(H590:H597)","v":386.98}]
[null,"TOTAL",{"$nulls":5},{"$f":"H598/E598","v":386.98},"OK"]
[null,"BDI                %",{"$nulls":5},{"$f":"1+$M$1","v":1.2149000000000001}]
[null,"TOTAL DO SERVIÇO - R$",{"$nulls":5},{"$f":"H599*H600","v":470.14200200000005}]
[]
[33,"CODEVASF",null,null," COMPOSIÇÃO DE PREÇO UNITÁRIO",null,null,null,{"$f":"H618","v":353.98},{"$f":"H620","v":430.05030200000004}]
[null,"OBRA:  ",{"$f":"$C$2","v":"PAVIMENTAÇÃO EM BLOQUETE SEXTAVADOS - RUA BOM JARDIM (BAIRRO SANTO ANTÔNIO) - SERRO/MG (ITEM 2)"},null,null,null,"DATA: ",{"$f":"$H$2","v":"OUTUBRO/2023"}]
[null,"SERVIÇO:  ",{"$f":"VLOOKUP(A603,ORÇAMENTO!$A$10:$I$47,3)","v":"FORNECIMENTO E INSTALAÇÃO DE PLACA DE IDENTIFICAÇÃO DE LOGRADOURO, SUPORTE INCLUSO - CONFORME PROJETO"},null,"SINAPI",{"$f":"VLOOKUP(A603,ORÇAMENTO!$A$10:$I$47,4)","v":"CPU.6"},"UNIDADE: ",{"$f":"VLOOKUP(A603,ORÇAMENTO!$A$10:$I$47,5)","v":"UNID."}]
[]
[null,"TIPO ITEM","CODIGO ITEM","DESCRIÇÃO ITEM","UNIDADE ITEM","COEFICIENTE","PRECO UNITARIO","CUSTO TOTAL"]
[null,"COMPOSICAO",94962,"CONCRETO MAGRO PARA LASTRO, TRAÇO 1:4,5:4,5 (EM MASSA SECA DE CIMENTO/ AREIA MÉDIA/ BRITA 1)","M3",2.4E-2,"402,82",{"$f":"ROUNDDOWN(F608*G608,2)","v":9.66}]
[null,"COMPOSICAO",93358,"ESCAVAÇÃO MANUAL DE VALA COM PROFUNDIDADE MENOR OU IGUAL A 1,30 M","M3",2.4E-2,"78,17",1.87]
[null,"COMPOSICAO",88309,"PEDREIRO COM ENCARGOS COMPLEMENTARES","H",0.2,"27,45",5.49]
[null,"COMPOSICAO",88316,"SERVENTE COM ENCARGOS COMPLEMENTARES","H",1,"19,76",19.760000000000002]
[null,"COMPOSICAO",103670,"LANÇAMENTO COM USO DE BALDES, ADENSAMENTO E ACABAMENTO DE CONCRETO EM ESTRUTURAS","M3",2.4E-2,"281,78",6.76]
[null,"INSUMO",13521,"PLACA DE IDENTIFICAÇÃO DE RUA EM CHAPA DE ACO NUM 16 COM PINTURA REFLETIVA ","UNID.",1,"82,50",82.5]
[null,"INSUMO",21013,"TUBO AÇO GALVANIZADO COM COSTURA, CLASSE LEVE, DN 50 MM ( 2\")E = 3,00 MM, *4,40* KG/M (NBR 5580)","M",3,"75,98",227.94]
[{"$nulls":7},0]
[]
[null,"PRODUÇÃO DA EQUIPE",null,null,1,"CUSTO ",null,{"$f":"SUM(H608:H616)","v":353.98}]
[null,"TOTAL",{"$nulls":5},{"$f":"H617/E617","v":353.98},"OK"]
[null,"BDI                %",{"$nulls":5},{"$f":"1+$M$1","v":1.2149000000000001}]
[null,"TOTAL DO SERVIÇO - R$",{"$nulls":5},{"$f":"H618*H619","v":430.05030200000004}]

{"sheet":"BDI SERV","index":2,"n_rows":36,"n_cols":5,"rows_kept":36,"cut":false,"hidden":false,"merged":[[7,7,17,12],[35,0,35,5],[3,1,4,1],[3,2,4,2],[0,1,2,4],[31,0,33,5],[27,0,27,5],[29,1,29,2],[30,1,30,2]]}
[null,"DETALHAMENTO DO BDI - SERVIÇOS"]
[]
[]
[null,"Item","Descrição dos Serviços","%","%"]
[null,null,null,"PV","CD"]
[]
[null,1,"ADMINISTRAÇÃO CENTRAL"," ",4.01]
[null,"1.1","ESCRITÓRIO CENTRAL"," "," "]
[null,"1.2","VIAGENS"," "," "]
[null,"1.3","OUTROS"," "," "]
[null," "," "," "," "]
[null,2,"IMPOSTOS E TAXAS",{"$f":"SUM(D13:D15)","v":5.65},{"$f":"SUM(E13:E15)","v":7.0600000000000005}]
[null,"2.1","ISS (*)",{"$f":"4*0.5","v":2},{"$f":"ROUND(D13*1.2515,2)","v":2.5}]
[null,"2.2","PIS",0.65,{"$f":"ROUND(D14*1.2515,2)","v":0.81}]
[null,"2.3","Cofins",3,{"$f":"ROUND(D15*1.2515,2)","v":3.75}]
[]
[null,3,"TAXA DE RISCO"," ",{"$f":"SUM(E18:E21)","v":0.96}]
[null,"3.1","SEGURO",null,0.2]
[null,"3.2","RISCO",null,0.56000000000000005]
[null,"3.3","GARANTIA",null,0.2]
[]
[null,4,"DESPESAS FINANCEIRAS"," ",1.1100000000000001]
[]
[null,5,"LUCRO",null,8]
[]
[null," ","BDI - CALCULADO"," ",{"$f":"ROUND((((1+(E7+E17)/100)*(1+E22/100)*(1+E24/100)/(1-D12/100)-1)*100),2)","v":21.49}]
[]
["BDI = ((1+((AC+S+R+G)/100))x(1+DF/100)x(1+L/100)/(1-I/100)-1)*100"]
[]
[null,"BDI (CALCULADO):",null,{"$f":"ROUND((((1+((E7+E17)/100))*(1+E22/100)*(1+E24/100))/(1-D12/100)-1)*100,2)","v":21.49},"%"]
[null," "]
["(*) ISS CONFORME LEI COMPLEMENTAR Nº 63/2005 - ART. 30\n(QUANT. ESTIMADA DE MATERIAIS = 50%)"]
[]
[]
[" "]
["BDI EM CONFORMIDADE COM OS ACÓRDÃOS Nº 2369/2011 e ACÓRDÃO Nº 2.622/2013 - TCU - PLENÁRIO"]

{"sheet":"CRONOGRAMA","index":3,"n_rows":17,"n_cols":11,"rows_kept":17,"cut":false,"hidden":false,"merged":[[13,1,14,2],[16,1,20,10],[7,2,8,2],[9,2,10,2],[11,2,12,2],[7,1,8,1],[9,1,10,1],[11,1,12,1],[7,0,8,0],[9,0,10,0],[11,0,12,0],[0,1,0,10],[1,6,1,10],[2,6,2,10],[3,1,3,6],[5,0,6,0],[5,2,6,2],[1,1,2,1],[5,1,6,1],[1,2,2,4]]}
[null,"CRONOGRAMA FÍSICO-FINANCEIRO"]
[null,"OBRA: ",{"$f":"ORÇAMENTO!C5","v":"PAVIMENTAÇÃO EM BLOQUETE SEXTAVADOS - RUA BOM JARDIM (BAIRRO SANTO ANTÔNIO) - SERRO/MG (ITEM 2)"},null,null,"VALOR:",{"$f":"ORÇAMENTO!I47","v":1971942.7700000005}]
[{"$nulls":5},"PRAZO: ","150 DIAS "]
[]
[null,"ITEM","ETAPAS/DESCRIÇAO","FISICO/  FINANCEIRO","TOTAL    ETAPAS","MÊS 1","MÊS 2","MÊS 3","MÊS 4","MÊS 5","TOTAL"]
["A",{"$f":"VLOOKUP(A6,ORÇAMENTO!$A$9:$I$47,2)","v":1},{"$f":"VLOOKUP(A6,ORÇAMENTO!$A$9:$I$47,3)","v":"SERVIÇOS PRELIMINARES "},"FISICO ",{"$f":"ROUND(E7/$G$2,4)","v":7.8E-2},0.2,0.2,0.2,0.2,0.2,{"$f":"SUM(F6:J6)","v":1}]
[null,null,null,"FINANCEIRO",{"$f":"ORÇAMENTO!I9","v":153884.53000000003},{"$f":"ROUND($E$7*F6,2)","v":30776.91},{"$f":"ROUND($E$7*G6,2)","v":30776.91},{"$f":"ROUND($E$7*H6,2)","v":30776.91},{"$f":"ROUND($E$7*I6,2)","v":30776.91},30776.91,{"$f":"SUM(F7:J7)","v":153884.54999999999}]
["B",{"$f":"VLOOKUP(A8,ORÇAMENTO!$A$9:$I$47,2)","v":2},{"$f":"VLOOKUP(A8,ORÇAMENTO!$A$9:$I$47,3)","v":"PAVIMENTAÇÃO"},"FISICO ",{"$f":"ROUND(E9/$G$2,4)","v":0.31369999999999998},0.2,0.2,0.2,0.2,0.2,{"$f":"SUM(F8:J8)","v":1}]
[null,null,null,"FINANCEIRO",{"$f":"ORÇAMENTO!I15","v":618619.80000000005},{"$f":"ROUND($E$9*F8,2)","v":123723.96},{"$f":"ROUND($E$9*G8,2)","v":123723.96},{"$f":"ROUND($E$9*H8,2)","v":123723.96},{"$f":"ROUND($E$9*I8,2)","v":123723.96},123723.96,{"$f":"SUM(F9:J9)","v":618619.80000000005}]
["C",{"$f":"VLOOKUP(A10,ORÇAMENTO!$A$9:$I$47,2)","v":3},{"$f":"VLOOKUP(A10,ORÇAMENTO!$A$9:$I$47,3)","v":"TRANSPORTE DE MATERIAIS"},"FISICO ",{"$f":"ROUND(E11/$G$2,4)","v":8.4099999999999994E-2},0.2,0.2,0.2,0.2,0.2,{"$f":"SUM(F10:J10)","v":1}]
[null,null,null,"FINANCEIRO",{"$f":"ORÇAMENTO!I21","v":165785.26},{"$f":"ROUND($E$11*F10,2)","v":33157.050000000003},{"$f":"ROUND($E$11*G10,2)","v":33157.050000000003},{"$f":"ROUND($E$11*H10,2)","v":33157.050000000003},{"$f":"ROUND($E$11*I10,2)","v":33157.050000000003},33157.050000000003,{"$f":"SUM(F11:J11)","v":165785.25}]
["D",{"$f":"VLOOKUP(A12,ORÇAMENTO!$A$9:$I$47,2)","v":4},{"$f":"VLOOKUP(A12,ORÇAMENTO!$A$9:$I$47,3)","v":"DRENAGEM E OBRAS COMPLEMENTARES"},"FISICO ",{"$f":"ROUND(E13/$G$2,4)","v":0.5242},0.2,0.2,0.2,0.2,0.2,{"$f":"SUM(F12:J12)","v":1}]
[null,null,null,"FINANCEIRO",{"$f":"ORÇAMENTO!I24","v":1033653.1800000003},{"$f":"ROUND($E$13*F12,2)","v":206730.64},{"$f":"ROUND($E$13*G12,2)","v":206730.64},{"$f":"ROUND($E$13*H12,2)","v":206730.64},{"$f":"ROUND($E$13*I12,2)","v":206730.64},206730.64,{"$f":"SUM(F13:J13)","v":1033653.2000000001}]
[null,"TOTAL",null,"FISICO ",{"$f":"SUM(F14:H14)","v":0.60000000912805396},{"$f":"F15/E15","v":0.20000000304268464},{"$f":"G15/$E$15","v":0.20000000304268464},{"$f":"H15/$E$15","v":0.20000000304268464},{"$f":"I15/$E$15","v":0.20000000304268464},0.20000000304268464,{"$f":"SUM(F14:J14)","v":1.0000000152134232}]
[null,null,null,"FINANCEIRO",{"$f":"E11+E9+E7+E13","v":1971942.7700000005},{"$f":"F11+F9+F7+F13","v":394388.56000000006},{"$f":"G11+G9+G7+G13","v":394388.56000000006},{"$f":"H11+H9+H7+H13","v":394388.56000000006},{"$f":"I11+I9+I7+I13","v":394388.56000000006},394388.56000000006,{"$f":"ROUNDUP(SUM(F15:J15),2)-0.03","v":1971942.77}]
[]
[null,"OBSERVAÇÕES:"]