{"text_format":"2","workbook":"xlsx","n_sheets":5,"sheets":["ORÇAMENTO","CPU","BDI SERV","BDI FORN","CRONOGRAMA"],"not_rendered":{"charts":0,"images":4,"macros":0,"external_links":0,"defined_names":5,"comments":0,"pivot_tables":0},"unopened":[],"bounds":{"document_bytes":16777216,"sheet_cells":100000,"run_cost":"one","rows_first":2000,"rows_last":500,"rows_between":2000,"halvings":0,"cell_chars":16384,"cell_head_chars":4096},"cells_cut":0,"cells_raw":0,"read":"whole","date_system":"1900"}

{"sheet":"ORÇAMENTO","index":0,"n_rows":36,"n_cols":9,"rows_kept":36,"cut":false,"hidden":false,"merged":[[5,12,8,14],[35,1,35,2],[0,0,7,0],[0,2,0,8],[1,2,1,8],[2,2,2,8],[4,2,4,8],[5,6,5,7],[6,1,6,2],[6,6,6,7]]}
["<---- NUMERAR SERVIÇOS PARA CPU",null,"Ministério do Desenvolvimento Regional"]
[null,null,"Companhia de Desenvolvimento dos Vales do São Francisco e do Parnaíba"]
[null,null,"1ª Superintendência Regional"]
[]
[null,"OBRA: "," PAVIMENTAÇÃO ASFÁLTICA EM CBUQ - RECAPEAMENTO - AV. OLINDO MIRANDA - ALMENARA / MG"]
[null,"DATA:"," SETEMBRO / 2023   ",null,null,null,"BDI Serviços:",null,{"$f":"'BDI SERV'!D31/100","v":0.23550000000000001}]
[null,"PRAZO DE EXECUÇÃO:    120 DIAS",{"$nulls":4},"BDI Fornecimento:",null,{"$f":"'BDI FORN'!D31/100","v":0.15}]
[null,"ITEM","DISCRIMINAÇÃO","REFER.","UNID.","QUANT.","P. UNITÁRIO","P.UNIT.C/ BDI","P. TOTAL"]
["A",1,"SERVIÇOS PRELIMINARES ",{"$nulls":5},{"$f":"SUM(I10:I13)","v":105769.3}]
[1,"1.1","MOBILIZAÇÃO E DESMOBILIZAÇÃO","CPU.1","GL",1,{"$f":"VLOOKUP(A10,CPU!$A$1:$N$4636,9)","v":7911.7199999999993},{"$f":"VLOOKUP(A10,CPU!$A$1:$N$4636,10)","v":9774.93},{"$f":"ROUND(F10*H10,2)","v":9774.93}]
[2,"1.2","ADMINISTRAÇÃO LOCAL","CPU.2","GL",1,{"$f":"VLOOKUP(A11,CPU!$A$1:$N$4636,9)","v":66780.52},{"$f":"VLOOKUP(A11,CPU!$A$1:$N$4636,10)","v":82507.33},{"$f":"ROUND(F11*H11,2)","v":82507.33}]
[3,"1.3","CANTEIRO DE OBRAS","CPU.3","GL",1,{"$f":"VLOOKUP(A12,CPU!$A$1:$N$4636,9)","v":9384},{"$f":"VLOOKUP(A12,CPU!$A$1:$N$4636,10)","v":11593.93},{"$f":"ROUND(F12*H12,2)","v":11593.93}]
[4,"1.4","PLACA DE OBRA EM CHAPA DE AÇO GALVANIZADO",103689,"M2",4.5,{"$f":"VLOOKUP(A13,CPU!$A$1:$N$4636,9)","v":340.5},{"$f":"VLOOKUP(A13,CPU!$A$1:$N$4636,10)","v":420.69},{"$f":"ROUND(F13*H13,2)","v":1893.11}]
["B",2,"PAVIMENTAÇÃO",{"$nulls":5},{"$f":"SUM(I15:I21)","v":309083.2}]
[5,"2.1","DEMOLIÇÃO PARCIAL DE PAVIMENTO ASFÁLTICO, DE FORMA MECANIZADA, SEM REAPROVEITAMENTO (TRECHOS DE RECOMP. DA BASE)","97636a","M2",1600,{"$f":"VLOOKUP(A15,CPU!$A$1:$N$4636,9)","v":16.86},{"$f":"VLOOKUP(A15,CPU!$A$1:$N$4636,10)","v":20.83},{"$f":"ROUND(F15*H15,2)","v":33328}]
[6,"2.2","ESCAVAÇÃO HORIZONTAL EM SOLO DE 1A CATEGORIA (TRECHOS DE RECOMP. DA BASE)",101116,"M3",330,{"$f":"VLOOKUP(A16,CPU!$A$1:$N$4636,9)","v":2.2000000000000002},{"$f":"VLOOKUP(A16,CPU!$A$1:$N$4636,10)","v":2.72},897.6]
[7,"2.3","CARGA, MANOBRA E DESCARGA DE AGREGADOS OU SOLOS EM CAMINHÃO BASCULANTE - DESCARGA LIVRE (TRECHOS DE RECOMP. DA BASE)",100976,"M3",330,{"$f":"VLOOKUP(A17,CPU!$A$1:$N$4636,9)","v":8.7100000000000009},{"$f":"VLOOKUP(A17,CPU!$A$1:$N$4636,10)","v":10.76},3550.8]
[8,"2.4","REGULARIZAÇÃO E COMPACTAÇÃO DE SUBLEITO (TRECHOS DE RECOMP. DA BASE)",100576,"M2",1600,{"$f":"VLOOKUP(A18,CPU!$A$1:$N$4636,9)","v":2.57},{"$f":"VLOOKUP(A18,CPU!$A$1:$N$4636,10)","v":3.18},5088]
[10,"2.5","RECOMPOSIÇÃO DE BASE E OU SUB-BASE PARA REMENDO PROFUNDO DE BICA CORRIDA - INCLUSO RETIRADA E COLOCAÇÃO DO MATERIAL","101835a","M3",330,{"$f":"VLOOKUP(A19,CPU!$A$1:$N$4636,9)","v":127.45},{"$f":"VLOOKUP(A19,CPU!$A$1:$N$4636,10)","v":157.46},51961.8]
[11,"2.2","PINTURA DE LIGAÇÃO COM EMULSÃO ASFÁLTICA RR-1C",96402,"M2",30500,{"$f":"VLOOKUP(A20,CPU!$A$1:$N$4636,9)","v":1.01},{"$f":"VLOOKUP(A20,CPU!$A$1:$N$4636,10)","v":1.25},{"$f":"ROUND(F20*H20,2)","v":38125}]
[12,"2.3","EXECUÇÃO DE PAVIMENTO COM APLICAÇÃO DE CONCRETO ASFÁLTICO USINADO A QUENTE (CBUQ), CAMADA DE ROLAMENTO - EXCLUSIVE TRANSPORTE",95995,"M3",1100,{"$f":"VLOOKUP(A21,CPU!$A$1:$N$4636,9)","v":129.6},{"$f":"VLOOKUP(A21,CPU!$A$1:$N$4636,10)","v":160.12},176132]
["C",3,"TRANSPORTE DE MATERIAIS",{"$nulls":5},{"$f":"SUM(I23:I23)","v":5850}]
[13,"3.1","TRANSPORTE COM CAMINHÃO BASCULANTE, EM VIA URBANA PAVIMENTADA",95427,"M3XKM",6499.9957800000002,{"$f":"VLOOKUP(A23,CPU!$A$1:$N$4636,9)","v":0.73},{"$f":"VLOOKUP(A23,CPU!$A$1:$N$4636,10)","v":0.9},{"$f":"ROUND(F23*H23,2)","v":5850}]
["D",4,"TRANSPORTE DE MATERIAL ASFÁLTICO (BDI DIFERENCIADO)",{"$nulls":5},{"$f":"SUM(I25:I26)","v":409000}]
[15,"4.1","TRANSPORTE DE MASSA ASFÁLTICA COM CAMINHÃO BASCULANTE, EM VIA URBANA PAVIMENTADA (BDI DIFERENCIADO)",95430,"TXKM",775000,{"$f":"VLOOKUP(A25,CPU!$A$1:$N$4636,9)","v":0.44999999999999996},{"$f":"VLOOKUP(A25,CPU!$A$1:$N$4636,10)","v":0.52},{"$f":"ROUND(F25*H25,2)","v":403000}]
[16,"4.2","TRANSPORTE COM CAMINHÃO TANQUE DE TRANSPORTE DE MATERIAL ASFÁLTICO DE 30000 L, EM VIA URBANA PAVIMENTADA (BDI DIFERENCIADO)",102331,"TXKM",10000,{"$f":"VLOOKUP(A26,CPU!$A$1:$N$4636,9)","v":0.52},{"$f":"VLOOKUP(A26,CPU!$A$1:$N$4636,10)","v":0.6},{"$f":"ROUND(F26*H26,2)","v":6000}]
["E",5,"DRENAGEM E OBRAS COMPLEMENTARES",{"$nulls":5},{"$f":"SUM(I28:I32)","v":390947.56999999995}]
[19,"5.1","DEMOLIÇÃO DE PAVIMENTAÇÃO ASFÁLTICA COM UTILIZAÇÃO DE MARTELO PERFURADOR (TRECHO DE SARJETA EXISTENTE)","92970a","M2",1440,{"$f":"VLOOKUP(A28,CPU!$A$1:$N$4636,9)","v":19.490000000000002},{"$f":"VLOOKUP(A28,CPU!$A$1:$N$4636,10)","v":24.08},{"$f":"ROUND(F28*H28,2)","v":34675.199999999997}]
[20,"5.2","EXECUÇÃO DE SARJETA DE CONCRETO USINADO, MOLDADA  IN LOCO  EM TRECHO RETO, 40 CM BASE X 7 CM ALTURA","94273a","M",3650,{"$f":"VLOOKUP(A29,CPU!$A$1:$N$4636,9)","v":41.980000000000004},{"$f":"VLOOKUP(A29,CPU!$A$1:$N$4636,10)","v":51.866290000000006},189311.96]
[21,"5.3","PINTURA DE EIXO VIÁRIO SOBRE ASFALTO COM TINTA RETRORREFLETIVA A BASE DE RESINA ACRÍLICA COM MICROESFERAS DE VIDRO, APLICAÇÃO MECÂNICA COM DEMARCADORA AUTOPROPELIDA",102512,"M",12000,{"$f":"VLOOKUP(A30,CPU!$A$1:$N$4636,9)","v":5.84},{"$f":"VLOOKUP(A30,CPU!$A$1:$N$4636,10)","v":7.22},86640]
[22,"5.4","PINTURA DE FAIXA DE PEDESTRE OU ZEBRADA TINTA RETRORREFLETIVA A BASE DE RESINA ACRÍLICA COM MICROESFERAS DE VIDRO, E = 30 CM, APLICAÇÃO MANUAL",102509,"M2",1400,{"$f":"VLOOKUP(A31,CPU!$A$1:$N$4636,9)","v":25.52},{"$f":"VLOOKUP(A31,CPU!$A$1:$N$4636,10)","v":31.53},{"$f":"ROUND(F31*H31,2)","v":44142}]
[23,"5.5","FORNECIMENTO E INSTALAÇÃO DE PLACA DE SINALIZAÇÃO VIÁRIA - REGULAMENTAÇÃO (FAIXA DE PEDESTRE E OUTROS) - CONFORME PROJETO","CPU.4","UNID",60,{"$f":"VLOOKUP(A32,CPU!$A$1:$N$4636,9)","v":488.04},{"$f":"VLOOKUP(A32,CPU!$A$1:$N$4636,10)","v":602.97342000000003},36178.410000000003]
["F",6,"FORNECIMENTOS - MATERIAL ASFÁLTICO (BDI DIFERENCIADO)",{"$nulls":5},{"$f":"SUM(I34:I35)","v":1859642.38}]
[26,"6.1","AQUISIÇÃO DE EMULSAO ASFALTICA CATIONICA RR-1C - EXCLUSIVE TRANSPORTE","CPU.6","T",13.994999999999999,{"$f":"VLOOKUP(A34,CPU!$A$1:$N$4636,9)","v":2706.7},{"$f":"VLOOKUP(A34,CPU!$A$1:$N$4636,10)","v":3112.71},{"$f":"ROUND(F34*H34,2)","v":43562.38}]
[27,"6.2","AQUISIÇÃO DE CONCRETO BETUMINOSO USINADO A QUENTE (CBUQ) PARA PAVIMENTACAO ASFALTICA, PADRAO DNIT, FAIXA C, COM CAP 50/70 - EXCLUSIVE TRANSPORTE","CPU.7","T",2820,{"$f":"VLOOKUP(A35,CPU!$A$1:$N$4636,9)","v":560},{"$f":"VLOOKUP(A35,CPU!$A$1:$N$4636,10)","v":644},{"$f":"ROUND(F35*H35,2)","v":1816080}]
[null,"TOTAL GERAL DA OBRA COM BDI ",{"$nulls":6},{"$f":"SUM(I9,I14,I22,I27,I33,I24)","v":3080292.4499999997}]

{"sheet":"CPU","index":1,"n_rows":333,"n_cols":13,"rows_kept":333,"cut":false,"hidden":false,"merged":[[307,1,307,3],[307,5,307,6],[308,1,308,6],[309,1,309,6],[310,1,310,6],[295,0,311,0],[122,1,122,3],[122,5,122,6],[123,1,123,6],[124,1,124,6],[125,1,125,6],[258,1,258,6],[243,0,259,0],[127,0,148,0],[149,0,167,0],[168,0,189,0],[190,0,201,0],[190,1,190,3],[190,4,190,7],[203,0,214,0],[203,1,203,3],[203,4,203,7],[204,2,204,5],[205,2,205,3],[66,0,81,0],[95,0,108,0],[109,0,126,0],[295,1,295,3],[295,4,295,7],[296,2,296,5],[297,2,297,3],[298,1,298,7],[104,1,104,3],[104,5,104,6],[105,1,105,6],[106,1,106,6],[107,1,107,6],[109,1,109,3],[109,4,109,7],[110,2,110,5],[111,2,111,3],[112,1,112,7],[91,1,91,6],[92,1,92,6],[93,1,93,6],[82,0,94,0],[95,1,95,3],[95,4,95,7],[96,2,96,5],[97,2,97,3],[98,1,98,7],[79,1,79,6],[80,1,80,6],[82,1,82,3],[82,4,82,7],[83,2,83,5],[84,2,84,3],[85,1,85,7],[90,1,90,3],[90,5,90,6],[66,1,66,3],[66,4,66,7],[67,2,67,5],[68,2,68,3],[69,1,69,7],[77,1,77,3],[77,5,77,6],[78,1,78,6],[257,1,257,6],[243,1,243,3],[243,4,243,7],[244,2,244,5],[245,2,245,3],[246,1,246,7],[255,1,255,3],[255,5,255,6],[256,1,256,6],[127,1,127,3],[127,4,127,7],[149,1,149,3],[149,4,149,7],[168,1,168,3],[168,4,168,7],[188,1,188,6],[0,0,13,0],[0,1,0,3],[0,4,0,7],[0,10,0,11],[1,2,1,5],[1,10,1,11],[2,2,2,3],[3,1,3,7],[9,1,9,3],[9,5,9,6],[10,1,10,6],[11,1,11,6],[12,1,12,6],[14,0,33,0],[14,1,14,3],[14,4,14,7],[14,10,14,11],[15,2,15,5],[15,8,16,9],[16,2,16,3],[17,1,17,7],[29,1,29,3],[29,5,29,6],[30,1,30,6],[31,1,31,6],[32,1,32,6],[34,0,47,0],[34,1,34,3],[34,4,34,7],[34,10,34,11],[35,2,35,5],[35,8,36,9],[36,2,36,3],[37,1,37,7],[43,1,43,3],[43,5,43,6],[44,1,44,6],[45,1,45,6],[46,1,46,6],[48,0,65,0],[48,1,48,3],[48,4,48,7],[48,10,48,11],[49,2,49,5],[50,2,50,3],[51,1,51,7],[61,1,61,3],[61,5,61,6],[62,1,62,6],[63,1,63,6],[64,1,64,6],[127,10,127,11],[128,2,128,5],[129,2,129,3],[130,1,130,7],[144,1,144,3],[144,5,144,6],[145,1,145,6],[146,1,146,6],[147,1,147,6],[149,10,149,11],[150,2,150,5],[151,2,151,3],[152,1,152,7],[163,1,163,3],[163,5,163,6],[164,1,164,6],[165,1,165,6],[166,1,166,6],[168,10,168,11],[169,2,169,5],[170,2,170,3],[171,1,171,7],[173,8,173,9],[185,1,185,3],[185,5,185,6],[186,1,186,6],[187,1,187,6],[190,10,190,11],[191,2,191,5],[192,2,192,3],[193,1,193,7],[198,1,198,3],[198,5,198,6],[199,1,199,6],[200,1,200,6],[201,1,201,6],[206,1,206,7],[211,1,211,3],[211,5,211,6],[212,1,212,6],[213,1,213,6],[214,1,214,6],[216,0,227,0],[216,1,216,3],[216,4,216,7],[216,10,216,11],[217,2,217,5],[218,2,218,3],[219,1,219,7],[223,1,223,3],[223,5,223,6],[224,1,224,6],[225,1,225,6],[226,1,226,6],[228,0,241,0],[228,1,228,3],[228,4,228,7],[229,2,229,5],[230,2,230,3],[231,1,231,7],[238,1,238,3],[238,5,238,6],[239,1,239,6],[240,1,240,6],[241,1,241,6],[260,0,276,0],[260,1,260,3],[260,4,260,7],[261,2,261,5],[262,2,262,3],[263,1,263,7],[273,1,273,3],[273,5,273,6],[274,1,274,6],[275,1,275,6],[276,1,276,6],[312,0,321,0],[312,1,312,3],[312,4,312,7],[313,2,313,5],[314,2,314,3],[315,1,315,7],[318,1,318,3],[318,5,318,6],[319,1,319,6],[320,1,320,6],[321,1,321,6],[323,0,332,0],[323,1,323,3],[323,4,323,7],[324,2,324,5],[325,2,325,3],[326,1,326,7],[329,1,329,3],[329,5,329,6],[330,1,330,6],[331,1,331,6],[332,1,332,6],[278,0,293,0],[278,1,278,3],[278,4,278,7],[279,2,279,5],[280,2,280,3],[281,1,281,7],[290,1,290,3],[290,5,290,6],[291,1,291,6],[292,1,292,6],[293,1,293,6]]}
[1,"CODEVASF",null,null," COMPOSIÇÃO DE PREÇO UNITÁRIO",null,null,null,{"$f":"H11","v":7911.7199999999993},{"$f":"H13","v":9774.93},"BDI CALCULADO:",null,{"$f":"ORÇAMENTO!I6","v":0.23550000000000001}]
[null,"OBRA:  ",{"$f":"ORÇAMENTO!C5","v":" PAVIMENTAÇÃO ASFÁLTICA EM CBUQ - RECAPEAMENTO - AV. OLINDO MIRANDA - ALMENARA / MG"},null,null,null,"DATA: ",{"$f":"ORÇAMENTO!C6","v":" SETEMBRO / 2023   "},null,null,"BDI DIFERENCIADO:",null,{"$f":"'BDI FORN'!D31/100","v":0.15}]
[null,"SERVIÇO:  ",{"$f":"VLOOKUP(A1,ORÇAMENTO!A10:I27,3)","v":"MOBILIZAÇÃO E DESMOBILIZAÇÃO"},null,"Referência:",{"$f":"VLOOKUP(A1,ORÇAMENTO!$A$10:$I$27,4)","v":"CPU.1"},"UNIDADE: ",{"$f":"VLOOKUP(A1,ORÇAMENTO!A10:I27,5)","v":"GL"}]
[]
[null,"TIPO ITEM","CODIGO ITEM","DESCRIÇÃO ITEM","UNIDADE ITEM","COEFICIENTE","PRECO UNITARIO","CUSTO TOTAL"]
[null,"COMPOSICAO",89876,"CAMINHÃO BASCULANTE 14 M3, COM CAVALO MECÂNICO DE CAPACIDADE MÁXIMA DE TRAÇÃO COMBINADO DE 36000 KG, POTÊNCIA 286 CV, INCLUSIVE SEMIREBOQUE COM CAÇAMBA METÁLICA","CHP DIURNO.",8,316.13,{"$f":"ROUNDDOWN(F6*G6,2)","v":2529.04}]
[null,"COMPOSICAO",89877,"CAMINHÃO BASCULANTE 14 M3, COM CAVALO MECÂNICO DE CAPACIDADE MÁXIMA DE TRAÇÃO COMBINADO DE 36000 KG, POTÊNCIA 286 CV, INCLUSIVE SEMIREBOQUE COM CAÇAMBA METÁLICA","CHI DIURNO.",8,89.75,{"$f":"ROUNDDOWN(F7*G7,2)","v":718}]
[null,"COMPOSICAO",5914640,"TRANSPORTE COM CAVALO MECÂNICO COM SEMIRREBOQUE COM CAPACIDADE DE 30 T - RODOVIA PAVIMENTADA","T.KM",677,0.57999999999999996,{"$f":"ROUNDDOWN(F8*G8,2)","v":392.66}]
[null,"COMPOSIÇÃO",88316,"SERVENTE COM ENCARGOS COMPLEMENTARES","H",16,19.760000000000002,{"$f":"ROUNDDOWN(F9*G9,2)","v":316.16000000000003}]
[null,"PRODUÇÃO DA EQUIPE",null,null,0.5,"CUSTO ",null,{"$f":"SUM(H6:H9)","v":3955.8599999999997}]
[null,"TOTAL",{"$nulls":5},{"$f":"H10/E10","v":7911.7199999999993},"OK"]
[null,"BDI                %",{"$nulls":5},{"$f":"1+$M$1","v":1.2355}]
[null,"TOTAL DO SERVIÇO - R$",{"$nulls":5},{"$f":"ROUND(H11*H12,2)","v":9774.93}]
[]
[{"$f":"A1+1","v":2},"CODEVASF",null,null," COMPOSIÇÃO DE PREÇO UNITÁRIO",null,null,null,{"$f":"H31","v":66780.52},{"$f":"H33","v":82507.33}]
[null,"OBRA:  ",{"$f":"$C$2","v":" PAVIMENTAÇÃO ASFÁLTICA EM CBUQ - RECAPEAMENTO - AV. OLINDO MIRANDA - ALMENARA / MG"},null,null,null,"DATA: ",{"$f":"$H$2","v":" SETEMBRO / 2023   "}]
[null,"SERVIÇO:  ",{"$f":"VLOOKUP(A15,ORÇAMENTO!$A$10:$I$27,3)","v":"ADMINISTRAÇÃO LOCAL"},null,"SINAPI",{"$f":"VLOOKUP(A15,ORÇAMENTO!$A$10:$I$27,4)","v":"CPU.2"},"UNIDADE: ",{"$f":"VLOOKUP(A15,ORÇAMENTO!$A$10:$I$27,5)","v":"GL"}]
[]
[null,"TIPO ITEM","CODIGO ITEM","DESCRIÇÃO ITEM","UNIDADE ITEM","COEFICIENTE","PRECO UNITARIO","CUSTO TOTAL"]
[null,"INSUMO",14250,"ENERGIA ELÉTRICA","kwh",60,0.94,{"$f":"ROUNDDOWN(F20*G20,2)","v":56.4}]
[null,"INSUMO",44480,"TARIFA \"A\" - ÁGUA/ESGOTO ","m³",6,17.78,106.68]
[null,"COTAÇÃO","MERC.","TELEFONE (PLANO CONTROLE)","UNID",2,59.9,119.8]
[null,"INSUMO","ED-50155 SEINFRA","BANHEIRO QUÍMICO 110 X 120 X 230 CM COM MANUTENÇÃO (CONSIDERANDO OBRAS SIMULTÂNEAS)","MÊS",1,820,820]
[null,"COMPOSICAO",90777,"Engenheiro Civil Júnior com encargos complementares","H",45,114.12,5135.3999999999996]
[null,"COMPOSICAO",90776,"Encarregado Geral com encargos complementares","H",90,57.73,5195.7]
[null,"COMPOSICAO",88321,"Tecnico de Laboratório com encargos complementares","H",55,45.45,2499.75]
[null,"COMPOSICAO",88253,"AUXILIAR DE TOPÓGRAFO COM ENCARGOS COMPLEMENTARES","H",30,21.57,647.1]
[null,"COMPOSICAO",88288,"NIVELADOR COM ENCARGOS COMPLEMENTARES","H",30,26.99,809.7]
[null,"COMPOSICAO",90772,"Auxiliar de escritório com encargos complementares","H",55,23.72,1304.5999999999999]
[null,"PRODUÇÃO DA EQUIPE",null,null,{"$f":"1/4","v":0.25},"CUSTO ",null,{"$f":"SUM(H20:H29)","v":16695.13}]
[null,"TOTAL",{"$nulls":5},{"$f":"ROUND(H30/E30,2)","v":66780.52},"OK"]
[null,"BDI                %",{"$nulls":5},{"$f":"1+$M$1","v":1.2355}]
[null,"TOTAL DO SERVIÇO - R$",{"$nulls":5},{"$f":"ROUND(H31*H32,2)","v":82507.33}]
[]
[{"$f":"A15+1","v":3},"CODEVASF",null,null," COMPOSIÇÃO DE PREÇO UNITÁRIO",null,null,null,{"$f":"H45","v":9384},{"$f":"H47","v":11593.93}]
[null,"OBRA:  ",{"$f":"$C$2","v":" PAVIMENTAÇÃO ASFÁLTICA EM CBUQ - RECAPEAMENTO - AV. OLINDO MIRANDA - ALMENARA / MG"},null,null,null,"DATA: ",{"$f":"$H$2","v":" SETEMBRO / 2023   "}]
[null,"SERVIÇO:  ",{"$f":"VLOOKUP(A35,ORÇAMENTO!$A$10:$I$27,3)","v":"CANTEIRO DE OBRAS"},null,"SINAPI",{"$f":"VLOOKUP(A35,ORÇAMENTO!$A$10:$I$27,4)","v":"CPU.3"},"UNIDADE: ",{"$f":"VLOOKUP(A35,ORÇAMENTO!$A$10:$I$27,5)","v":"GL"}]
[]
[null,"TIPO ITEM","CODIGO ITEM","DESCRIÇÃO ITEM","UNIDADE ITEM","COEFICIENTE","PRECO UNITARIO","CUSTO TOTAL"]
[null,"INSUMO",10775,"LOCACAO DE CONTAINER 2,30 X 6,00 M, ALT. 2,50 M, COM 1 SANITARIO, PARA ESCRITORIO, COMPLETO, SEM DIVISORIAS INTERNAS","MÊS",4,975,{"$f":"ROUNDDOWN(F40*G40,2)","v":3900}]
[null,"INSUMO",10779,"LOCACAO DE CONTAINER 2,30 X 4,30 M, ALT. 2,50 M, P/ SANITARIO, C/ 5 BACIAS, 1 LAVATORIO E 4 MICTORIOS","MÊS",4,1218.75,{"$f":"ROUNDDOWN(F41*G41,2)","v":4875}]
[null,"INSUMO","37525","TELA PLASTICA TECIDA LISTRADA BRANCA E LARANJA, TIPO GUARDA CORPO, EM POLIETILENO MONOFILADO, ROLO 1,20 X 50 M (L X C)","M",100,3.69,{"$f":"ROUNDDOWN(F42*G42,2)","v":369}]
[null,"COMPOSICAO"," - ","PLACA DE SINALIZAÇÃO - \"PERIGO - OBRAS A FRENTE\" - FORNECIMENTO E MOVIMENTAÇÃO","UNID.",12,20,{"$f":"ROUNDDOWN(F43*G43,2)","v":240}]
[null,"PRODUÇÃO DA EQUIPE",null,null,1,"CUSTO ",null,{"$f":"SUM(H40:H43)","v":9384}]
[null,"TOTAL",{"$nulls":5},{"$f":"H44/E44","v":9384},"OK"]
[null,"BDI                %",{"$nulls":5},{"$f":"1+$M$1","v":1.2355}]
[null,"TOTAL DO SERVIÇO - R$",{"$nulls":5},{"$f":"ROUND(H45*H46,2)","v":11593.93}]
[]
[{"$f":"A35+1","v":4},"CODEVASF",null,null," COMPOSIÇÃO DE PREÇO UNITÁRIO",null,null,null,{"$f":"H63","v":340.5},{"$f":"H65","v":420.69}]
[null,"OBRA:  ",{"$f":"$C$2","v":" PAVIMENTAÇÃO ASFÁLTICA EM CBUQ - RECAPEAMENTO - AV. OLINDO MIRANDA - ALMENARA / MG"},null,null,null,"DATA: ",{"$f":"$H$2","v":" SETEMBRO / 2023   "}]
[null,"SERVIÇO:  ",{"$f":"VLOOKUP(A49,ORÇAMENTO!$A$10:$I$27,3)","v":"PLACA DE OBRA EM CHAPA DE AÇO GALVANIZADO"},null,"SINAPI",{"$f":"VLOOKUP(A49,ORÇAMENTO!$A$10:$I$27,4)","v":103689},"UNIDADE: ",{"$f":"VLOOKUP(A49,ORÇAMENTO!$A$10:$I$27,5)","v":"M2"}]
[]
[null,"TIPO ITEM","CODIGO ITEM","DESCRIÇÃO ITEM","UNIDADE ITEM","COEFICIENTE","PRECO UNITARIO","CUSTO TOTAL"]
[null,"INSUMO","4509","SARRAFO *2,5 X 10* CM EM PINUS, MISTA OU EQUIVALENTE DA REGIAO - BRUTA","M","3,2083000","4,41",{"$f":"ROUNDDOWN(F54*G54,2)","v":14.14}]
[null,"INSUMO","4813","PLACA DE OBRA (PARA CONSTRUCAO CIVIL) EM CHAPA GALVANIZADA *N. 22*, ADESIVADA, DE *2,4 X 1,2* M (SEM POSTES PARA FIXACAO)","M2","1,0000000","250,00",250]
[null,"INSUMO","5065","PREGO DE ACO POLIDO COM CABECA 10 X 10 (7/8 X 17)","KG","0,0113000","36,57",0.41]
[null,"INSUMO","5069","PREGO DE ACO POLIDO COM CABECA 17 X 27 (2 1/2 X 11)","KG","0,0132000","19,59",0.25]
[null,"COMPOSICAO","88262","CARPINTEIRO DE FORMAS COM ENCARGOS COMPLEMENTARES","H","0,3729000","27,05",10.08]
[null,"COMPOSICAO","88316","SERVENTE COM ENCARGOS COMPLEMENTARES","H","1,1186000","19,76",22.1]
[null,"INSUMO",4115,"MADEIRA ROLICA TRATADA, D = 12 A 15 CM, H = 3,00 M, EM EUCALIPTO OU EQUIVALENTE","M",2,21.76,43.52]
{"$rows_left_out":274}
{"sheet":"BDI SERV","index":2,"n_rows":37,"n_cols":5,"rows_kept":37,"cut":false,"hidden":false,"merged":[[31,1,31,2],[32,0,34,5],[36,0,36,5],[0,1,2,4],[3,1,4,1],[3,2,4,2],[28,0,28,5],[30,1,30,2]]}
[null,"DETALHAMENTO DO BDI - SERVIÇOS"]
[]
[]
[null,"Item","Descrição dos Serviços","%","%"]
[null,null,null,"PV","CD"]
[]
[null,1,"ADMINISTRAÇÃO CENTRAL"," ",4.01]
[null,"1.1","ESCRITÓRIO CENTRAL"," "," "]
[null,"1.2","VIAGENS"," "," "]
[null,"1.3","OUTROS"," "," "]
[null," "," "," "," "]
[null,2,"IMPOSTOS E TAXAS",{"$f":"SUM(D13:D16)","v":7.65},{"$f":"SUM(E13:E16)","v":9.57}]
[null,"2.1","ISS (*)",{"$f":"5*0.8","v":4},{"$f":"ROUND(D13*1.2515,2)","v":5.01}]
[null,"2.2","PIS",0.65,{"$f":"ROUND(D14*1.2515,2)","v":0.81}]
[null,"2.3","Cofins",3,{"$f":"ROUND(D15*1.2515,2)","v":3.75}]
[null,"2.4","CONTRIBUIÇÃO PREVIDENCIÁRIA SOBRE A RENDA BRUTA",0,{"$f":"ROUND(D16*1.2515,2)","v":0}]
[]
[null,3,"TAXA DE RISCO"," ",{"$f":"SUM(E19:E22)","v":0.96}]
[null,"3.1","SEGURO",null,0.2]
[null,"3.2","RISCO",null,0.56000000000000005]
[null,"3.3","GARANTIA",null,0.2]
[]
[null,4,"DESPESAS FINANCEIRAS"," ",1.1100000000000001]
[]
[null,5,"LUCRO",null,7.5]
[]
[null," ","BDI - CALCULADO"," ",{"$f":"ROUND((((1+(E7+E18)/100)*(1+E23/100)*(1+E25/100)/(1-D12/100)-1)*100),2)","v":23.55}]
[]
["BDI = ((1+((AC+S+R+G)/100))x(1+DF/100)x(1+L/100)/(1-I/100)-1)*100"]
[]
[null,"BDI (CALCULADO):",null,{"$f":"ROUND((((1+((E7+E18)/100))*(1+E23/100)*(1+E25/100))/(1-D12/100)-1)*100,2)","v":23.55},"%"]
[null," "]
["(*) ISS CONFORME LEI COMPLEMENTAR Nº 1.830/2021 - ART. 324 § 2º INCISO I - NÃO PREVISTO DEDUÇÃO DE MATERIAIS / QUANTIDADE IRRISÓRIA (MATERIAIS ASFÁLTICOS COM BDI DIFERENCIADO)"]
[]
[]
[]
["BDI EM CONFORMIDADE COM OS ACÓRDÃOS Nº 2369/2011 e ACÓRDÃO Nº 2.622/2013 - TCU - PLENÁRIO"]

{"sheet":"BDI FORN","index":3,"n_rows":37,"n_cols":5,"rows_kept":37,"cut":false,"hidden":false,"merged":[[31,1,31,2],[32,0,34,5],[36,0,36,5],[0,1,2,4],[3,1,4,1],[3,2,4,2],[28,0,28,5],[30,1,30,2]]}
[null,"DETALHAMENTO DO BDI - FORNECIMENTO \n(MATERIAL ASFÁLTICO)"]
[]
[]
[null,"Item","Descrição dos Serviços","%","%"]
[null,null,null,"PV","CD"]
[]
[null,1,"ADMINISTRAÇÃO CENTRAL"," ",3.72]
[null,"1.1","ESCRITÓRIO CENTRAL"," "," "]
[null,"1.2","VIAGENS"," "," "]
[null,"1.3","OUTROS"," "," "]
[null," "," "," "," "]
[null,2,"IMPOSTOS E TAXAS",{"$f":"SUM(D13:D16)","v":3.65},{"$f":"SUM(E13:E16)","v":4.5600000000000005}]
[null,"2.1","ISS (*)",null,{"$f":"ROUND(D13*1.2515,2)","v":0}]
[null,"2.2","PIS",0.65,{"$f":"ROUND(D14*1.2515,2)","v":0.81}]
[null,"2.3","Cofins",3,{"$f":"ROUND(D15*1.2515,2)","v":3.75}]
[null,"2.4","CONTRIBUIÇÃO PREVIDENCIÁRIA SOBRE A RENDA BRUTA",0,{"$f":"ROUND(D16*1.2515,2)","v":0}]
[]
[null,3,"TAXA DE RISCO"," ",{"$f":"SUM(E19:E22)","v":0.82000000000000006}]
[null,"3.1","SEGURO",null,0.16]
[null,"3.2","RISCO",null,0.5]
[null,"3.3","GARANTIA",null,0.16]
[]
[null,4,"DESPESAS FINANCEIRAS"," ",0.94]
[]
[null,5,"LUCRO",null,5]
[]
[null," ","BDI - CALCULADO"," ",{"$f":"ROUND((((1+(E7+E18)/100)*(1+E23/100)*(1+E25/100)/(1-D12/100)-1)*100),2)","v":15}]
[]
["BDI = ((1+((AC+S+R+G)/100))x(1+DF/100)x(1+L/100)/(1-I/100)-1)*100"]
[]
[null,"BDI (CALCULADO):",null,{"$f":"ROUND((((1+((E7+E18)/100))*(1+E23/100)*(1+E25/100))/(1-D12/100)-1)*100,2)","v":15},"%"]
[null," "]
[]
[]
[]
[]
["BDI EM CONFORMIDADE COM OS ACÓRDÃOS Nº 2369/2011 e ACÓRDÃO Nº 2.622/2013 - TCU - PLENÁRIO"]

{"sheet":"CRONOGRAMA","index":4,"n_rows":21,"n_cols":10,"rows_kept":21,"cut":false,"hidden":false,"merged":[[0,1,0,9],[1,1,2,1],[1,2,2,4],[1,6,1,9],[2,6,2,9],[3,1,3,8],[5,0,6,0],[5,1,6,1],[5,2,6,2],[7,0,8,0],[7,1,8,1],[7,2,8,2],[9,0,10,0],[9,1,10,1],[9,2,10,2],[11,0,12,0],[11,1,12,1],[11,2,12,2],[17,1,18,2],[20,1,24,9],[13,0,14,0],[13,1,14,1],[13,2,14,2],[15,0,16,0],[15,1,16,1],[15,2,16,2]]}
[null,"CRONOGRAMA FÍSICO-FINANCEIRO"]
[null,"OBRA: ",{"$f":"ORÇAMENTO!C5","v":" PAVIMENTAÇÃO ASFÁLTICA EM CBUQ - RECAPEAMENTO - AV. OLINDO MIRANDA - ALMENARA / MG"},null,null,"VALOR:",{"$f":"ORÇAMENTO!I36","v":3080292.4499999997}]
[{"$nulls":5},"PRAZO: ","120 DIAS "]
[]
[null,"ITEM","ETAPAS/DESCRIÇAO","FISICO/  FINANCEIRO","TOTAL    ETAPAS","MÊS 1","MÊS 2","MÊS 3","MÊS 4","TOTAL"]
["A",{"$f":"VLOOKUP(A6,ORÇAMENTO!$A$9:$I$36,2)","v":1},{"$f":"VLOOKUP(A6,ORÇAMENTO!$A$9:$I$36,3)","v":"SERVIÇOS PRELIMINARES "},"FISICO ",{"$f":"ROUND(E7/$G$2,4)","v":3.4299999999999997E-2},0.25,0.35,0.3,0.1,{"$f":"SUM(F6:I6)","v":0.99999999999999989}]
[null,null,null,"FINANCEIRO",{"$f":"ORÇAMENTO!I9","v":105769.3},{"$f":"ROUND($E$7*F6,2)","v":26442.33},{"$f":"ROUND($E$7*G6,2)","v":37019.26},{"$f":"ROUND($E$7*H6,2)","v":31730.79},{"$f":"ROUND($E$7*I6,2)","v":10576.93},{"$f":"SUM(F7:I7)","v":105769.31}]
["B",{"$f":"VLOOKUP(A8,ORÇAMENTO!$A$9:$I$36,2)","v":2},{"$f":"VLOOKUP(A8,ORÇAMENTO!$A$9:$I$36,3)","v":"PAVIMENTAÇÃO"},"FISICO ",{"$f":"ROUND(E9/$G$2,4)","v":0.1003},0.35,0.4,0.25,null,{"$f":"SUM(F8:I8)","v":1}]
[null,null,null,"FINANCEIRO",{"$f":"ORÇAMENTO!I14","v":309083.2},{"$f":"ROUND($E$9*F8,2)","v":108179.12},{"$f":"ROUND($E$9*G8,2)","v":123633.28},{"$f":"ROUND($E$9*H8,2)","v":77270.8},{"$f":"ROUND($E$9*I8,2)","v":0},{"$f":"SUM(F9:I9)","v":309083.2}]
["C",{"$f":"VLOOKUP(A10,ORÇAMENTO!$A$9:$I$36,2)","v":3},{"$f":"VLOOKUP(A10,ORÇAMENTO!$A$9:$I$36,3)","v":"TRANSPORTE DE MATERIAIS"},"FISICO ",{"$f":"ROUND(E11/$G$2,4)","v":1.9E-3},0.7,0.3,null,null,{"$f":"SUM(F10:I10)","v":1}]
[null,null,null,"FINANCEIRO",{"$f":"ORÇAMENTO!I22","v":5850},{"$f":"ROUND($E$11*F10,2)","v":4095},{"$f":"ROUND($E$11*G10,2)","v":1755},{"$f":"ROUND($E$11*H10,2)","v":0},{"$f":"ROUND($E$11*I10,2)","v":0},{"$f":"SUM(F11:I11)-0.04","v":5849.96}]
["D",{"$f":"VLOOKUP(A12,ORÇAMENTO!$A$9:$I$36,2)","v":4},{"$f":"VLOOKUP(A12,ORÇAMENTO!$A$9:$I$36,3)","v":"TRANSPORTE DE MATERIAL ASFÁLTICO (BDI DIFERENCIADO)"},"FISICO ",{"$f":"ROUND(E13/$G$2,4)","v":0.1328},0.35,0.4,0.25,null,{"$f":"SUM(F12:I12)","v":1}]
[null,null,null,"FINANCEIRO",{"$f":"ORÇAMENTO!I24","v":409000},{"$f":"ROUND($E$13*F12,2)","v":143150},{"$f":"ROUND($E$13*G12,2)","v":163600},{"$f":"ROUND($E$13*H12,2)","v":102250},{"$f":"ROUND($E$13*I12,2)","v":0},{"$f":"SUM(F13:I13)-0.02","v":408999.98}]
["E",{"$f":"VLOOKUP(A14,ORÇAMENTO!$A$9:$I$36,2)","v":5},{"$f":"VLOOKUP(A14,ORÇAMENTO!$A$9:$I$36,3)","v":"DRENAGEM E OBRAS COMPLEMENTARES"},"FISICO ",{"$f":"ROUND(E15/$G$2,4)","v":0.12690000000000001},0,0.2,0.4,0.4,{"$f":"SUM(F14:I14)","v":1}]
[null,null,null,"FINANCEIRO",{"$f":"ORÇAMENTO!I27","v":390947.56999999995},{"$f":"ROUND($E$15*F14,2)","v":0},{"$f":"ROUND($E$15*G14,2)","v":78189.509999999995},{"$f":"ROUND($E$15*H14,2)","v":156379.03},{"$f":"ROUND($E$15*I14,2)","v":156379.03},{"$f":"SUM(F15:I15)-0.02","v":390947.54999999993}]
["F",{"$f":"VLOOKUP(A16,ORÇAMENTO!$A$9:$I$36,2)","v":6},{"$f":"VLOOKUP(A16,ORÇAMENTO!$A$9:$I$36,3)","v":"FORNECIMENTOS - MATERIAL ASFÁLTICO (BDI DIFERENCIADO)"},"FISICO ",{"$f":"ROUND(E17/$G$2,4)","v":0.60370000000000001},0.35,0.4,0.25,null,{"$f":"SUM(F16:I16)","v":1}]
[null,null,null,"FINANCEIRO",{"$f":"ORÇAMENTO!I33","v":1859642.38},{"$f":"ROUND($E$17*F16,2)","v":650874.82999999996},{"$f":"ROUND($E$17*G16,2)","v":743856.95},{"$f":"ROUND($E$17*H16,2)","v":464910.6},{"$f":"ROUND($E$17*I16,2)","v":0},{"$f":"SUM(F17:I17)-0.02","v":1859642.3599999999}]
[null,"TOTAL",null,"FISICO ",{"$f":"SUM(F18:I18)","v":1.0000000032464451},{"$f":"F19/$E$19","v":0.30280932578333597},{"$f":"G19/$E$19","v":0.37270941595172241},{"$f":"H19/$E$19","v":0.2702799274789639},{"$f":"I19/$E$19","v":5.4201334032422797E-2},{"$f":"SUM(F18:I18)","v":1.0000000032464451}]
[null,null,null,"FINANCEIRO",{"$f":"E11+E9+E7+E13+E17+E15","v":3080292.4499999997},{"$f":"F11+F9+F7+F13+F17+F15","v":932741.28},{"$f":"G11+G9+G7+G13+G17+G15","v":1148054},{"$f":"H11+H9+H7+H13+H17+H15","v":832541.22},{"$f":"I11+I9+I7+I13+I17+I15","v":166955.96},{"$f":"SUM(F19:I19)-0.01","v":3080292.45}]
[]
[null,"OBSERVAÇÕES:"]