{"text_format":"2","workbook":"xlsx","n_sheets":4,"sheets":["ORÇAMENTO","CPU","BDI SERV","CRONOGRAMA"],"not_rendered":{"charts":0,"images":4,"macros":0,"external_links":0,"defined_names":5,"comments":0,"pivot_tables":0},"unopened":[],"bounds":{"document_bytes":16777216,"sheet_cells":100000,"run_cost":"one","rows_first":2000,"rows_last":500,"rows_between":2000,"halvings":0,"cell_chars":16384,"cell_head_chars":4096},"cells_cut":0,"cells_raw":0,"read":"whole","date_system":"1900"}

{"sheet":"ORÇAMENTO","index":0,"n_rows":51,"n_cols":9,"rows_kept":51,"cut":false,"hidden":false,"merged":[[7,6,7,7],[50,1,50,2],[0,0,8,0],[0,2,0,8],[1,2,1,8],[2,2,2,8],[4,2,4,8],[6,6,6,7],[7,1,7,2],[5,2,5,8]]}
["<---- NUMERAR SERVIÇOS PARA CPU",null,"Ministério da Integração Nacional"]
[null,null,"Companhia de Desenvolvimento dos Vales do São Francisco e do Parnaíba"]
[null,null,"1ª Superintendência Regional"]
[]
[null,"OBRA: ","CONSTRUÇÃO DE PONTE SOBRE O RIO SÃO DOMINGOS (CONTINUAÇÃO)"]
[null,"LOCAL:","BURITIS - MG"]
[null,"DATA:","NOVEMBRO / 2023",null,null,null,"BDI Serviços:",null,{"$f":"'BDI SERV'!D31/100","v":0.26030000000000003}]
[null,"PRAZO DE EXECUÇÃO:  150 DIAS"]
[null,"ITEM","DISCRIMINAÇÃO","REFER.","UNID.","QUANT.","P. UNITÁRIO","P.UNIT.C/ BDI","P. TOTAL"]
["A",1,"SERVIÇOS PRELIMINARES ",{"$nulls":5},{"$f":"SUM(I11:I16)","v":217707.91000000003}]
[0,"1.1","MOBILIZAÇÃO E DESMOBILIZAÇÃO","CPU.1","GL",1,{"$f":"VLOOKUP(A11,CPU!$A$1:$N$3306,9)","v":5497.44},{"$f":"VLOOKUP(A11,CPU!$A$1:$N$3306,10)","v":6928.4236319999991},{"$f":"ROUND(F11*H11,2)","v":6928.42}]
[1,"1.2","ADMINISTRAÇÃO LOCAL E MANUTENÇÃO DO CANTEIRO DE OBRAS","CPU.2","GL",1,{"$f":"VLOOKUP(A12,CPU!$A$1:$N$3306,9)","v":118608.75},{"$f":"VLOOKUP(A12,CPU!$A$1:$N$3306,10)","v":149482.607625},{"$f":"ROUND(F12*H12,2)","v":149482.60999999999}]
[2,"1.3","LIMPEZA MECANIZADA DE CAMADA VEGETAL, VEGETAÇÃO E PEQUENAS ÁRVORES (DIÂMETRO DE TRONCO MENOR QUE 0,20 M)",98525,"M2",4000,{"$f":"VLOOKUP(A13,CPU!$A$1:$N$3306,9)","v":0.41},{"$f":"VLOOKUP(A13,CPU!$A$1:$N$3306,10)","v":0.51672299999999993},{"$f":"ROUND(F13*H13,2)","v":2066.89}]
[3,"1.4","INSTALAÇÕES E CANTEIRO DE OBRAS","CPU.3","GL",1,{"$f":"VLOOKUP(A14,CPU!$A$1:$N$3306,9)","v":31394.1},{"$f":"VLOOKUP(A14,CPU!$A$1:$N$3306,10)","v":39565.984229999995},{"$f":"ROUND(F14*H14,2)","v":39565.980000000003}]
[4,"1.5","PLACA DE OBRA EM CHAPA DE AÇO GALVANIZADO",103689,"M2",4,{"$f":"VLOOKUP(A15,CPU!$A$1:$N$3306,9)","v":367.02},{"$f":"VLOOKUP(A15,CPU!$A$1:$N$3306,10)","v":462.55530599999997},{"$f":"ROUND(F15*H15,2)","v":1850.22}]
[5,"1.6","MOBILIZAÇÃO E DESMOBILIZAÇÃO DE GUINDASTE HIDRÁULICO AUTOPROPELIDO, COM LANÇA TELESCÓPICA","CPU.4","M",1,{"$f":"VLOOKUP(A16,CPU!$A$1:$N$3306,9)","v":14134.560000000001},{"$f":"VLOOKUP(A16,CPU!$A$1:$N$3306,10)","v":17813.785968},{"$f":"ROUND(F16*H16,2)","v":17813.79}]
["D",2,"SUPERESTRUTURA E LAJES DE APROXIMAÇÃO",{"$nulls":5},{"$f":"SUM(I18:I37)","v":1239986.6099999999}]
[13,"2.1","TRANSPORTE COM CAMINHÃO CARROCERIA 9T, EM VIA URBANA PAVIMENTADA (MAT. DIVERSOS - AÇO, MADEIRA, CIMENTO)",100948,"TXKM",60000.000235759995,{"$f":"VLOOKUP(A18,CPU!$A$1:$N$3306,9)","v":0.88},{"$f":"VLOOKUP(A18,CPU!$A$1:$N$3306,10)","v":1.109064},{"$f":"ROUND(F18*H18,2)","v":66543.839999999997}]
[14,"2.2","TRANSPORTE COM CAMINHÃO CARROCERIA 9T, EM VIA URBANA EM REVESTIMENTO PRIMÁRIO (MAT. DIVERSOS - AÇO, MADEIRA, CIMENTO)",100945,"TXKM",2399.9989412799996,{"$f":"VLOOKUP(A19,CPU!$A$1:$N$3306,9)","v":2.8},{"$f":"VLOOKUP(A19,CPU!$A$1:$N$3306,10)","v":3.5288399999999998},{"$f":"ROUND(F19*H19,2)","v":8469.2099999999991}]
[15,"2.3","TRANSPORTE COM CAMINHÃO BASCULANTE OU BETONEIRA, EM VIA URBANA PAVIMENTADA (MAT. DIVERSOS - CONCRETO, AREIA, BRITA, SOLO, ENTULHO)",93590,"M3XKM",29999.996039999995,{"$f":"VLOOKUP(A20,CPU!$A$1:$N$3306,9)","v":0.97},{"$f":"VLOOKUP(A20,CPU!$A$1:$N$3306,10)","v":1.222491},{"$f":"ROUND(F20*H20,2)","v":36674.730000000003}]
[16,"2.4","TRANSPORTE COM CAMINHÃO BASCULANTE OU BETONEIRA, EM VIA URBANA EM REVESTIMENTO PRIMÁRIO (MAT. DIVERSOS - CONCRETO, AREIA, BRITA, SOLO, ENTULHO)",93589,"M3XKM",1500.0031199999999,{"$f":"VLOOKUP(A21,CPU!$A$1:$N$3306,9)","v":2.67},{"$f":"VLOOKUP(A21,CPU!$A$1:$N$3306,10)","v":3.3650009999999999},{"$f":"ROUND(F21*H21,2)","v":5047.51}]
[19,"2.5","ARMAÇÃO DE PILAR OU VIGA DE UMA ESTRUTURA CONVENCIONAL DE CONCRETO ARMADO UTILIZANDO AÇO CA-60 DE 5,0 MM",92775,"KG",210,{"$f":"VLOOKUP(A22,CPU!$A$1:$N$3306,9)","v":17.03},{"$f":"VLOOKUP(A22,CPU!$A$1:$N$3306,10)","v":21.462909},{"$f":"ROUND(F22*H22,2)","v":4507.21}]
[20,"2.6","ARMAÇÃO DE PILAR OU VIGA DE UMA ESTRUTURA CONVENCIONAL DE CONCRETO ARMADO UTILIZANDO AÇO CA-50 DE 6,3 MM",92776,"KG",2400,{"$f":"VLOOKUP(A23,CPU!$A$1:$N$3306,9)","v":15.399999999999999},{"$f":"VLOOKUP(A23,CPU!$A$1:$N$3306,10)","v":19.408619999999999},{"$f":"ROUND(F23*H23,2)","v":46580.69}]
[21,"2.7","ARMAÇÃO DE PILAR OU VIGA DE UMA ESTRUTURA CONVENCIONAL DE CONCRETO ARMADO UTILIZANDO AÇO CA-50 DE 8 MM",92777,"KG",180,{"$f":"VLOOKUP(A24,CPU!$A$1:$N$3306,9)","v":13.93},{"$f":"VLOOKUP(A24,CPU!$A$1:$N$3306,10)","v":17.555979000000001},3160.08]
[22,"2.8","ARMAÇÃO DE PILAR OU VIGA DE UMA ESTRUTURA CONVENCIONAL DE CONCRETO ARMADO UTILIZANDO AÇO CA-50 DE 10 MM",92778,"KG",4200,{"$f":"VLOOKUP(A25,CPU!$A$1:$N$3306,9)","v":12.17},{"$f":"VLOOKUP(A25,CPU!$A$1:$N$3306,10)","v":15.337850999999999},64418.97]
[23,"2.9","ARMAÇÃO DE PILAR OU VIGA DE UMA ESTRUTURA CONVENCIONAL DE CONCRETO ARMADO UTILIZANDO AÇO CA-50 DE 12,5 MM",92779,"KG",300,{"$f":"VLOOKUP(A26,CPU!$A$1:$N$3306,9)","v":10.14},{"$f":"VLOOKUP(A26,CPU!$A$1:$N$3306,10)","v":12.779442000000001},3833.83]
[24,"2.10","ARMAÇÃO DE PILAR OU VIGA DE UMA ESTRUTURA CONVENCIONAL DE CONCRETO ARMADO UTILIZANDO AÇO CA-50 DE 16 MM",92780,"KG",1200,{"$f":"VLOOKUP(A27,CPU!$A$1:$N$3306,9)","v":9.33},{"$f":"VLOOKUP(A27,CPU!$A$1:$N$3306,10)","v":11.758599},14110.32]
[25,"2.11","ARMAÇÃO DE PILAR OU VIGA DE UMA ESTRUTURA CONVENCIONAL DE CONCRETO ARMADO UTILIZANDO AÇO CA-50 DE 20 MM",92781,"KG",2000,{"$f":"VLOOKUP(A28,CPU!$A$1:$N$3306,9)","v":10.11},{"$f":"VLOOKUP(A28,CPU!$A$1:$N$3306,10)","v":12.741632999999998},25483.27]
[26,"2.12","ARMAÇÃO DE PILAR OU VIGA DE UMA ESTRUTURA CONVENCIONAL DE CONCRETO ARMADO UTILIZANDO AÇO CA-50 DE 25 MM",92782,"KG",2400,{"$f":"VLOOKUP(A29,CPU!$A$1:$N$3306,9)","v":10.26},{"$f":"VLOOKUP(A29,CPU!$A$1:$N$3306,10)","v":12.930678},31033.63]
[27,"2.13","FABRICAÇÃO DE FÔRMA PARA PILARES E VIGAS, EM CHAPA DE MADEIRA COMPENSADA RESINADA, E = 17 MM",92263,"M2",680,{"$f":"VLOOKUP(A30,CPU!$A$1:$N$3306,9)","v":162.91},{"$f":"VLOOKUP(A30,CPU!$A$1:$N$3306,10)","v":205.315473},{"$f":"ROUND(F30*H30,2)","v":139614.51999999999}]
[28,"2.14","MONTAGEM E DESMONTAGEM DE FÔRMA DE PILARES RETANGULARES E VIGAS, EM CHAPA DE MADEIRA COMPENSADA PLASTIFICADA, 10 UTILIZAÇÕES",92431,"M2",680,{"$f":"VLOOKUP(A31,CPU!$A$1:$N$3306,9)","v":34.879999999999995},{"$f":"VLOOKUP(A31,CPU!$A$1:$N$3306,10)","v":43.95926399999999},29892.3]
[29,"2.15","FABRICAÇÃO DE FÔRMA PARA LAJES, EM CHAPA DE MADEIRA COMPENSADA RESINADA, E = 17 MM",92267,"M2",250,{"$f":"VLOOKUP(A32,CPU!$A$1:$N$3306,9)","v":50.360000000000007},{"$f":"VLOOKUP(A32,CPU!$A$1:$N$3306,10)","v":63.468708000000007},{"$f":"ROUND(F32*H32,2)","v":15867.18}]
[30,"2.16","MONTAGEM E DESMONTAGEM DE FÔRMA DE LAJE MACIÇA, EM CHAPA DE MADEIRA COMPENSADA RESINADA, 2 UTILIZAÇÕES",92508,"M2",250,{"$f":"VLOOKUP(A33,CPU!$A$1:$N$3306,9)","v":48.89},{"$f":"VLOOKUP(A33,CPU!$A$1:$N$3306,10)","v":61.616067000000001},15404.02]
[31,"2.17","ESCORAMENTO DE FÔRMAS DE VIGAS E LAJES COM ESTRUTURA METÁLICA EM TORRE OU TRELIÇA, ALTURA ATÉ 18 METROS, INCLUSO MONTAGEM, TRAVAMENTO E DESMONTAGEM","101792a","M3",3000,{"$f":"VLOOKUP(A34,CPU!$A$1:$N$3306,9)","v":138.20000000000002},{"$f":"VLOOKUP(A34,CPU!$A$1:$N$3306,10)","v":174.17346000000001},{"$f":"ROUND(F34*H34,2)","v":522520.38}]
[34,"2.18","POLIESTIRENO EXPANDIDO (EPS - ISOPOR), TIPO 2F, BLOCO - FORNECIMENTO E COLOCAÇÃO","CPU.5","M3",79.996000000000009,{"$f":"VLOOKUP(A35,CPU!$A$1:$N$3306,9)","v":323.94},{"$f":"VLOOKUP(A35,CPU!$A$1:$N$3306,10)","v":408.26158199999998},{"$f":"ROUND(F35*H35,2)","v":32659.29}]
[33,"2.19","CONCRETAGEM DE ESTRUTURAS (VIGAS E LAJES) COM CONCRETO USINADO BOMBEÁVEL FCK 30 MPA - LANÇAMENTO, ADENSAMENTO E ACABAMENTO","103684.a","M3",139.99599999999998,{"$f":"VLOOKUP(A36,CPU!$A$1:$N$3306,9)","v":753.42},{"$f":"VLOOKUP(A36,CPU!$A$1:$N$3306,10)","v":949.53522599999997},132931.13]
[35,"2.20","APARELHO DE APOIO EM NEOPRENE FRETADO, COM FRETAGEM DE AÇO 4MM INTERCALADAS COM ELASTÔMERO DE 11MM E REVESTIMENTO FINAL COM ELASTÔMERO DE 6MM","CPU.6","DM3",300,{"$f":"VLOOKUP(A37,CPU!$A$1:$N$3306,9)","v":109.06},{"$f":"VLOOKUP(A37,CPU!$A$1:$N$3306,10)","v":137.448318},{"$f":"ROUND(F37*H37,2)","v":41234.5}]
["E",3,"SERVIÇOS DIVERSOS - PAVIMENTAÇÃO, LIMPEZA FINAL E SINALIZAÇÃO",{"$nulls":5},{"$f":"SUM(I39:I50)","v":367525.11}]
[36,"3.1","TRATAMENTO DE JUNTA DE DILATAÇÃO COM MANTA ASFÁLTICA ADERIDA COM MAÇARICO",98576,"M",10,{"$f":"VLOOKUP(A39,CPU!$A$1:$N$3306,9)","v":20.459999999999997},{"$f":"VLOOKUP(A39,CPU!$A$1:$N$3306,10)","v":25.785737999999995},{"$f":"ROUND(F39*H39,2)","v":257.86}]
[37,"3.2","EXECUÇÃO DE PINTURA DE LIGAÇÃO COM EMULSÃO ASFÁLTICA RR-2C",96402,"M2",300,{"$f":"VLOOKUP(A40,CPU!$A$1:$N$3306,9)","v":2.48},{"$f":"VLOOKUP(A40,CPU!$A$1:$N$3306,10)","v":3.1255440000000001},{"$f":"ROUND(F40*H40,2)","v":937.66}]
{"$rows_left_out":12}
{"sheet":"CPU","index":1,"n_rows":567,"n_cols":13,"rows_kept":567,"cut":false,"hidden":false,"merged":[[534,1,534,7],[549,1,549,7],[372,1,372,7],[386,1,386,7],[416,1,416,7],[400,1,400,7],[455,1,455,7],[468,1,468,7],[481,1,481,7],[500,1,500,7],[517,1,517,7],[434,1,434,7],[239,1,239,7],[255,1,255,7],[271,1,271,7],[289,1,289,7],[307,1,307,7],[323,1,323,7],[338,1,338,7],[355,1,355,7],[337,1,337,6],[133,1,133,7],[146,1,146,7],[161,1,161,7],[176,1,176,7],[191,1,191,7],[207,1,207,7],[223,1,223,7],[135,2,135,5],[136,2,136,3],[137,1,137,7],[142,1,142,3],[142,5,142,6],[143,1,143,6],[144,1,144,6],[145,1,145,6],[134,1,134,3],[134,4,134,7],[535,0,548,0],[535,1,535,3],[535,4,535,7],[536,2,536,5],[537,2,537,3],[538,1,538,7],[545,1,545,3],[545,5,545,6],[546,1,546,6],[547,1,547,6],[548,1,548,6],[32,0,45,0],[32,1,32,3],[32,4,32,7],[32,10,32,11],[33,2,33,5],[34,2,34,3],[35,1,35,7],[41,1,41,3],[41,5,41,6],[42,1,42,6],[43,1,43,6],[44,1,44,6],[387,0,399,0],[387,1,387,3],[387,4,387,7],[387,10,387,11],[388,2,388,5],[389,2,389,3],[390,1,390,7],[396,1,396,3],[396,5,396,6],[397,1,397,6],[398,1,398,6],[399,1,399,6],[324,0,337,0],[324,1,324,3],[324,4,324,7],[324,10,324,11],[325,2,325,5],[326,2,326,3],[327,1,327,7],[334,1,334,3],[334,5,334,6],[335,1,335,6],[336,1,336,6],[550,0,566,0],[550,1,550,3],[550,4,550,7],[550,10,550,11],[551,2,551,5],[552,2,552,3],[553,1,553,7],[563,1,563,3],[563,5,563,6],[564,1,564,6],[565,1,565,6],[566,1,566,6],[501,0,516,0],[501,1,501,3],[501,4,501,7],[501,10,501,11],[502,2,502,5],[503,2,503,3],[504,1,504,7],[513,1,513,3],[513,5,513,6],[514,1,514,6],[515,1,515,6],[516,1,516,6],[518,0,533,0],[518,1,518,3],[518,4,518,7],[518,10,518,11],[519,2,519,5],[520,2,520,3],[521,1,521,7],[530,1,530,3],[530,5,530,6],[531,1,531,6],[532,1,532,6],[533,1,533,6],[469,0,480,0],[469,1,469,3],[469,4,469,7],[469,10,469,11],[470,2,470,5],[471,2,471,3],[472,1,472,7],[477,1,477,3],[477,5,477,6],[478,1,478,6],[479,1,479,6],[480,1,480,6],[482,0,499,0],[482,1,482,3],[482,4,482,7],[482,10,482,11],[483,2,483,5],[484,2,484,3],[485,1,485,7],[496,1,496,3],[496,5,496,6],[497,1,497,6],[498,1,498,6],[499,1,499,6],[435,0,454,0],[435,1,435,3],[435,4,435,7],[435,10,435,11],[436,2,436,5],[437,2,437,3],[438,1,438,7],[451,1,451,3],[451,5,451,6],[452,1,452,6],[453,1,453,6],[454,1,454,6],[456,0,467,0],[456,1,456,3],[456,4,456,7],[456,10,456,11],[457,2,457,5],[458,2,458,3],[459,1,459,7],[464,1,464,3],[464,5,464,6],[465,1,465,6],[466,1,466,6],[467,1,467,6],[401,0,415,0],[401,1,401,3],[401,4,401,7],[401,10,401,11],[402,2,402,5],[403,2,403,3],[404,1,404,7],[412,1,412,3],[412,5,412,6],[413,1,413,6],[414,1,414,6],[415,1,415,6],[417,0,433,0],[417,1,417,3],[417,4,417,7],[417,10,417,11],[418,2,418,5],[419,2,419,3],[420,1,420,7],[430,1,430,3],[430,5,430,6],[431,1,431,6],[432,1,432,6],[433,1,433,6],[356,0,371,0],[356,1,356,3],[356,4,356,7],[356,10,356,11],[357,2,357,5],[358,2,358,3],[359,1,359,7],[368,1,368,3],[368,5,368,6],[369,1,369,6],[370,1,370,6],[371,1,371,6],[373,0,385,0],[373,1,373,3],[373,4,373,7],[373,10,373,11],[374,2,374,5],[375,2,375,3],[376,1,376,7],[382,1,382,3],[382,5,382,6],[383,1,383,6],[384,1,384,6],[385,1,385,6],[339,0,354,0],[339,1,339,3],[339,4,339,7],[339,10,339,11],[340,2,340,5],[341,2,341,3],[342,1,342,7],[351,1,351,3],[351,5,351,6],[352,1,352,6],[353,1,353,6],[354,1,354,6],[345,8,349,8],[290,0,306,0],[290,1,290,3],[290,4,290,7],[290,10,290,11],[291,2,291,5],[292,2,292,3],[293,1,293,7],[303,1,303,3],[303,5,303,6],[304,1,304,6],[305,1,305,6],[306,1,306,6],[308,0,322,0],[308,1,308,3],[308,4,308,7],[308,10,308,11],[309,2,309,5],[310,2,310,3],[311,1,311,7],[320,1,320,6],[321,1,321,6],[322,1,322,6],[319,1,319,3],[319,5,319,6],[256,0,270,0],[256,1,256,3],[256,4,256,7],[256,10,256,11],[257,2,257,5],[258,2,258,3],[259,1,259,7],[267,1,267,3],[267,5,267,6],[268,1,268,6],[269,1,269,6],[270,1,270,6],[272,0,288,0],[272,1,272,3],[272,4,272,7],[272,10,272,11],[273,2,273,5],[274,2,274,3],[275,1,275,7],[285,1,285,3],[285,5,285,6],[286,1,286,6],[287,1,287,6],[288,1,288,6],[224,0,238,0],[224,1,224,3],[224,4,224,7],[224,10,224,11],[225,2,225,5],[226,2,226,3],[227,1,227,7],[235,1,235,3],[235,5,235,6],[236,1,236,6],[237,1,237,6],[238,1,238,6],[240,0,254,0],[240,1,240,3],[240,4,240,7],[240,10,240,11],[241,2,241,5],[242,2,242,3],[243,1,243,7],[251,1,251,3],[251,5,251,6],[252,1,252,6],[253,1,253,6],[254,1,254,6],[62,10,62,11],[63,2,63,5],[64,2,64,3],[65,1,65,7],[74,1,74,3],[74,5,74,6],[75,1,75,6],[76,1,76,6],[77,1,77,6],[91,1,91,6],[92,1,92,6],[93,1,93,6],[95,0,106,0],[95,1,95,3],[95,4,95,7],[95,10,95,11],[96,2,96,5],[97,2,97,3],[98,1,98,7],[60,1,60,6],[62,1,62,3],[62,4,62,7],[79,1,79,3],[79,4,79,7],[81,2,81,3],[82,1,82,7],[90,1,90,3],[90,5,90,6],[14,10,14,11],[15,2,15,5],[16,2,16,3],[79,10,79,11],[80,2,80,5],[0,1,0,3],[0,4,0,7],[0,10,0,11],[1,2,1,5],[2,2,2,3],[3,1,3,7],[9,1,9,3],[9,5,9,6],[10,1,10,6],[17,1,17,7],[27,1,27,3],[27,5,27,6],[28,1,28,6],[29,1,29,6],[30,1,30,6],[46,1,46,3],[46,4,46,7],[46,10,46,11],[47,2,47,5],[108,10,108,11],[109,2,109,5],[110,2,110,3],[111,1,111,7],[105,1,105,6],[106,1,106,6],[107,1,107,7],[108,0,120,0],[121,1,121,3],[121,4,121,7],[119,1,119,6],[121,0,132,0],[132,1,132,6],[130,1,130,6],[131,1,131,6],[121,10,121,11],[122,2,122,5],[123,2,123,3],[124,1,124,7],[129,1,129,3],[129,5,129,6],[0,0,13,0],[14,0,31,0],[46,0,61,0],[62,0,78,0],[79,0,94,0],[116,1,116,3],[116,5,116,6],[117,1,117,6],[118,1,118,6],[108,1,108,3],[108,4,108,7],[11,1,11,6],[12,1,12,6],[14,1,14,3],[14,4,14,7],[48,2,48,3],[49,1,49,7],[57,1,57,3],[57,5,57,6],[58,1,58,6],[103,1,103,3],[103,5,103,6],[104,1,104,6],[59,1,59,6],[134,10,134,11],[134,0,145,0],[147,0,160,0],[147,1,147,3],[147,4,147,7],[147,10,147,11],[148,2,148,5],[149,2,149,3],[150,1,150,7],[157,1,157,3],[157,5,157,6],[158,1,158,6],[159,1,159,6],[160,1,160,6],[177,0,190,0],[177,1,177,3],[177,4,177,7],[177,10,177,11],[178,2,178,5],[179,2,179,3],[180,1,180,7],[187,1,187,3],[187,5,187,6],[188,1,188,6],[189,1,189,6],[190,1,190,6],[162,0,175,0],[162,1,162,3],[162,4,162,7],[162,10,162,11],[163,2,163,5],[164,2,164,3],[165,1,165,7],[172,1,172,3],[172,5,172,6],[173,1,173,6],[174,1,174,6],[175,1,175,6],[208,0,222,0],[208,1,208,3],[208,4,208,7],[192,0,206,0],[192,1,192,3],[192,4,192,7],[208,10,208,11],[209,2,209,5],[210,2,210,3],[211,1,211,7],[219,1,219,3],[219,5,219,6],[220,1,220,6],[221,1,221,6],[222,1,222,6],[192,10,192,11],[193,2,193,5],[194,2,194,3],[195,1,195,7],[203,1,203,3],[203,5,203,6],[204,1,204,6],[205,1,205,6],[206,1,206,6]]}
[0,"CODEVASF",null,null," COMPOSIÇÃO DE PREÇO UNITÁRIO",null,null,null,{"$f":"H11","v":5497.44},{"$f":"H13","v":6928.4236319999991},"BDI CALCULADO:",null,{"$f":"ORÇAMENTO!I7","v":0.26030000000000003}]
[null,"OBRA:  ",{"$f":"ORÇAMENTO!C5","v":"CONSTRUÇÃO DE PONTE SOBRE O RIO SÃO DOMINGOS (CONTINUAÇÃO)"},null,null,null,"DATA: ",{"$f":"ORÇAMENTO!C7","v":"NOVEMBRO / 2023"}]
[null,"SERVIÇO:  ",{"$f":"VLOOKUP(A1,ORÇAMENTO!A11:I40,3)","v":"MOBILIZAÇÃO E DESMOBILIZAÇÃO"},null,"Referência:",{"$f":"VLOOKUP(A1,ORÇAMENTO!A11:I40,4)","v":"CPU.1"},"UNIDADE: ",{"$f":"VLOOKUP(A1,ORÇAMENTO!A11:I40,5)","v":"GL"},"OK"]
[]
[null,"TIPO ITEM","CODIGO ITEM","DESCRIÇÃO ITEM","UNIDADE ITEM","COEFICIENTE","PRECO UNITARIO","CUSTO TOTAL"]
[null,"COMPOSICAO",73467,"CAMINHÃO TOCO, PBT 14.300 KG, CARGA ÚTIL MÁX. 9.710 KG, DIST. ENTRE EIXOS 3,56 M, POTÊNCIA 185 CV, INCLUSIVE CARROCERIA FIXA ABERTA DE MADEIRA P/ TRANSPORTE GERAL DE CARGA SECA, DIMEN. APROX. 2,50 X 6,50 X 0,50M","CHP",16,246.72,{"$f":"ROUNDDOWN(F6*G6,2)","v":3947.52}]
[null,"COMPOSICAO",91395,"CAMINHÃO TOCO, PBT 14.300 KG, CARGA ÚTIL MÁX. 9.710 KG, DIST. ENTRE EIXOS 3,56 M, POTÊNCIA 185 CV, INCLUSIVE CARROCERIA FIXA ABERTA DE MADEIRA P/ TRANSPORTE GERAL DE CARGA SECA, DIMEN. APROX. 2,50 X 6,50 X 0,50M","CHI",16,57.35,{"$f":"ROUNDDOWN(F7*G7,2)","v":917.6}]
[null,"COMPOSIÇÃO",88316,"SERVENTE COM ENCARGOS COMPLEMENTARES","H",32,19.760000000000002,632.32000000000005]
[{"$nulls":7},0]
[null,"PRODUÇÃO DA EQUIPE",null,null,1,"CUSTO ",null,{"$f":"SUM(H6:H9)","v":5497.44}]
[null,"TOTAL",{"$nulls":5},{"$f":"H10/E10","v":5497.44},"ok"]
[null,"BDI                %",{"$nulls":5},{"$f":"1+$M$1","v":1.2603}]
[null,"TOTAL DO SERVIÇO - R$",{"$nulls":5},{"$f":"H11*H12","v":6928.4236319999991}]
[]
[{"$f":"A1+1","v":1},"CODEVASF",null,null," COMPOSIÇÃO DE PREÇO UNITÁRIO",null,null,null,{"$f":"H29","v":118608.75},{"$f":"H31","v":149482.607625}]
[null,"OBRA:  ",{"$f":"$C$2","v":"CONSTRUÇÃO DE PONTE SOBRE O RIO SÃO DOMINGOS (CONTINUAÇÃO)"},null,null,null,"DATA: ",{"$f":"$H$2","v":"NOVEMBRO / 2023"}]
[null,"SERVIÇO:  ",{"$f":"VLOOKUP(A15,ORÇAMENTO!$A$11:$I$40,3)","v":"ADMINISTRAÇÃO LOCAL E MANUTENÇÃO DO CANTEIRO DE OBRAS"},null,"SINAPI","CPU","UNIDADE: ",{"$f":"VLOOKUP(A15,ORÇAMENTO!$A$11:$I$40,5)","v":"GL"},"OK"]
[]
[null,"TIPO ITEM","CODIGO ITEM","DESCRIÇÃO ITEM","UNIDADE ITEM","COEFICIENTE","PRECO UNITARIO","CUSTO TOTAL"]
[null,"INSUMO",3346,"LOCACAO DE GRUPO GERADOR *80 A 125* KVA, MOTOR DIESEL, REBOCAVEL","H",60,18.95,{"$f":"ROUNDDOWN(F20*G20,2)","v":1137}]
[null,"COMPOSICAO",101008,"CARGA DE ÁGUA EM CAMINHÃO PIPA","M3",10,5.44,54.4]
[null,"COMPOSICAO",100955,"TRANSPORTE COM CAMINHÃO PIPA, EM VIA URBANA EM LEITO NATURAL","M3XKM",100,4.88,488]
[null,"COTAÇÃO","MERC.","VEÍCULO PARA TRANSPORTE DE PESSOAL, INCLUSIVE COMBUSTÍVEL","VB",1,2100,2100]
[null,"COTAÇÃO","MERC.","TELEFONE (PLANO CONTROLE)","UNID",2,59.9,119.8]
[null,"COMPOSICAO",90777,"ENGENHEIRO CIVIL DE OBRA COM ENCARGOS COMPLEMENTARES","H",55,114.12,6276.6]
[null,"COMPOSIÇÃO",100309,"TÉCNICO EM SEGURANÇA DO TRABALHO COM ENCARGOS COMPLEMENTARES","H",55,43.73,2405.15]
[null,"COMPOSICAO",90776,"ENCARREGADO GERAL COM ENCARGOS COMPLEMENTARES","H",220,50.64,11140.8]
[null,"PRODUÇÃO DA EQUIPE",null,null,0.2,"CUSTO ",null,{"$f":"SUM(H20:H27)","v":23721.75}]
[null,"TOTAL",{"$nulls":5},{"$f":"H28/E28","v":118608.75},"ok"]
[null,"BDI                %",{"$nulls":5},{"$f":"1+$M$1","v":1.2603}]
[null,"TOTAL DO SERVIÇO - R$",{"$nulls":5},{"$f":"H29*H30","v":149482.607625}]
[]
[2,"CODEVASF",null,null," COMPOSIÇÃO DE PREÇO UNITÁRIO",null,null,null,{"$f":"H43","v":0.41},{"$f":"H45","v":0.51672299999999993}]
[null,"OBRA:  ",{"$f":"$C$2","v":"CONSTRUÇÃO DE PONTE SOBRE O RIO SÃO DOMINGOS (CONTINUAÇÃO)"},null,null,null,"DATA: ",{"$f":"$H$2","v":"NOVEMBRO / 2023"}]
[null,"SERVIÇO:  ",{"$f":"VLOOKUP(A33,ORÇAMENTO!$A$11:$I$40,3)","v":"LIMPEZA MECANIZADA DE CAMADA VEGETAL, VEGETAÇÃO E PEQUENAS ÁRVORES (DIÂMETRO DE TRONCO MENOR QUE 0,20 M)"},null,"SINAPI",{"$f":"VLOOKUP(A33,ORÇAMENTO!$A$11:$I$40,4)","v":98525},"UNIDADE: ",{"$f":"VLOOKUP(A33,ORÇAMENTO!$A$11:$I$40,5)","v":"M2"},"OK"]
[]
[null,"TIPO ITEM","CODIGO ITEM","DESCRIÇÃO ITEM","UNIDADE ITEM","COEFICIENTE","PRECO UNITARIO","CUSTO TOTAL"]
[null,"COMPOSICAO","88316","SERVENTE COM ENCARGOS COMPLEMENTARES","H","0,0030000","19,76",{"$f":"ROUNDDOWN(F38*G38,2)","v":0.05}]
[null,"COMPOSICAO","88441","JARDINEIRO COM ENCARGOS COMPLEMENTARES","H","0,0030000","24,24",7.0000000000000007E-2]
[null,"COMPOSICAO","89031","TRATOR DE ESTEIRAS, POTÊNCIA 100 HP, PESO OPERACIONAL 9,4 T, COM LÂMINA 2,19 M3","CHI","0,0024000","78,04",0.18]
{"$rows_left_out":528}
{"sheet":"BDI SERV","index":2,"n_rows":37,"n_cols":5,"rows_kept":37,"cut":false,"hidden":false,"merged":[[36,0,36,5],[3,1,4,1],[3,2,4,2],[0,1,2,4],[32,0,34,5],[28,0,28,5],[30,1,30,2],[31,1,31,2]]}
[null,"DETALHAMENTO DO BDI - SERVIÇOS"]
[]
[]
[null,"Item","Descrição dos Serviços","%","%"]
[null,null,null,"PV","CD"]
[]
[null,1,"ADMINISTRAÇÃO CENTRAL"," ",4]
[null,"1.1","ESCRITÓRIO CENTRAL"," "," "]
[null,"1.2","VIAGENS"," "," "]
[null,"1.3","OUTROS"," "," "]
[null," "," "," "," "]
[null,2,"IMPOSTOS E TAXAS",{"$f":"SUM(D13:D16)","v":7.65},{"$f":"SUM(E13:E16)","v":9.57}]
[null,"2.1","ISS (*)",{"$f":"0.8*5","v":4},{"$f":"ROUND(D13*1.2515,2)","v":5.01}]
[null,"2.2","PIS",0.65,0.81]
[null,"2.3","Cofins",3,3.75]
[null,"2.4","CONTRIBUIÇÃO PREVIDENCIÁRIA SOBRE A RENDA BRUTA",0,0]
[]
[null,3,"TAXA DE RISCO"," ",{"$f":"SUM(E19:E22)","v":2.6799999999999997}]
[null,"3.1","SEGURO",null,0.61]
[null,"3.2","RISCO",null,1.46]
[null,"3.3","GARANTIA",null,0.61]
[]
[null,4,"DESPESAS FINANCEIRAS"," ",1.02]
[]
[null,5,"LUCRO",null,8]
[]
[null," ","BDI - CALCULADO"," ",{"$f":"ROUND((((1+(E7+E18)/100)*(1+E23/100)*(1+E25/100)/(1-D12/100)-1)*100),2)","v":26.03}]
[]
["BDI = ((1+((AC+S+R+G)/100))x(1+DF/100)x(1+L/100)/(1-I/100)-1)*100"]
[]
[null,"BDI (CALCULADO):",null,{"$f":"ROUND((((1+((E7+E18)/100))*(1+E23/100)*(1+E25/100))/(1-D12/100)-1)*100,2)","v":26.03},"%"]
[null," "]
["(*) ISS CONFORME LEI COMPLEMENTAR Nº 006/2003 E LEI COMPLEMENTAR Nº 59/2009 QUE ALTEROU A ALÍQUOTA PARA ITENS 7 A 7.05 (ART. 9º ) - QUANT. ESTIMADA DE MATERIAIS = 20%"]
[]
[]
[]
["BDI EM CONFORMIDADE COM OS ACÓRDÃOS Nº 2369/2011 e ACÓRDÃO Nº 2.622/2013 - TCU - PLENÁRIO"]

{"sheet":"CRONOGRAMA","index":3,"n_rows":14,"n_cols":11,"rows_kept":14,"cut":false,"hidden":false,"merged":[[7,0,8,0],[9,0,10,0],[0,1,0,10],[3,1,3,6],[5,0,6,0],[5,2,6,2],[1,1,2,1],[5,1,6,1],[1,2,2,4],[11,1,12,2],[13,1,17,10],[9,2,10,2],[9,1,10,1],[7,1,8,1],[7,2,8,2]]}
[null,"CRONOGRAMA FÍSICO-FINANCEIRO"]
[null,"OBRA: ",{"$f":"ORÇAMENTO!C5","v":"CONSTRUÇÃO DE PONTE SOBRE O RIO SÃO DOMINGOS (CONTINUAÇÃO)"},null,null,"VALOR:",{"$f":"ORÇAMENTO!I51","v":1825219.63}]
[{"$nulls":5},"PRAZO: ","150 DIAS "]
[]
[null,"ITEM","ETAPAS/DESCRIÇAO","FISICO/  FINANCEIRO","TOTAL    ETAPAS","MÊS 1","MÊS 2","MÊS 3","MÊS 4","MÊS 5","TOTAL"]
["A",{"$f":"VLOOKUP(A6,ORÇAMENTO!$A$10:$I$51,2)","v":1},{"$f":"VLOOKUP(A6,ORÇAMENTO!$A$10:$I$51,3)","v":"SERVIÇOS PRELIMINARES "},"FISICO ",{"$f":"ROUND(E7/$G$2,4)","v":0.1193},0.2,0.2,0.2,0.2,0.2,{"$f":"SUM(F6:J6)","v":1}]
[null,null,null,"FINANCEIRO",{"$f":"ORÇAMENTO!I10","v":217707.91000000003},{"$f":"ROUND($E$7*F6,2)","v":43541.58},43541.58,{"$f":"ROUND($E$7*H6,2)","v":43541.58},43541.58,43541.58,{"$f":"SUM(F7:J7)","v":217707.90000000002}]
["D",{"$f":"VLOOKUP(A8,ORÇAMENTO!$A$10:$I$51,2)","v":2},{"$f":"VLOOKUP(A8,ORÇAMENTO!$A$10:$I$51,3)","v":"SUPERESTRUTURA E LAJES DE APROXIMAÇÃO"},"FISICO ",{"$f":"ROUND(E9/$G$2,4)","v":0.6794},0.1,0.7,0.2,0,0,{"$f":"SUM(F8:J8)","v":1}]
[null,null,null,"FINANCEIRO",{"$f":"ORÇAMENTO!I17","v":1239986.6099999999},{"$f":"ROUND($E$9*F8,2)","v":123998.66},{"$f":"ROUND($E$9*G8,2)","v":867990.63},247997.32,0,0,{"$f":"SUM(F9:J9)","v":1239986.6100000001}]
["E",{"$f":"VLOOKUP(A10,ORÇAMENTO!$A$10:$I$51,2)","v":3},{"$f":"VLOOKUP(A10,ORÇAMENTO!$A$10:$I$51,3)","v":"SERVIÇOS DIVERSOS - PAVIMENTAÇÃO, LIMPEZA FINAL E SINALIZAÇÃO"},"FISICO ",{"$f":"ROUND(E11/$G$2,4)","v":0.2014},0,0,0.25,0.5,0.25,{"$f":"SUM(F10:J10)","v":1}]
[null,null,null,"FINANCEIRO",{"$f":"ORÇAMENTO!I38","v":367525.11},{"$f":"ROUND($E$11*F10,2)","v":0},0,{"$f":"ROUND($E$11*H10,2)","v":91881.279999999999},183762.56,91881.279999999999,{"$f":"SUM(F11:J11)","v":367525.12}]
[null,"TOTAL",null,"FISICO ",{"$f":"SUM(F12:J12)","v":1},{"$f":"F13/E13","v":9.179182452689269E-2},{"$f":"G13/E13","v":0.49940960255835076},{"$f":"H13/E13","v":0.21006796864221761},{"$f":"I13/E13","v":0.12453522648120983},{"$f":"J13/E13","v":7.4195377791329148E-2},{"$f":"SUM(F12:J12)","v":1}]
[null,null,null,"FINANCEIRO",{"$f":"E7+E11+E9","v":1825219.63},{"$f":"F7+F11+F9","v":167540.24},{"$f":"G7+G11+G9","v":911532.21},383420.18,227304.14,135422.85999999999,{"$f":"SUM(F13:J13)","v":1825219.63}]
[null,"OBSERVAÇÕES:"]