{"text_format":"2","workbook":"xlsx","n_sheets":4,"sheets":["ORÇAMENTO","CPU","BDI SERV","CRONOGRAMA"],"not_rendered":{"charts":0,"images":4,"macros":0,"external_links":0,"defined_names":5,"comments":0,"pivot_tables":0},"unopened":[],"bounds":{"document_bytes":16777216,"sheet_cells":100000,"run_cost":"one","rows_first":2000,"rows_last":500,"rows_between":2000,"halvings":0,"cell_chars":16384,"cell_head_chars":4096},"cells_cut":0,"cells_raw":0,"read":"whole","date_system":"1900"}

{"sheet":"ORÇAMENTO","index":0,"n_rows":51,"n_cols":9,"rows_kept":51,"cut":false,"hidden":false,"merged":[[7,6,7,7],[50,1,50,2],[0,0,8,0],[0,2,0,8],[1,2,1,8],[2,2,2,8],[4,2,4,8],[6,6,6,7],[7,1,7,2],[5,2,5,8]]}
["<---- NUMERAR SERVIÇOS PARA CPU",null,"Ministério da Integração Nacional"]
[null,null,"Companhia de Desenvolvimento dos Vales do São Francisco e do Parnaíba"]
[null,null,"1ª Superintendência Regional"]
[]
[null,"OBRA: ","CONSTRUÇÃO DE PONTE SOBRE O RIO SÃO DOMINGOS (CONTINUAÇÃO)"]
[null,"LOCAL:","BURITIS - MG"]
[null,"DATA:","NOVEMBRO / 2023",null,null,null,"BDI Serviços:",null,{"$f":"'BDI SERV'!D31/100","v":0.26030000000000003}]
[null,"PRAZO DE EXECUÇÃO:  150 DIAS"]
[null,"ITEM","DISCRIMINAÇÃO","REFER.","UNID.","QUANT.","P. UNITÁRIO","P.UNIT.C/ BDI","P. TOTAL"]
["A",1,"SERVIÇOS PRELIMINARES ",{"$nulls":5},{"$f":"SUM(I11:I16)","v":217707.91000000003}]
[0,"1.1","MOBILIZAÇÃO E DESMOBILIZAÇÃO","CPU.1","GL",1,{"$f":"VLOOKUP(A11,CPU!$A$1:$N$3306,9)","v":5497.44},{"$f":"VLOOKUP(A11,CPU!$A$1:$N$3306,10)","v":6928.4236319999991},{"$f":"ROUND(F11*H11,2)","v":6928.42}]
[1,"1.2","ADMINISTRAÇÃO LOCAL E MANUTENÇÃO DO CANTEIRO DE OBRAS","CPU.2","GL",1,{"$f":"VLOOKUP(A12,CPU!$A$1:$N$3306,9)","v":118608.75},{"$f":"VLOOKUP(A12,CPU!$A$1:$N$3306,10)","v":149482.607625},{"$f":"ROUND(F12*H12,2)","v":149482.60999999999}]
[2,"1.3","LIMPEZA MECANIZADA DE CAMADA VEGETAL, VEGETAÇÃO E PEQUENAS ÁRVORES (DIÂMETRO DE TRONCO MENOR QUE 0,20 M)",98525,"M2",4000,{"$f":"VLOOKUP(A13,CPU!$A$1:$N$3306,9)","v":0.41},{"$f":"VLOOKUP(A13,CPU!$A$1:$N$3306,10)","v":0.51672299999999993},{"$f":"ROUND(F13*H13,2)","v":2066.89}]
[3,"1.4","INSTALAÇÕES E CANTEIRO DE OBRAS","CPU.3","GL",1,{"$f":"VLOOKUP(A14,CPU!$A$1:$N$3306,9)","v":31394.1},{"$f":"VLOOKUP(A14,CPU!$A$1:$N$3306,10)","v":39565.984229999995},{"$f":"ROUND(F14*H14,2)","v":39565.980000000003}]
[4,"1.5","PLACA DE OBRA EM CHAPA DE AÇO GALVANIZADO",103689,"M2",4,{"$f":"VLOOKUP(A15,CPU!$A$1:$N$3306,9)","v":367.02},{"$f":"VLOOKUP(A15,CPU!$A$1:$N$3306,10)","v":462.55530599999997},{"$f":"ROUND(F15*H15,2)","v":1850.22}]
[5,"1.6","MOBILIZAÇÃO E DESMOBILIZAÇÃO DE GUINDASTE HIDRÁULICO AUTOPROPELIDO, COM LANÇA TELESCÓPICA","CPU.4","M",1,{"$f":"VLOOKUP(A16,CPU!$A$1:$N$3306,9)","v":14134.560000000001},{"$f":"VLOOKUP(A16,CPU!$A$1:$N$3306,10)","v":17813.785968},{"$f":"ROUND(F16*H16,2)","v":17813.79}]
["D",2,"SUPERESTRUTURA E LAJES DE APROXIMAÇÃO",{"$nulls":5},{"$f":"SUM(I18:I37)","v":1239986.6099999999}]
[13,"2.1","TRANSPORTE COM CAMINHÃO CARROCERIA 9T, EM VIA URBANA PAVIMENTADA (MAT. DIVERSOS - AÇO, MADEIRA, CIMENTO)",100948,"TXKM",60000.000235759995,{"$f":"VLOOKUP(A18,CPU!$A$1:$N$3306,9)","v":0.88},{"$f":"VLOOKUP(A18,CPU!$A$1:$N$3306,10)","v":1.109064},{"$f":"ROUND(F18*H18,2)","v":66543.839999999997}]
[14,"2.2","TRANSPORTE COM CAMINHÃO CARROCERIA 9T, EM VIA URBANA EM REVESTIMENTO PRIMÁRIO (MAT. DIVERSOS - AÇO, MADEIRA, CIMENTO)",100945,"TXKM",2399.9989412799996,{"$f":"VLOOKUP(A19,CPU!$A$1:$N$3306,9)","v":2.8},{"$f":"VLOOKUP(A19,CPU!$A$1:$N$3306,10)","v":3.5288399999999998},{"$f":"ROUND(F19*H19,2)","v":8469.2099999999991}]
[15,"2.3","TRANSPORTE COM CAMINHÃO BASCULANTE OU BETONEIRA, EM VIA URBANA PAVIMENTADA (MAT. DIVERSOS - CONCRETO, AREIA, BRITA, SOLO, ENTULHO)",93590,"M3XKM",29999.996039999995,{"$f":"VLOOKUP(A20,CPU!$A$1:$N$3306,9)","v":0.97},{"$f":"VLOOKUP(A20,CPU!$A$1:$N$3306,10)","v":1.222491},{"$f":"ROUND(F20*H20,2)","v":36674.730000000003}]
[16,"2.4","TRANSPORTE COM CAMINHÃO BASCULANTE OU BETONEIRA, EM VIA URBANA EM REVESTIMENTO PRIMÁRIO (MAT. DIVERSOS - CONCRETO, AREIA, BRITA, SOLO, ENTULHO)",93589,"M3XKM",1500.0031199999999,{"$f":"VLOOKUP(A21,CPU!$A$1:$N$3306,9)","v":2.67},{"$f":"VLOOKUP(A21,CPU!$A$1:$N$3306,10)","v":3.3650009999999999},{"$f":"ROUND(F21*H21,2)","v":5047.51}]
[19,"2.5","ARMAÇÃO DE PILAR OU VIGA DE UMA ESTRUTURA CONVENCIONAL DE CONCRETO ARMADO UTILIZANDO AÇO CA-60 DE 5,0 MM",92775,"KG",210,{"$f":"VLOOKUP(A22,CPU!$A$1:$N$3306,9)","v":17.03},{"$f":"VLOOKUP(A22,CPU!$A$1:$N$3306,10)","v":21.462909},{"$f":"ROUND(F22*H22,2)","v":4507.21}]
[20,"2.6","ARMAÇÃO DE PILAR OU VIGA DE UMA ESTRUTURA CONVENCIONAL DE CONCRETO ARMADO UTILIZANDO AÇO CA-50 DE 6,3 MM",92776,"KG",2400,{"$f":"VLOOKUP(A23,CPU!$A$1:$N$3306,9)","v":15.399999999999999},{"$f":"VLOOKUP(A23,CPU!$A$1:$N$3306,10)","v":19.408619999999999},{"$f":"ROUND(F23*H23,2)","v":46580.69}]
[21,"2.7","ARMAÇÃO DE PILAR OU VIGA DE UMA ESTRUTURA CONVENCIONAL DE CONCRETO ARMADO UTILIZANDO AÇO CA-50 DE 8 MM",92777,"KG",180,{"$f":"VLOOKUP(A24,CPU!$A$1:$N$3306,9)","v":13.93},{"$f":"VLOOKUP(A24,CPU!$A$1:$N$3306,10)","v":17.555979000000001},3160.08]
[22,"2.8","ARMAÇÃO DE PILAR OU VIGA DE UMA ESTRUTURA CONVENCIONAL DE CONCRETO ARMADO UTILIZANDO AÇO CA-50 DE 10 MM",92778,"KG",4200,{"$f":"VLOOKUP(A25,CPU!$A$1:$N$3306,9)","v":12.17},{"$f":"VLOOKUP(A25,CPU!$A$1:$N$3306,10)","v":15.337850999999999},64418.97]
[23,"2.9","ARMAÇÃO DE PILAR OU VIGA DE UMA ESTRUTURA CONVENCIONAL DE CONCRETO ARMADO UTILIZANDO AÇO CA-50 DE 12,5 MM",92779,"KG",300,{"$f":"VLOOKUP(A26,CPU!$A$1:$N$3306,9)","v":10.14},{"$f":"VLOOKUP(A26,CPU!$A$1:$N$3306,10)","v":12.779442000000001},3833.83]
[24,"2.10","ARMAÇÃO DE PILAR OU VIGA DE UMA ESTRUTURA CONVENCIONAL DE CONCRETO ARMADO UTILIZANDO AÇO CA-50 DE 16 MM",92780,"KG",1200,{"$f":"VLOOKUP(A27,CPU!$A$1:$N$3306,9)","v":9.33},{"$f":"VLOOKUP(A27,CPU!$A$1:$N$3306,10)","v":11.758599},14110.32]
[25,"2.11","ARMAÇÃO DE PILAR OU VIGA DE UMA ESTRUTURA CONVENCIONAL DE CONCRETO ARMADO UTILIZANDO AÇO CA-50 DE 20 MM",92781,"KG",2000,{"$f":"VLOOKUP(A28,CPU!$A$1:$N$3306,9)","v":10.11},{"$f":"VLOOKUP(A28,CPU!$A$1:$N$3306,10)","v":12.741632999999998},25483.27]
[26,"2.12","ARMAÇÃO DE PILAR OU VIGA DE UMA ESTRUTURA CONVENCIONAL DE CONCRETO ARMADO UTILIZANDO AÇO CA-50 DE 25 MM",92782,"KG",2400,{"$f":"VLOOKUP(A29,CPU!$A$1:$N$3306,9)","v":10.26},{"$f":"VLOOKUP(A29,CPU!$A$1:$N$3306,10)","v":12.930678},31033.63]
[27,"2.13","FABRICAÇÃO DE FÔRMA PARA PILARES E VIGAS, EM CHAPA DE MADEIRA COMPENSADA RESINADA, E = 17 MM",92263,"M2",680,{"$f":"VLOOKUP(A30,CPU!$A$1:$N$3306,9)","v":162.91},{"$f":"VLOOKUP(A30,CPU!$A$1:$N$3306,10)","v":205.315473},{"$f":"ROUND(F30*H30,2)","v":139614.51999999999}]
[28,"2.14","MONTAGEM E DESMONTAGEM DE FÔRMA DE PILARES RETANGULARES E VIGAS, EM CHAPA DE MADEIRA COMPENSADA PLASTIFICADA, 10 UTILIZAÇÕES",92431,"M2",680,{"$f":"VLOOKUP(A31,CPU!$A$1:$N$3306,9)","v":34.879999999999995},{"$f":"VLOOKUP(A31,CPU!$A$1:$N$3306,10)","v":43.95926399999999},29892.3]
[29,"2.15","FABRICAÇÃO DE FÔRMA PARA LAJES, EM CHAPA DE MADEIRA COMPENSADA RESINADA, E = 17 MM",92267,"M2",250,{"$f":"VLOOKUP(A32,CPU!$A$1:$N$3306,9)","v":50.360000000000007},{"$f":"VLOOKUP(A32,CPU!$A$1:$N$3306,10)","v":63.468708000000007},{"$f":"ROUND(F32*H32,2)","v":15867.18}]
[30,"2.16","MONTAGEM E DESMONTAGEM DE FÔRMA DE LAJE MACIÇA, EM CHAPA DE MADEIRA COMPENSADA RESINADA, 2 UTILIZAÇÕES",92508,"M2",250,{"$f":"VLOOKUP(A33,CPU!$A$1:$N$3306,9)","v":48.89},{"$f":"VLOOKUP(A33,CPU!$A$1:$N$3306,10)","v":61.616067000000001},15404.02]
[31,"2.17","ESCORAMENTO DE FÔRMAS DE VIGAS E LAJES COM ESTRUTURA METÁLICA EM TORRE OU TRELIÇA, ALTURA ATÉ 18 METROS, INCLUSO MONTAGEM, TRAVAMENTO E DESMONTAGEM","101792a","M3",3000,{"$f":"VLOOKUP(A34,CPU!$A$1:$N$3306,9)","v":138.20000000000002},{"$f":"VLOOKUP(A34,CPU!$A$1:$N$3306,10)","v":174.17346000000001},{"$f":"ROUND(F34*H34,2)","v":522520.38}]
[34,"2.18","POLIESTIRENO EXPANDIDO (EPS - ISOPOR), TIPO 2F, BLOCO - FORNECIMENTO E COLOCAÇÃO","CPU.5","M3",79.996000000000009,{"$f":"VLOOKUP(A35,CPU!$A$1:$N$3306,9)","v":323.94},{"$f":"VLOOKUP(A35,CPU!$A$1:$N$3306,10)","v":408.26158199999998},{"$f":"ROUND(F35*H35,2)","v":32659.29}]
[33,"2.19","CONCRETAGEM DE ESTRUTURAS (VIGAS E LAJES) COM CONCRETO USINADO BOMBEÁVEL FCK 30 MPA - LANÇAMENTO, ADENSAMENTO E ACABAMENTO","103684.a","M3",139.99599999999998,{"$f":"VLOOKUP(A36,CPU!$A$1:$N$3306,9)","v":753.42},{"$f":"VLOOKUP(A36,CPU!$A$1:$N$3306,10)","v":949.53522599999997},132931.13]
[35,"2.20","APARELHO DE APOIO EM NEOPRENE FRETADO, COM FRETAGEM DE AÇO 4MM INTERCALADAS COM ELASTÔMERO DE 11MM E REVESTIMENTO FINAL COM ELASTÔMERO DE 6MM","CPU.6","DM3",300,{"$f":"VLOOKUP(A37,CPU!$A$1:$N$3306,9)","v":109.06},{"$f":"VLOOKUP(A37,CPU!$A$1:$N$3306,10)","v":137.448318},{"$f":"ROUND(F37*H37,2)","v":41234.5}]
["E",3,"SERVIÇOS DIVERSOS - PAVIMENTAÇÃO, LIMPEZA FINAL E SINALIZAÇÃO",{"$nulls":5},{"$f":"SUM(I39:I50)","v":367525.11}]
[36,"3.1","TRATAMENTO DE JUNTA DE DILATAÇÃO COM MANTA ASFÁLTICA ADERIDA COM MAÇARICO",98576,"M",10,{"$f":"VLOOKUP(A39,CPU!$A$1:$N$3306,9)","v":20.459999999999997},{"$f":"VLOOKUP(A39,CPU!$A$1:$N$3306,10)","v":25.785737999999995},{"$f":"ROUND(F39*H39,2)","v":257.86}]
[37,"3.2","EXECUÇÃO DE PINTURA DE LIGAÇÃO COM EMULSÃO ASFÁLTICA RR-2C",96402,"M2",300,{"$f":"VLOOKUP(A40,CPU!$A$1:$N$3306,9)","v":2.48},{"$f":"VLOOKUP(A40,CPU!$A$1:$N$3306,10)","v":3.1255440000000001},{"$f":"ROUND(F40*H40,2)","v":937.66}]
[38,"3.3","EXECUÇÃO DE PAVIMENTO COM APLICAÇÃO DE CONCRETO ASFÁLTICO, CAMADA DE ROLAMENTO - EXCLUSIVE CARGA E TRANSPORTE",95995,"M3",9,{"$f":"VLOOKUP(A41,CPU!$A$1:$N$3306,9)","v":1855.72},{"$f":"VLOOKUP(A41,CPU!$A$1:$N$3306,10)","v":2338.7639159999999},{"$f":"ROUND(F41*H41,2)","v":21048.880000000001}]
[39,"3.4","TRANSPORTE DE MATERIAL ASFÁLTICO EM VIA URBANA EM REVESTIMENTO PRIMÁRIO",100965,"TXKM",120.001,{"$f":"VLOOKUP(A42,CPU!$A$1:$N$3306,9)","v":1.5299999999999998},{"$f":"VLOOKUP(A42,CPU!$A$1:$N$3306,10)","v":1.9282589999999997},231.39]
[40,"3.5","TRANSPORTE DE MATERIAL ASFÁLTICO EM VIA URBANA PAVIMENTADA",102330,"TXKM",5200.0040000000008,{"$f":"VLOOKUP(A43,CPU!$A$1:$N$3306,9)","v":1.4200000000000002},{"$f":"VLOOKUP(A43,CPU!$A$1:$N$3306,10)","v":1.7896260000000002},9306.06]
[41,"3.6","PINTURA DE EIXO VIÁRIO SOBRE ASFALTO COM TINTA RETRORREFLETIVA A BASE DE RESINA ACRÍLICA COM MICROESFERAS DE VIDRO, APLICAÇÃO MECÂNICA COM DEMARCADORA AUTOPROPELIDA",102512,"M",36,{"$f":"VLOOKUP(A44,CPU!$A$1:$N$3306,9)","v":5.84},{"$f":"VLOOKUP(A44,CPU!$A$1:$N$3306,10)","v":7.3601519999999994},264.97000000000003]
[42,"3.7","PLACA DE AÇO CARBONO COM PELÍCULA REFLETIVA GRAU TÉCNICO TIPO I DA ABNT - PLACA CIRCULAR, INCLUSIVE POSTE DE SUSTENTAÇÃO - FORNECIMENTO E INSTALAÇÃO","RO-41841","M2",3.5044000000000004,{"$f":"VLOOKUP(A45,CPU!$A$1:$N$3306,9)","v":835.47},{"$f":"VLOOKUP(A45,CPU!$A$1:$N$3306,10)","v":1052.942841},{"$f":"ROUND(F45*H45,2)","v":3689.93}]
[43,"3.8","PLACA DE AÇO CARBONO COM PELÍCULA REFLETIVA GRAU TÉCNICO TIPO I DA ABNT - PLACA QUADRADA, INCLUSIVE POSTE DE SUSTENTAÇÃO - FORNECIMENTO E INSTALAÇÃO","RO-41842","M2",6.0000000000000009,{"$f":"VLOOKUP(A46,CPU!$A$1:$N$3306,9)","v":803.57},{"$f":"VLOOKUP(A46,CPU!$A$1:$N$3306,10)","v":1012.739271},6076.44]
[44,"3.9","CARGA, MANOBRA E DESCARGA DE SOLOS E MATERIAIS EM GERAL (ENTULHO) EM CAMINHÃO BASCULANTE",100984,"M3",5600,{"$f":"VLOOKUP(A47,CPU!$A$1:$N$3306,9)","v":9.0499999999999989},{"$f":"VLOOKUP(A47,CPU!$A$1:$N$3306,10)","v":11.405714999999999},63872]
[45,"3.10","EXECUÇÃO E COMPACTAÇÃO DE ATERRO COM SOLO PREDOMINANTEMENTE ARGILOSO - EXCLUSIVE SOLO, CARGA E TRANSPORTE (ENCABEÇAMENTO)",96385,"M3",5000,{"$f":"VLOOKUP(A48,CPU!$A$1:$N$3306,9)","v":11.940000000000001},{"$f":"VLOOKUP(A48,CPU!$A$1:$N$3306,10)","v":15.047982000000001},{"$f":"ROUND(F48*H48,2)","v":75239.91}]
[15,"3.11","TRANSPORTE COM CAMINHÃO BASCULANTE DE 10 M³, EM VIA URBANA PAVIMENTADA (MAT. DIVERSOS - AREIA, BRITA, SOLO, ENTULHO)",93590,"M3XKM",4000,{"$f":"VLOOKUP(A49,CPU!$A$1:$N$3306,9)","v":0.97},{"$f":"VLOOKUP(A49,CPU!$A$1:$N$3306,10)","v":1.222491},4889.96]
[16,"3.12","TRANSPORTE COM CAMINHÃO BASCULANTE DE 10 M³, EM VIA URBANA EM LEITO NATURAL (MAT. DIVERSOS - AREIA, BRITA, SOLO, ENTULHO)",93589,"M3XKM",54000,{"$f":"VLOOKUP(A50,CPU!$A$1:$N$3306,9)","v":2.67},{"$f":"VLOOKUP(A50,CPU!$A$1:$N$3306,10)","v":3.3650009999999999},181710.05]
[null,"TOTAL GERAL DA OBRA COM BDI ",{"$nulls":6},{"$f":"SUM(I10,I17,I38)","v":1825219.63}]

{"sheet":"CPU","index":1,"n_rows":567,"n_cols":13,"rows_kept":567,"cut":false,"hidden":false,"merged":[[534,1,534,7],[549,1,549,7],[372,1,372,7],[386,1,386,7],[416,1,416,7],[400,1,400,7],[455,1,455,7],[468,1,468,7],[481,1,481,7],[500,1,500,7],[517,1,517,7],[434,1,434,7],[239,1,239,7],[255,1,255,7],[271,1,271,7],[289,1,289,7],[307,1,307,7],[323,1,323,7],[338,1,338,7],[355,1,355,7],[337,1,337,6],[133,1,133,7],[146,1,146,7],[161,1,161,7],[176,1,176,7],[191,1,191,7],[207,1,207,7],[223,1,223,7],[135,2,135,5],[136,2,136,3],[137,1,137,7],[142,1,142,3],[142,5,142,6],[143,1,143,6],[144,1,144,6],[145,1,145,6],[134,1,134,3],[134,4,134,7],[535,0,548,0],[535,1,535,3],[535,4,535,7],[536,2,536,5],[537,2,537,3],[538,1,538,7],[545,1,545,3],[545,5,545,6],[546,1,546,6],[547,1,547,6],[548,1,548,6],[32,0,45,0],[32,1,32,3],[32,4,32,7],[32,10,32,11],[33,2,33,5],[34,2,34,3],[35,1,35,7],[41,1,41,3],[41,5,41,6],[42,1,42,6],[43,1,43,6],[44,1,44,6],[387,0,399,0],[387,1,387,3],[387,4,387,7],[387,10,387,11],[388,2,388,5],[389,2,389,3],[390,1,390,7],[396,1,396,3],[396,5,396,6],[397,1,397,6],[398,1,398,6],[399,1,399,6],[324,0,337,0],[324,1,324,3],[324,4,324,7],[324,10,324,11],[325,2,325,5],[326,2,326,3],[327,1,327,7],[334,1,334,3],[334,5,334,6],[335,1,335,6],[336,1,336,6],[550,0,566,0],[550,1,550,3],[550,4,550,7],[550,10,550,11],[551,2,551,5],[552,2,552,3],[553,1,553,7],[563,1,563,3],[563,5,563,6],[564,1,564,6],[565,1,565,6],[566,1,566,6],[501,0,516,0],[501,1,501,3],[501,4,501,7],[501,10,501,11],[502,2,502,5],[503,2,503,3],[504,1,504,7],[513,1,513,3],[513,5,513,6],[514,1,514,6],[515,1,515,6],[516,1,516,6],[518,0,533,0],[518,1,518,3],[518,4,518,7],[518,10,518,11],[519,2,519,5],[520,2,520,3],[521,1,521,7],[530,1,530,3],[530,5,530,6],[531,1,531,6],[532,1,532,6],[533,1,533,6],[469,0,480,0],[469,1,469,3],[469,4,469,7],[469,10,469,11],[470,2,470,5],[471,2,471,3],[472,1,472,7],[477,1,477,3],[477,5,477,6],[478,1,478,6],[479,1,479,6],[480,1,480,6],[482,0,499,0],[482,1,482,3],[482,4,482,7],[482,10,482,11],[483,2,483,5],[484,2,484,3],[485,1,485,7],[496,1,496,3],[496,5,496,6],[497,1,497,6],[498,1,498,6],[499,1,499,6],[435,0,454,0],[435,1,435,3],[435,4,435,7],[435,10,435,11],[436,2,436,5],[437,2,437,3],[438,1,438,7],[451,1,451,3],[451,5,451,6],[452,1,452,6],[453,1,453,6],[454,1,454,6],[456,0,467,0],[456,1,456,3],[456,4,456,7],[456,10,456,11],[457,2,457,5],[458,2,458,3],[459,1,459,7],[464,1,464,3],[464,5,464,6],[465,1,465,6],[466,1,466,6],[467,1,467,6],[401,0,415,0],[401,1,401,3],[401,4,401,7],[401,10,401,11],[402,2,402,5],[403,2,403,3],[404,1,404,7],[412,1,412,3],[412,5,412,6],[413,1,413,6],[414,1,414,6],[415,1,415,6],[417,0,433,0],[417,1,417,3],[417,4,417,7],[417,10,417,11],[418,2,418,5],[419,2,419,3],[420,1,420,7],[430,1,430,3],[430,5,430,6],[431,1,431,6],[432,1,432,6],[433,1,433,6],[356,0,371,0],[356,1,356,3],[356,4,356,7],[356,10,356,11],[357,2,357,5],[358,2,358,3],[359,1,359,7],[368,1,368,3],[368,5,368,6],[369,1,369,6],[370,1,370,6],[371,1,371,6],[373,0,385,0],[373,1,373,3],[373,4,373,7],[373,10,373,11],[374,2,374,5],[375,2,375,3],[376,1,376,7],[382,1,382,3],[382,5,382,6],[383,1,383,6],[384,1,384,6],[385,1,385,6],[339,0,354,0],[339,1,339,3],[339,4,339,7],[339,10,339,11],[340,2,340,5],[341,2,341,3],[342,1,342,7],[351,1,351,3],[351,5,351,6],[352,1,352,6],[353,1,353,6],[354,1,354,6],[345,8,349,8],[290,0,306,0],[290,1,290,3],[290,4,290,7],[290,10,290,11],[291,2,291,5],[292,2,292,3],[293,1,293,7],[303,1,303,3],[303,5,303,6],[304,1,304,6],[305,1,305,6],[306,1,306,6],[308,0,322,0],[308,1,308,3],[308,4,308,7],[308,10,308,11],[309,2,309,5],[310,2,310,3],[311,1,311,7],[320,1,320,6],[321,1,321,6],[322,1,322,6],[319,1,319,3],[319,5,319,6],[256,0,270,0],[256,1,256,3],[256,4,256,7],[256,10,256,11],[257,2,257,5],[258,2,258,3],[259,1,259,7],[267,1,267,3],[267,5,267,6],[268,1,268,6],[269,1,269,6],[270,1,270,6],[272,0,288,0],[272,1,272,3],[272,4,272,7],[272,10,272,11],[273,2,273,5],[274,2,274,3],[275,1,275,7],[285,1,285,3],[285,5,285,6],[286,1,286,6],[287,1,287,6],[288,1,288,6],[224,0,238,0],[224,1,224,3],[224,4,224,7],[224,10,224,11],[225,2,225,5],[226,2,226,3],[227,1,227,7],[235,1,235,3],[235,5,235,6],[236,1,236,6],[237,1,237,6],[238,1,238,6],[240,0,254,0],[240,1,240,3],[240,4,240,7],[240,10,240,11],[241,2,241,5],[242,2,242,3],[243,1,243,7],[251,1,251,3],[251,5,251,6],[252,1,252,6],[253,1,253,6],[254,1,254,6],[62,10,62,11],[63,2,63,5],[64,2,64,3],[65,1,65,7],[74,1,74,3],[74,5,74,6],[75,1,75,6],[76,1,76,6],[77,1,77,6],[91,1,91,6],[92,1,92,6],[93,1,93,6],[95,0,106,0],[95,1,95,3],[95,4,95,7],[95,10,95,11],[96,2,96,5],[97,2,97,3],[98,1,98,7],[60,1,60,6],[62,1,62,3],[62,4,62,7],[79,1,79,3],[79,4,79,7],[81,2,81,3],[82,1,82,7],[90,1,90,3],[90,5,90,6],[14,10,14,11],[15,2,15,5],[16,2,16,3],[79,10,79,11],[80,2,80,5],[0,1,0,3],[0,4,0,7],[0,10,0,11],[1,2,1,5],[2,2,2,3],[3,1,3,7],[9,1,9,3],[9,5,9,6],[10,1,10,6],[17,1,17,7],[27,1,27,3],[27,5,27,6],[28,1,28,6],[29,1,29,6],[30,1,30,6],[46,1,46,3],[46,4,46,7],[46,10,46,11],[47,2,47,5],[108,10,108,11],[109,2,109,5],[110,2,110,3],[111,1,111,7],[105,1,105,6],[106,1,106,6],[107,1,107,7],[108,0,120,0],[121,1,121,3],[121,4,121,7],[119,1,119,6],[121,0,132,0],[132,1,132,6],[130,1,130,6],[131,1,131,6],[121,10,121,11],[122,2,122,5],[123,2,123,3],[124,1,124,7],[129,1,129,3],[129,5,129,6],[0,0,13,0],[14,0,31,0],[46,0,61,0],[62,0,78,0],[79,0,94,0],[116,1,116,3],[116,5,116,6],[117,1,117,6],[118,1,118,6],[108,1,108,3],[108,4,108,7],[11,1,11,6],[12,1,12,6],[14,1,14,3],[14,4,14,7],[48,2,48,3],[49,1,49,7],[57,1,57,3],[57,5,57,6],[58,1,58,6],[103,1,103,3],[103,5,103,6],[104,1,104,6],[59,1,59,6],[134,10,134,11],[134,0,145,0],[147,0,160,0],[147,1,147,3],[147,4,147,7],[147,10,147,11],[148,2,148,5],[149,2,149,3],[150,1,150,7],[157,1,157,3],[157,5,157,6],[158,1,158,6],[159,1,159,6],[160,1,160,6],[177,0,190,0],[177,1,177,3],[177,4,177,7],[177,10,177,11],[178,2,178,5],[179,2,179,3],[180,1,180,7],[187,1,187,3],[187,5,187,6],[188,1,188,6],[189,1,189,6],[190,1,190,6],[162,0,175,0],[162,1,162,3],[162,4,162,7],[162,10,162,11],[163,2,163,5],[164,2,164,3],[165,1,165,7],[172,1,172,3],[172,5,172,6],[173,1,173,6],[174,1,174,6],[175,1,175,6],[208,0,222,0],[208,1,208,3],[208,4,208,7],[192,0,206,0],[192,1,192,3],[192,4,192,7],[208,10,208,11],[209,2,209,5],[210,2,210,3],[211,1,211,7],[219,1,219,3],[219,5,219,6],[220,1,220,6],[221,1,221,6],[222,1,222,6],[192,10,192,11],[193,2,193,5],[194,2,194,3],[195,1,195,7],[203,1,203,3],[203,5,203,6],[204,1,204,6],[205,1,205,6],[206,1,206,6]]}
[0,"CODEVASF",null,null," COMPOSIÇÃO DE PREÇO UNITÁRIO",null,null,null,{"$f":"H11","v":5497.44},{"$f":"H13","v":6928.4236319999991},"BDI CALCULADO:",null,{"$f":"ORÇAMENTO!I7","v":0.26030000000000003}]
[null,"OBRA:  ",{"$f":"ORÇAMENTO!C5","v":"CONSTRUÇÃO DE PONTE SOBRE O RIO SÃO DOMINGOS (CONTINUAÇÃO)"},null,null,null,"DATA: ",{"$f":"ORÇAMENTO!C7","v":"NOVEMBRO / 2023"}]
[null,"SERVIÇO:  ",{"$f":"VLOOKUP(A1,ORÇAMENTO!A11:I40,3)","v":"MOBILIZAÇÃO E DESMOBILIZAÇÃO"},null,"Referência:",{"$f":"VLOOKUP(A1,ORÇAMENTO!A11:I40,4)","v":"CPU.1"},"UNIDADE: ",{"$f":"VLOOKUP(A1,ORÇAMENTO!A11:I40,5)","v":"GL"},"OK"]
[]
[null,"TIPO ITEM","CODIGO ITEM","DESCRIÇÃO ITEM","UNIDADE ITEM","COEFICIENTE","PRECO UNITARIO","CUSTO TOTAL"]
[null,"COMPOSICAO",73467,"CAMINHÃO TOCO, PBT 14.300 KG, CARGA ÚTIL MÁX. 9.710 KG, DIST. ENTRE EIXOS 3,56 M, POTÊNCIA 185 CV, INCLUSIVE CARROCERIA FIXA ABERTA DE MADEIRA P/ TRANSPORTE GERAL DE CARGA SECA, DIMEN. APROX. 2,50 X 6,50 X 0,50M","CHP",16,246.72,{"$f":"ROUNDDOWN(F6*G6,2)","v":3947.52}]
[null,"COMPOSICAO",91395,"CAMINHÃO TOCO, PBT 14.300 KG, CARGA ÚTIL MÁX. 9.710 KG, DIST. ENTRE EIXOS 3,56 M, POTÊNCIA 185 CV, INCLUSIVE CARROCERIA FIXA ABERTA DE MADEIRA P/ TRANSPORTE GERAL DE CARGA SECA, DIMEN. APROX. 2,50 X 6,50 X 0,50M","CHI",16,57.35,{"$f":"ROUNDDOWN(F7*G7,2)","v":917.6}]
[null,"COMPOSIÇÃO",88316,"SERVENTE COM ENCARGOS COMPLEMENTARES","H",32,19.760000000000002,632.32000000000005]
[{"$nulls":7},0]
[null,"PRODUÇÃO DA EQUIPE",null,null,1,"CUSTO ",null,{"$f":"SUM(H6:H9)","v":5497.44}]
[null,"TOTAL",{"$nulls":5},{"$f":"H10/E10","v":5497.44},"ok"]
[null,"BDI                %",{"$nulls":5},{"$f":"1+$M$1","v":1.2603}]
[null,"TOTAL DO SERVIÇO - R$",{"$nulls":5},{"$f":"H11*H12","v":6928.4236319999991}]
[]
[{"$f":"A1+1","v":1},"CODEVASF",null,null," COMPOSIÇÃO DE PREÇO UNITÁRIO",null,null,null,{"$f":"H29","v":118608.75},{"$f":"H31","v":149482.607625}]
[null,"OBRA:  ",{"$f":"$C$2","v":"CONSTRUÇÃO DE PONTE SOBRE O RIO SÃO DOMINGOS (CONTINUAÇÃO)"},null,null,null,"DATA: ",{"$f":"$H$2","v":"NOVEMBRO / 2023"}]
[null,"SERVIÇO:  ",{"$f":"VLOOKUP(A15,ORÇAMENTO!$A$11:$I$40,3)","v":"ADMINISTRAÇÃO LOCAL E MANUTENÇÃO DO CANTEIRO DE OBRAS"},null,"SINAPI","CPU","UNIDADE: ",{"$f":"VLOOKUP(A15,ORÇAMENTO!$A$11:$I$40,5)","v":"GL"},"OK"]
[]
[null,"TIPO ITEM","CODIGO ITEM","DESCRIÇÃO ITEM","UNIDADE ITEM","COEFICIENTE","PRECO UNITARIO","CUSTO TOTAL"]
[null,"INSUMO",3346,"LOCACAO DE GRUPO GERADOR *80 A 125* KVA, MOTOR DIESEL, REBOCAVEL","H",60,18.95,{"$f":"ROUNDDOWN(F20*G20,2)","v":1137}]
[null,"COMPOSICAO",101008,"CARGA DE ÁGUA EM CAMINHÃO PIPA","M3",10,5.44,54.4]
[null,"COMPOSICAO",100955,"TRANSPORTE COM CAMINHÃO PIPA, EM VIA URBANA EM LEITO NATURAL","M3XKM",100,4.88,488]
[null,"COTAÇÃO","MERC.","VEÍCULO PARA TRANSPORTE DE PESSOAL, INCLUSIVE COMBUSTÍVEL","VB",1,2100,2100]
[null,"COTAÇÃO","MERC.","TELEFONE (PLANO CONTROLE)","UNID",2,59.9,119.8]
[null,"COMPOSICAO",90777,"ENGENHEIRO CIVIL DE OBRA COM ENCARGOS COMPLEMENTARES","H",55,114.12,6276.6]
[null,"COMPOSIÇÃO",100309,"TÉCNICO EM SEGURANÇA DO TRABALHO COM ENCARGOS COMPLEMENTARES","H",55,43.73,2405.15]
[null,"COMPOSICAO",90776,"ENCARREGADO GERAL COM ENCARGOS COMPLEMENTARES","H",220,50.64,11140.8]
[null,"PRODUÇÃO DA EQUIPE",null,null,0.2,"CUSTO ",null,{"$f":"SUM(H20:H27)","v":23721.75}]
[null,"TOTAL",{"$nulls":5},{"$f":"H28/E28","v":118608.75},"ok"]
[null,"BDI                %",{"$nulls":5},{"$f":"1+$M$1","v":1.2603}]
[null,"TOTAL DO SERVIÇO - R$",{"$nulls":5},{"$f":"H29*H30","v":149482.607625}]
[]
[2,"CODEVASF",null,null," COMPOSIÇÃO DE PREÇO UNITÁRIO",null,null,null,{"$f":"H43","v":0.41},{"$f":"H45","v":0.51672299999999993}]
[null,"OBRA:  ",{"$f":"$C$2","v":"CONSTRUÇÃO DE PONTE SOBRE O RIO SÃO DOMINGOS (CONTINUAÇÃO)"},null,null,null,"DATA: ",{"$f":"$H$2","v":"NOVEMBRO / 2023"}]
[null,"SERVIÇO:  ",{"$f":"VLOOKUP(A33,ORÇAMENTO!$A$11:$I$40,3)","v":"LIMPEZA MECANIZADA DE CAMADA VEGETAL, VEGETAÇÃO E PEQUENAS ÁRVORES (DIÂMETRO DE TRONCO MENOR QUE 0,20 M)"},null,"SINAPI",{"$f":"VLOOKUP(A33,ORÇAMENTO!$A$11:$I$40,4)","v":98525},"UNIDADE: ",{"$f":"VLOOKUP(A33,ORÇAMENTO!$A$11:$I$40,5)","v":"M2"},"OK"]
[]
[null,"TIPO ITEM","CODIGO ITEM","DESCRIÇÃO ITEM","UNIDADE ITEM","COEFICIENTE","PRECO UNITARIO","CUSTO TOTAL"]
[null,"COMPOSICAO","88316","SERVENTE COM ENCARGOS COMPLEMENTARES","H","0,0030000","19,76",{"$f":"ROUNDDOWN(F38*G38,2)","v":0.05}]
[null,"COMPOSICAO","88441","JARDINEIRO COM ENCARGOS COMPLEMENTARES","H","0,0030000","24,24",7.0000000000000007E-2]
[null,"COMPOSICAO","89031","TRATOR DE ESTEIRAS, POTÊNCIA 100 HP, PESO OPERACIONAL 9,4 T, COM LÂMINA 2,19 M3","CHI","0,0024000","78,04",0.18]
[null,"COMPOSICAO","89032","TRATOR DE ESTEIRAS, POTÊNCIA 100 HP, PESO OPERACIONAL 9,4 T, COM LÂMINA 2,19 M3","CHP","0,0006000","194,17",0.11]
[null,"PRODUÇÃO DA EQUIPE",null,null,1,"CUSTO ",null,{"$f":"SUM(H38:H41)","v":0.41}]
[null,"TOTAL",{"$nulls":5},{"$f":"H42/E42","v":0.41},"ok"]
[null,"BDI                %",{"$nulls":5},{"$f":"1+$M$1","v":1.2603}]
[null,"TOTAL DO SERVIÇO - R$",{"$nulls":5},{"$f":"H43*H44","v":0.51672299999999993}]
[]
[3,"CODEVASF",null,null," COMPOSIÇÃO DE PREÇO UNITÁRIO",null,null,null,{"$f":"H59","v":31394.1},{"$f":"H61","v":39565.984229999995}]
[null,"OBRA:  ",{"$f":"$C$2","v":"CONSTRUÇÃO DE PONTE SOBRE O RIO SÃO DOMINGOS (CONTINUAÇÃO)"},null,null,null,"DATA: ",{"$f":"$H$2","v":"NOVEMBRO / 2023"}]
[null,"SERVIÇO:  ",{"$f":"VLOOKUP(A47,ORÇAMENTO!$A$11:$I$40,3)","v":"INSTALAÇÕES E CANTEIRO DE OBRAS"},null,"SINAPI",{"$f":"VLOOKUP(A47,ORÇAMENTO!$A$11:$I$40,4)","v":"CPU.3"},"UNIDADE: ",{"$f":"VLOOKUP(A47,ORÇAMENTO!$A$11:$I$40,5)","v":"GL"}]
[]
[null,"TIPO ITEM","CODIGO ITEM","DESCRIÇÃO ITEM","UNIDADE ITEM","COEFICIENTE","PRECO UNITARIO","CUSTO TOTAL"]
[null,"INSUMO",10775,"LOCACAO DE CONTAINER 2,30 X 6,00M, ALT. 2,50 M, COM SANITARIO, PARA ESCRITORIO, COMPLETO, SEM DIVISORIAS INTERNAS","MÊS",5,985,{"$f":"ROUNDDOWN(F52*G52,2)","v":4925}]
[null,"INSUMO",10777,"LOCACAO DE CONTAINER 2,30 X 4,30 M, ALT. 2,50 M, PARA SANITARIO, COM 3 BACIAS, 4 CHUVEIROS, 1 LAVATORIO E 1 MICTORIO","MÊS",5,1118.3800000000001,5591.9]
[null,"INSUMO",37524,"TELA PLASTICA LARANJA, TIPO TAPUME PARA SINALIZACAO, MALHA RETANGULAR","M",100,2.4900000000000002,249]
[null,"COMPOSICAO",93210,"EXECUÇÃO DE REFEITÓRIO EM CANTEIRO DE OBRA EM CHAPA DE MADEIRA COMPENSADA","M2",20,633.55999999999995,12671.2]
[null,"COMPOSICAO",93582,"EXECUÇÃO DE CENTRAL DE ARMADURA EM CANTEIRO DE OBRA","M2",10,309.06,3090.6]
[null,"COMPOSICAO",93583,"EXECUÇÃO DE CENTRAL DE FÔRMAS, PRODUÇÃO DE ARGAMASSA OU CONCRETO EM CANTEIRO DE OBRA","M2",10,486.64,4866.3999999999996]
[null,"PRODUÇÃO DA EQUIPE",null,null,1,"CUSTO ",null,{"$f":"SUM(H52:H57)","v":31394.1}]
[null,"TOTAL",{"$nulls":5},{"$f":"H58/E58","v":31394.1},"ok"]
[null,"BDI                %",{"$nulls":5},{"$f":"1+$M$1","v":1.2603}]
[null,"TOTAL DO SERVIÇO - R$",{"$nulls":5},{"$f":"H59*H60","v":39565.984229999995}]
[]
[{"$f":"A47+1","v":4},"CODEVASF",null,null," COMPOSIÇÃO DE PREÇO UNITÁRIO",null,null,null,{"$f":"H76","v":367.02},{"$f":"H78","v":462.55530599999997}]
[null,"OBRA:  ",{"$f":"$C$2","v":"CONSTRUÇÃO DE PONTE SOBRE O RIO SÃO DOMINGOS (CONTINUAÇÃO)"},null,null,null,"DATA: ",{"$f":"$H$2","v":"NOVEMBRO / 2023"}]
[null,"SERVIÇO:  ",{"$f":"VLOOKUP(A63,ORÇAMENTO!$A$11:$I$40,3)","v":"PLACA DE OBRA EM CHAPA DE AÇO GALVANIZADO"},null,"SINAPI",{"$f":"VLOOKUP(A63,ORÇAMENTO!$A$11:$I$40,4)","v":103689},"UNIDADE: ",{"$f":"VLOOKUP(A63,ORÇAMENTO!$A$11:$I$40,5)","v":"M2"},"OK"]
[]
[null,"TIPO ITEM","CODIGO ITEM","DESCRIÇÃO ITEM","UNIDADE ITEM","COEFICIENTE","PRECO UNITARIO","CUSTO TOTAL"]
[null,"INSUMO","4417","SARRAFO DE MADEIRA NAO APARELHADA *2,5 X 7* CM, MACARANDUBA, ANGELIM OU EQUIVALENTE DA REGIAO","M","1,0000000",4.4000000000000004,{"$f":"ROUNDDOWN(F68*G68,2)","v":4.4000000000000004}]
[null,"INSUMO","4491","PONTALETE DE MADEIRA NAO APARELHADA *7,5 X 7,5* CM (3 X 3 \") PINUS, MISTA OU EQUIVALENTE DA REGIAO","M","4,0000000",8.68,34.72]
[null,"INSUMO","4813","PLACA DE OBRA (PARA CONSTRUCAO CIVIL) EM CHAPA GALVANIZADA *N. 22*, ADESIVADA, DE *2,0 X 1,125* M","M2","1,0000000","250,00",250]
[null,"INSUMO","5075","PREGO DE ACO POLIDO COM CABECA 18 X 30 (2 3/4 X 10)","KG","0,1100000","36,57",4.0199999999999996]
[null,"COMPOSICAO","88262","CARPINTEIRO DE FORMAS COM ENCARGOS COMPLEMENTARES","H","1,0000000","19,59",19.59]
[null,"COMPOSICAO","88316","SERVENTE COM ENCARGOS COMPLEMENTARES","H","2,0000000","27,05",54.1]
[null,"COMPOSICAO","94962","CONCRETO MAGRO PARA LASTRO, TRAÇO 1:4,5:4,5 (CIMENTO/ AREIA MÉDIA/ BRITA 1)  - PREPARO MECÂNICO COM BETONEIRA 400 L","M3","0,0100000","19,76",0.19]
[null,"PRODUÇÃO DA EQUIPE",null,null,1,"CUSTO ",null,{"$f":"SUM(H68:H74)","v":367.02}]
[null,"TOTAL",{"$nulls":5},{"$f":"H75/E75","v":367.02}]
[null,"BDI                %",{"$nulls":5},{"$f":"1+$M$1","v":1.2603}]
[null,"TOTAL DO SERVIÇO - R$",{"$nulls":5},{"$f":"H76*H77","v":462.55530599999997}]
[]
[{"$f":"A63+1","v":5},"CODEVASF",null,null," COMPOSIÇÃO DE PREÇO UNITÁRIO",null,null,null,{"$f":"H92","v":14134.560000000001},{"$f":"H94","v":17813.785968}]
[null,"OBRA:  ",{"$f":"$C$2","v":"CONSTRUÇÃO DE PONTE SOBRE O RIO SÃO DOMINGOS (CONTINUAÇÃO)"},null,null,null,"DATA: ",{"$f":"$H$2","v":"NOVEMBRO / 2023"}]
[null,"SERVIÇO:  ",{"$f":"VLOOKUP(A80,ORÇAMENTO!$A$11:$I$40,3)","v":"MOBILIZAÇÃO E DESMOBILIZAÇÃO DE GUINDASTE HIDRÁULICO AUTOPROPELIDO, COM LANÇA TELESCÓPICA"},null,"SINAPI",{"$f":"VLOOKUP(A80,ORÇAMENTO!$A$11:$I$40,4)","v":"CPU.4"},"UNIDADE: ","VB"]
[]
[null,"TIPO ITEM","CODIGO ITEM","DESCRIÇÃO ITEM","UNIDADE ITEM","COEFICIENTE","PRECO UNITARIO","CUSTO TOTAL"]
[null,"COMPOSICAO","93287","GUINDASTE HIDRÁULICO AUTOPROPELIDO, COM LANÇA TELESCÓPICA 40 M, CAPACIDADE MÁXIMA 60 T, POTÊNCIA 260 KW","CHP",{"$f":"750/60","v":12.5},"334,92",{"$f":"ROUNDDOWN(F85*G85,2)","v":4186.5}]
[null,"COMPOSICAO","93288","GUINDASTE HIDRÁULICO AUTOPROPELIDO, COM LANÇA TELESCÓPICA 40 M, CAPACIDADE MÁXIMA 60 T, POTÊNCIA 260 KW","CHI",3.5,"171,30",599.54999999999995]
[null,"COMPOSICAO","E9512","VEÍCULO LEVE - BATEDOR","CHP",{"$f":"F85*2","v":25},58.426900000000003,1460.67]
[null,"COMPOSICAO","E9512","VEÍCULO LEVE - BATEDOR","CHI",{"$f":"F86*2","v":7},31.509599999999999,{"$f":"ROUNDDOWN(F88*G88,2)","v":220.56}]
[null,"INSUMO"," - ","HOSPEDAGEM","DIA",5,120,600]
[{"$nulls":7},{"$f":"ROUNDDOWN(F90*G90,2)","v":0}]
[null,"PRODUÇÃO DA EQUIPE",null,null,0.5,"CUSTO ",null,{"$f":"SUM(H85:H90)","v":7067.2800000000007}]
[null,"TOTAL",{"$nulls":5},{"$f":"H91/E91","v":14134.560000000001},"OK"]
[null,"BDI                %",{"$nulls":5},{"$f":"1+$M$1","v":1.2603}]
[null,"TOTAL DO SERVIÇO - R$",{"$nulls":5},{"$f":"H92*H93","v":17813.785968}]
[]
[13,"CODEVASF",null,null," COMPOSIÇÃO DE PREÇO UNITÁRIO",null,null,null,{"$f":"H105","v":0.88},{"$f":"H107","v":1.109064}]
[null,"OBRA:  ",{"$f":"$C$2","v":"CONSTRUÇÃO DE PONTE SOBRE O RIO SÃO DOMINGOS (CONTINUAÇÃO)"},null,null,null,"DATA: ",{"$f":"$H$2","v":"NOVEMBRO / 2023"}]
[null,"SERVIÇO:  ",{"$f":"VLOOKUP(A96,ORÇAMENTO!$A$11:$I$40,3)","v":"TRANSPORTE COM CAMINHÃO CARROCERIA 9T, EM VIA URBANA PAVIMENTADA (MAT. DIVERSOS - AÇO, MADEIRA, CIMENTO)"},null,"SINAPI",{"$f":"VLOOKUP(A96,ORÇAMENTO!$A$11:$I$40,4)","v":100948},"UNIDADE: ",{"$f":"VLOOKUP(A96,ORÇAMENTO!$A$11:$I$40,5)","v":"TXKM"},"OK"]
[]
[null,"TIPO ITEM","CODIGO ITEM","DESCRIÇÃO ITEM","UNIDADE ITEM","COEFICIENTE","PRECO UNITARIO","CUSTO TOTAL"]
[null,"COMPOSICAO","5824","CAMINHÃO TOCO, PBT 16.000 KG, CARGA ÚTIL MÁX. 10.685 KG, DIST. ENTRE EIXOS 4,8 M, POTÊNCIA 189 CV, INCLUSIVE CARROCERIA FIXA ABERTA DE MADEIRA P/ TRANSPORTE GERAL DE CARGA SECA","CHP","0,0037000","214,09",{"$f":"ROUNDDOWN(F101*G101,2)","v":0.79}]
[null,"COMPOSICAO","5826","CAMINHÃO TOCO, PBT 16.000 KG, CARGA ÚTIL MÁX. 10.685 KG, DIST. ENTRE EIXOS 4,8 M, POTÊNCIA 189 CV, INCLUSIVE CARROCERIA FIXA ABERTA DE MADEIRA P/ TRANSPORTE GERAL DE CARGA SECA","CHI","0,0016000","60,10",0.09]
[{"$nulls":7},{"$f":"ROUNDDOWN(F103*G103,2)","v":0}]
[null,"PRODUÇÃO DA EQUIPE",null,null,1,"CUSTO ",null,{"$f":"SUM(H101:H103)","v":0.88}]
[null,"TOTAL",{"$nulls":5},{"$f":"H104/E104","v":0.88},"OK"]
[null,"BDI                %",{"$nulls":5},{"$f":"1+$M$1","v":1.2603}]
[null,"TOTAL DO SERVIÇO - R$",{"$nulls":5},{"$f":"H105*H106","v":1.109064}]
[]
[{"$f":"A96+1","v":14},"CODEVASF",null,null," COMPOSIÇÃO DE PREÇO UNITÁRIO",null,null,null,{"$f":"H118","v":2.8},{"$f":"H120","v":3.5288399999999998}]
[null,"OBRA:  ",{"$f":"$C$2","v":"CONSTRUÇÃO DE PONTE SOBRE O RIO SÃO DOMINGOS (CONTINUAÇÃO)"},null,null,null,"DATA: ",{"$f":"$H$2","v":"NOVEMBRO / 2023"}]
[null,"SERVIÇO:  ",{"$f":"VLOOKUP(A109,ORÇAMENTO!$A$11:$I$40,3)","v":"TRANSPORTE COM CAMINHÃO CARROCERIA 9T, EM VIA URBANA EM REVESTIMENTO PRIMÁRIO (MAT. DIVERSOS - AÇO, MADEIRA, CIMENTO)"},null,"SINAPI",{"$f":"VLOOKUP(A109,ORÇAMENTO!$A$11:$I$40,4)","v":100945},"UNIDADE: ",{"$f":"VLOOKUP(A109,ORÇAMENTO!$A$11:$I$40,5)","v":"TXKM"},"OK"]
[]
[null,"TIPO ITEM","CODIGO ITEM","DESCRIÇÃO ITEM","UNIDADE ITEM","COEFICIENTE","PRECO UNITARIO","CUSTO TOTAL"]
[null,"COMPOSICAO","5824","CAMINHÃO TOCO, PBT 16.000 KG, CARGA ÚTIL MÁX. 10.685 KG, DIST. ENTRE EIXOS 4,8 M, POTÊNCIA 189 CV, INCLUSIVE CARROCERIA FIXA ABERTA DE MADEIRA P/ TRANSPORTE GERAL DE CARGA SECA","CHP","0,0117000","214,09",{"$f":"ROUNDDOWN(F114*G114,2)","v":2.5}]
[null,"COMPOSICAO","5826","CAMINHÃO TOCO, PBT 16.000 KG, CARGA ÚTIL MÁX. 10.685 KG, DIST. ENTRE EIXOS 4,8 M, POTÊNCIA 189 CV, INCLUSIVE CARROCERIA FIXA ABERTA DE MADEIRA P/ TRANSPORTE GERAL DE CARGA SECA","CHI","0,0050000","60,10",0.3]
[{"$nulls":7},0]
[null,"PRODUÇÃO DA EQUIPE",null,null,1,"CUSTO ",null,{"$f":"SUM(H114:H116)","v":2.8}]
[null,"TOTAL",{"$nulls":5},{"$f":"H117/E117","v":2.8},"OK"]
[null,"BDI                %",{"$nulls":5},{"$f":"1+$M$1","v":1.2603}]
[null,"TOTAL DO SERVIÇO - R$",{"$nulls":5},{"$f":"H118*H119","v":3.5288399999999998}]
[]
[{"$f":"A109+1","v":15},"CODEVASF",null,null," COMPOSIÇÃO DE PREÇO UNITÁRIO",null,null,null,{"$f":"H131","v":0.97},{"$f":"H133","v":1.222491}]
[null,"OBRA:  ",{"$f":"$C$2","v":"CONSTRUÇÃO DE PONTE SOBRE O RIO SÃO DOMINGOS (CONTINUAÇÃO)"},null,null,null,"DATA: ",{"$f":"$H$2","v":"NOVEMBRO / 2023"}]
[null,"SERVIÇO:  ",{"$f":"VLOOKUP(A122,ORÇAMENTO!$A$11:$I$40,3)","v":"TRANSPORTE COM CAMINHÃO BASCULANTE OU BETONEIRA, EM VIA URBANA PAVIMENTADA (MAT. DIVERSOS - CONCRETO, AREIA, BRITA, SOLO, ENTULHO)"},null,"SINAPI",{"$f":"VLOOKUP(A122,ORÇAMENTO!$A$11:$I$40,4)","v":93590},"UNIDADE: ",{"$f":"VLOOKUP(A122,ORÇAMENTO!$A$11:$I$40,5)","v":"M3XKM"},"OK"]
[]
[null,"TIPO ITEM","CODIGO ITEM","DESCRIÇÃO ITEM","UNIDADE ITEM","COEFICIENTE","PRECO UNITARIO","CUSTO TOTAL"]
[null,"COMPOSICAO","91386","CAMINHÃO BASCULANTE 10 M3, TRUCADO CABINE SIMPLES, PESO BRUTO TOTAL 23.000 KG, CARGA ÚTIL MÁXIMA 15.935 KG, DISTÂNCIA ENTRE EIXOS 4,80 M, POTÊNCIA 230 CV INCLUSIVE CAÇAMBA METÁLICA","CHP","0,0033000","265,97",{"$f":"ROUNDDOWN(F127*G127,2)","v":0.87}]
[null,"COMPOSICAO","91387","CAMINHÃO BASCULANTE 10 M3, TRUCADO CABINE SIMPLES, PESO BRUTO TOTAL 23.000 KG, CARGA ÚTIL MÁXIMA 15.935 KG, DISTÂNCIA ENTRE EIXOS 4,80 M, POTÊNCIA 230 CV INCLUSIVE CAÇAMBA METÁLICA","CHI","0,0014000","72,77",0.1]
[{"$nulls":7},0]
[null,"PRODUÇÃO DA EQUIPE",null,null,1,"CUSTO ",null,{"$f":"SUM(H127:H129)","v":0.97}]
[null,"TOTAL",{"$nulls":5},{"$f":"H130/E130","v":0.97},"OK"]
[null,"BDI                %",{"$nulls":5},{"$f":"1+$M$1","v":1.2603}]
[null,"TOTAL DO SERVIÇO - R$",{"$nulls":5},{"$f":"H131*H132","v":1.222491}]
[]
[{"$f":"A122+1","v":16},"CODEVASF",null,null," COMPOSIÇÃO DE PREÇO UNITÁRIO",null,null,null,{"$f":"H144","v":2.67},{"$f":"H146","v":3.3650009999999999}]
[null,"OBRA:  ",{"$f":"$C$2","v":"CONSTRUÇÃO DE PONTE SOBRE O RIO SÃO DOMINGOS (CONTINUAÇÃO)"},null,null,null,"DATA: ",{"$f":"$H$2","v":"NOVEMBRO / 2023"}]
[null,"SERVIÇO:  ",{"$f":"VLOOKUP(A135,ORÇAMENTO!$A$11:$I$40,3)","v":"TRANSPORTE COM CAMINHÃO BASCULANTE OU BETONEIRA, EM VIA URBANA EM REVESTIMENTO PRIMÁRIO (MAT. DIVERSOS - CONCRETO, AREIA, BRITA, SOLO, ENTULHO)"},null,"SINAPI",{"$f":"VLOOKUP(A135,ORÇAMENTO!$A$11:$I$40,4)","v":93589},"UNIDADE: ",{"$f":"VLOOKUP(A135,ORÇAMENTO!$A$11:$I$40,5)","v":"M3XKM"},"OK"]
[]
[null,"TIPO ITEM","CODIGO ITEM","DESCRIÇÃO ITEM","UNIDADE ITEM","COEFICIENTE","PRECO UNITARIO","CUSTO TOTAL"]
[null,"COMPOSICAO","91386","CAMINHÃO BASCULANTE 10 M3, TRUCADO CABINE SIMPLES, PESO BRUTO TOTAL 23.000 KG, CARGA ÚTIL MÁXIMA 15.935 KG, DISTÂNCIA ENTRE EIXOS 4,80 M, POTÊNCIA 230 CV INCLUSIVE CAÇAMBA METÁLICA","CHP","0,0090000","265,97",{"$f":"ROUNDDOWN(F140*G140,2)","v":2.39}]
[null,"COMPOSICAO","91387","CAMINHÃO BASCULANTE 10 M3, TRUCADO CABINE SIMPLES, PESO BRUTO TOTAL 23.000 KG, CARGA ÚTIL MÁXIMA 15.935 KG, DISTÂNCIA ENTRE EIXOS 4,80 M, POTÊNCIA 230 CV INCLUSIVE CAÇAMBA METÁLICA","CHI","0,0039000","72,77",0.28000000000000003]
[{"$nulls":7},0]
[null,"PRODUÇÃO DA EQUIPE",null,null,1,"CUSTO ",null,{"$f":"SUM(H140:H142)","v":2.67}]
[null,"TOTAL",{"$nulls":5},{"$f":"H143/E143","v":2.67},"OK"]
[null,"BDI                %",{"$nulls":5},{"$f":"1+$M$1","v":1.2603}]
[null,"TOTAL DO SERVIÇO - R$",{"$nulls":5},{"$f":"H144*H145","v":3.3650009999999999}]
[]
[19,"CODEVASF",null,null," COMPOSIÇÃO DE PREÇO UNITÁRIO",null,null,null,{"$f":"H159","v":17.03},{"$f":"H161","v":21.462909}]
[null,"OBRA:  ",{"$f":"$C$2","v":"CONSTRUÇÃO DE PONTE SOBRE O RIO SÃO DOMINGOS (CONTINUAÇÃO)"},null,null,null,"DATA: ",{"$f":"$H$2","v":"NOVEMBRO / 2023"}]
[null,"SERVIÇO:  ",{"$f":"VLOOKUP(A148,ORÇAMENTO!$A$11:$I$40,3)","v":"ARMAÇÃO DE PILAR OU VIGA DE UMA ESTRUTURA CONVENCIONAL DE CONCRETO ARMADO UTILIZANDO AÇO CA-60 DE 5,0 MM"},null,"SINAPI",{"$f":"VLOOKUP(A148,ORÇAMENTO!$A$11:$I$40,4)","v":92775},"UNIDADE: ",{"$f":"VLOOKUP(A148,ORÇAMENTO!$A$11:$I$40,5)","v":"KG"},"OK"]
[]
[null,"TIPO ITEM","CODIGO ITEM","DESCRIÇÃO ITEM","UNIDADE ITEM","COEFICIENTE","PRECO UNITARIO","CUSTO TOTAL"]
[null,"INSUMO","39017","ESPACADOR / DISTANCIADOR CIRCULAR COM ENTRADA LATERAL, EM PLASTICO, PARA VERGALHAO *4,2 A 12,5* MM, COBRIMENTO 20 MM","UN","1,1900000","0,20",{"$f":"ROUNDDOWN(F153*G153,2)","v":0.23}]
[null,"INSUMO","43132","ARAME RECOZIDO 16 BWG, D = 1,65 MM (0,016 KG/M) OU 18 BWG, D = 1,25 MM (0,01 KG/M)","KG","0,0250000","25,40",0.63]
[null,"COMPOSICAO","88238","AJUDANTE DE ARMADOR COM ENCARGOS COMPLEMENTARES","H","0,0367000","20,18",0.74]
[null,"COMPOSICAO","88245","ARMADOR COM ENCARGOS COMPLEMENTARES","H","0,2245000","27,23",6.11]
[null,"COMPOSICAO",92800,"CORTE E DOBRA DE AÇO CA-60, DIÂMETRO DE 5,0 MM, UTILIZADO EM ESTRUTURAS DIVERSAS","KG","1,0000000",9.32,9.32]
[null,"PRODUÇÃO DA EQUIPE",null,null,1,"CUSTO ",null,{"$f":"SUM(H153:H157)","v":17.03}]
[null,"TOTAL",{"$nulls":5},{"$f":"H158/E158","v":17.03},"OK"]
[null,"BDI                %",{"$nulls":5},{"$f":"1+$M$1","v":1.2603}]
[null,"TOTAL DO SERVIÇO - R$",{"$nulls":5},{"$f":"H159*H160","v":21.462909}]
[]
[{"$f":"A148+1","v":20},"CODEVASF",null,null," COMPOSIÇÃO DE PREÇO UNITÁRIO",null,null,null,{"$f":"H174","v":15.399999999999999},{"$f":"H176","v":19.408619999999999}]
[null,"OBRA:  ",{"$f":"$C$2","v":"CONSTRUÇÃO DE PONTE SOBRE O RIO SÃO DOMINGOS (CONTINUAÇÃO)"},null,null,null,"DATA: ",{"$f":"$H$2","v":"NOVEMBRO / 2023"}]
[null,"SERVIÇO:  ",{"$f":"VLOOKUP(A163,ORÇAMENTO!$A$11:$I$50,3)","v":"ARMAÇÃO DE PILAR OU VIGA DE UMA ESTRUTURA CONVENCIONAL DE CONCRETO ARMADO UTILIZANDO AÇO CA-50 DE 6,3 MM"},null,"SINAPI",{"$f":"VLOOKUP(A163,ORÇAMENTO!$A$11:$I$50,4)","v":92776},"UNIDADE: ",{"$f":"VLOOKUP(A163,ORÇAMENTO!$A$11:$I$50,5)","v":"KG"},"OK"]
[]
[null,"TIPO ITEM","CODIGO ITEM","DESCRIÇÃO ITEM","UNIDADE ITEM","COEFICIENTE","PRECO UNITARIO","CUSTO TOTAL"]
[null,"INSUMO","39017","ESPACADOR / DISTANCIADOR CIRCULAR COM ENTRADA LATERAL, EM PLASTICO, PARA VERGALHAO *4,2 A 12,5* MM, COBRIMENTO 20 MM","UN","0,9700000","0,20",{"$f":"ROUNDDOWN(F168*G168,2)","v":0.19}]
[null,"INSUMO","43132","ARAME RECOZIDO 16 BWG, D = 1,65 MM (0,016 KG/M) OU 18 BWG, D = 1,25 MM (0,01 KG/M)","KG","0,0250000","25,40",0.63]
[null,"COMPOSICAO","88238","AJUDANTE DE ARMADOR COM ENCARGOS COMPLEMENTARES","H","0,0280000","20,18",0.56000000000000005]
[null,"COMPOSICAO","88245","ARMADOR COM ENCARGOS COMPLEMENTARES","H","0,1713000","27,23",4.66]
[null,"COMPOSICAO",92801,"CORTE E DOBRA DE AÇO CA-50, DIÂMETRO DE 6,3 MM, UTILIZADO EM ESTRUTURAS DIVERSAS","KG","1,0000000",9.36,9.36]
[null,"PRODUÇÃO DA EQUIPE",null,null,1,"CUSTO ",null,{"$f":"SUM(H168:H172)","v":15.399999999999999}]
[null,"TOTAL",{"$nulls":5},{"$f":"H173/E173","v":15.399999999999999},"OK"]
[null,"BDI                %",{"$nulls":5},{"$f":"1+$M$1","v":1.2603}]
[null,"TOTAL DO SERVIÇO - R$",{"$nulls":5},{"$f":"H174*H175","v":19.408619999999999}]
[]
[21,"CODEVASF",null,null," COMPOSIÇÃO DE PREÇO UNITÁRIO",null,null,null,{"$f":"H189","v":13.93},{"$f":"H191","v":17.555979000000001}]
[null,"OBRA:  ",{"$f":"$C$2","v":"CONSTRUÇÃO DE PONTE SOBRE O RIO SÃO DOMINGOS (CONTINUAÇÃO)"},null,null,null,"DATA: ",{"$f":"$H$2","v":"NOVEMBRO / 2023"}]
[null,"SERVIÇO:  ",{"$f":"VLOOKUP(A178,ORÇAMENTO!$A$11:$I$40,3)","v":"ARMAÇÃO DE PILAR OU VIGA DE UMA ESTRUTURA CONVENCIONAL DE CONCRETO ARMADO UTILIZANDO AÇO CA-50 DE 8 MM"},null,"SICRO",{"$f":"VLOOKUP(A178,ORÇAMENTO!$A$11:$I$40,4)","v":92777},"UNIDADE: ",{"$f":"VLOOKUP(A178,ORÇAMENTO!$A$11:$I$40,5)","v":"KG"},"OK"]
[]
[null,"TIPO ITEM","CODIGO ITEM","DESCRIÇÃO ITEM","UNIDADE ITEM","COEFICIENTE","PRECO UNITARIO","CUSTO TOTAL"]
[null,"INSUMO","39017","ESPACADOR / DISTANCIADOR CIRCULAR COM ENTRADA LATERAL, EM PLASTICO, PARA VERGALHAO *4,2 A 12,5* MM, COBRIMENTO 20 MM","UN","0,7430000","0,20",{"$f":"ROUNDDOWN(F183*G183,2)","v":0.14000000000000001}]
[null,"INSUMO","43132","ARAME RECOZIDO 16 BWG, D = 1,65 MM (0,016 KG/M) OU 18 BWG, D = 1,25 MM (0,01 KG/M)","KG","0,0250000","25,40",0.63]
[null,"COMPOSICAO","88238","AJUDANTE DE ARMADOR COM ENCARGOS COMPLEMENTARES","H","0,0209000","20,18",0.42]
[null,"COMPOSICAO","88245","ARMADOR COM ENCARGOS COMPLEMENTARES","H","0,1278000","27,23",3.47]
[null,"COMPOSICAO",92802,"CORTE E DOBRA DE AÇO CA-50, DIÂMETRO DE 8,0 MM, UTILIZADO EM ESTRUTURAS DIVERSAS","KG","1,0000000",9.27,9.27]
[null,"PRODUÇÃO DA EQUIPE",null,null,1,"CUSTO ",null,{"$f":"SUM(H183:H187)","v":13.93}]
[null,"TOTAL",{"$nulls":5},{"$f":"H188/E188","v":13.93},"OK"]
[null,"BDI                %",{"$nulls":5},{"$f":"1+$M$1","v":1.2603}]
[null,"TOTAL DO SERVIÇO - R$",{"$nulls":5},{"$f":"H189*H190","v":17.555979000000001}]
[]
[22,"CODEVASF",null,null," COMPOSIÇÃO DE PREÇO UNITÁRIO",null,null,null,{"$f":"H205","v":12.17},{"$f":"H207","v":15.337850999999999}]
[null,"OBRA:  ",{"$f":"$C$2","v":"CONSTRUÇÃO DE PONTE SOBRE O RIO SÃO DOMINGOS (CONTINUAÇÃO)"},null,null,null,"DATA: ",{"$f":"$H$2","v":"NOVEMBRO / 2023"}]
[null,"SERVIÇO:  ",{"$f":"VLOOKUP(A193,ORÇAMENTO!$A$11:$I$40,3)","v":"ARMAÇÃO DE PILAR OU VIGA DE UMA ESTRUTURA CONVENCIONAL DE CONCRETO ARMADO UTILIZANDO AÇO CA-50 DE 10 MM"},null,"SICRO",{"$f":"VLOOKUP(A193,ORÇAMENTO!$A$11:$I$40,4)","v":92778},"UNIDADE: ",{"$f":"VLOOKUP(A193,ORÇAMENTO!$A$11:$I$40,5)","v":"KG"},"OK"]
[]
[null,"TIPO ITEM","CODIGO ITEM","DESCRIÇÃO ITEM","UNIDADE ITEM","COEFICIENTE","PRECO UNITARIO","CUSTO TOTAL"]
[null,"INSUMO","39017","ESPACADOR / DISTANCIADOR CIRCULAR COM ENTRADA LATERAL, EM PLASTICO, PARA VERGALHAO *4,2 A 12,5* MM, COBRIMENTO 20 MM","UN","0,5430000","0,20",{"$f":"ROUNDDOWN(F198*G198,2)","v":0.1}]
[null,"INSUMO","43132","ARAME RECOZIDO 16 BWG, D = 1,65 MM (0,016 KG/M) OU 18 BWG, D = 1,25 MM (0,01 KG/M)","KG","0,0250000","25,40",0.63]
[null,"COMPOSICAO","88238","AJUDANTE DE ARMADOR COM ENCARGOS COMPLEMENTARES","H","0,0156000","20,18",0.31]
[null,"COMPOSICAO","88245","ARMADOR COM ENCARGOS COMPLEMENTARES","H","0,0956000","27,23",2.6]
[null,"COMPOSICAO",92803,"CORTE E DOBRA DE AÇO CA-50, DIÂMETRO DE 10,0 MM, UTILIZADO EM ESTRUTURAS DIVERSAS","KG","1,0000000",8.5299999999999994,8.5299999999999994]
[{"$nulls":7},0]
[null,"PRODUÇÃO DA EQUIPE",null,null,1,"CUSTO ",null,{"$f":"SUM(H198:H203)","v":12.17}]
[null,"TOTAL",{"$nulls":5},{"$f":"H204/E204","v":12.17},"OK"]
[null,"BDI                %",{"$nulls":5},{"$f":"1+$M$1","v":1.2603}]
[null,"TOTAL DO SERVIÇO - R$",{"$nulls":5},{"$f":"H205*H206","v":15.337850999999999}]
[]
[23,"CODEVASF",null,null," COMPOSIÇÃO DE PREÇO UNITÁRIO",null,null,null,{"$f":"H221","v":10.14},{"$f":"H223","v":12.779442000000001}]
[null,"OBRA:  ",{"$f":"$C$2","v":"CONSTRUÇÃO DE PONTE SOBRE O RIO SÃO DOMINGOS (CONTINUAÇÃO)"},null,null,null,"DATA: ",{"$f":"$H$2","v":"NOVEMBRO / 2023"}]
[null,"SERVIÇO:  ",{"$f":"VLOOKUP(A209,ORÇAMENTO!$A$11:$I$40,3)","v":"ARMAÇÃO DE PILAR OU VIGA DE UMA ESTRUTURA CONVENCIONAL DE CONCRETO ARMADO UTILIZANDO AÇO CA-50 DE 12,5 MM"},null,"SICRO",{"$f":"VLOOKUP(A209,ORÇAMENTO!$A$11:$I$40,4)","v":92779},"UNIDADE: ",{"$f":"VLOOKUP(A209,ORÇAMENTO!$A$11:$I$40,5)","v":"KG"},"OK"]
[]
[null,"TIPO ITEM","CODIGO ITEM","DESCRIÇÃO ITEM","UNIDADE ITEM","COEFICIENTE","PRECO UNITARIO","CUSTO TOTAL"]
[null,"INSUMO","39017","ESPACADOR / DISTANCIADOR CIRCULAR COM ENTRADA LATERAL, EM PLASTICO, PARA VERGALHAO *4,2 A 12,5* MM, COBRIMENTO 20 MM","UN","0,3670000","0,20",{"$f":"ROUNDDOWN(F214*G214,2)","v":7.0000000000000007E-2}]
[null,"INSUMO","43132","ARAME RECOZIDO 16 BWG, D = 1,65 MM (0,016 KG/M) OU 18 BWG, D = 1,25 MM (0,01 KG/M)","KG","0,0250000","25,40",0.63]
[null,"COMPOSICAO","88238","AJUDANTE DE ARMADOR COM ENCARGOS COMPLEMENTARES","H","0,0114000","20,18",0.23]
[null,"COMPOSICAO","88245","ARMADOR COM ENCARGOS COMPLEMENTARES","H","0,0698000","27,23",1.9]
[null,"COMPOSICAO",92804,"CORTE E DOBRA DE AÇO CA-50, DIÂMETRO DE 12,5 MM, UTILIZADO EM ESTRUTURAS DIVERSAS","KG","1,0000000",7.31,7.31]
[{"$nulls":7},0]
[null,"PRODUÇÃO DA EQUIPE",null,null,1,"CUSTO ",null,{"$f":"SUM(H214:H219)","v":10.14}]
[null,"TOTAL",{"$nulls":5},{"$f":"H220/E220","v":10.14},"OK"]
[null,"BDI                %",{"$nulls":5},{"$f":"1+$M$1","v":1.2603}]
[null,"TOTAL DO SERVIÇO - R$",{"$nulls":5},{"$f":"H221*H222","v":12.779442000000001}]
[]
[{"$f":"A209+1","v":24},"CODEVASF",null,null," COMPOSIÇÃO DE PREÇO UNITÁRIO",null,null,null,{"$f":"H237","v":9.33},{"$f":"H239","v":11.758599}]
[null,"OBRA:  ",{"$f":"$C$2","v":"CONSTRUÇÃO DE PONTE SOBRE O RIO SÃO DOMINGOS (CONTINUAÇÃO)"},null,null,null,"DATA: ",{"$f":"$H$2","v":"NOVEMBRO / 2023"}]
[null,"SERVIÇO:  ",{"$f":"VLOOKUP(A225,ORÇAMENTO!$A$27:$I$41,3)","v":"ARMAÇÃO DE PILAR OU VIGA DE UMA ESTRUTURA CONVENCIONAL DE CONCRETO ARMADO UTILIZANDO AÇO CA-50 DE 16 MM"},null,"SICRO",{"$f":"VLOOKUP(A225,ORÇAMENTO!$A$27:$I$40,4)","v":92780},"UNIDADE: ",{"$f":"VLOOKUP(A225,ORÇAMENTO!$A$27:$I$40,5)","v":"KG"},"OK"]
[]
[null,"TIPO ITEM","CODIGO ITEM","DESCRIÇÃO ITEM","UNIDADE ITEM","COEFICIENTE","PRECO UNITARIO","CUSTO TOTAL"]
[null,"INSUMO","39017","ESPACADOR / DISTANCIADOR CIRCULAR COM ENTRADA LATERAL, EM PLASTICO, PARA VERGALHAO *4,2 A 12,5* MM, COBRIMENTO 20 MM","UN","0,2120000","0,20",{"$f":"ROUNDDOWN(F230*G230,2)","v":0.04}]
[null,"INSUMO","43132","ARAME RECOZIDO 16 BWG, D = 1,65 MM (0,016 KG/M) OU 18 BWG, D = 1,25 MM (0,01 KG/M)","KG","0,0250000","25,40",0.63]
[null,"COMPOSICAO","88238","AJUDANTE DE ARMADOR COM ENCARGOS COMPLEMENTARES","H","0,0077000","20,18",0.15]
[null,"COMPOSICAO","88245","ARMADOR COM ENCARGOS COMPLEMENTARES","H","0,0473000","27,23",1.28]
[null,"COMPOSICAO",92805,"CORTE E DOBRA DE AÇO CA-50, DIÂMETRO DE 16,0 MM, UTILIZADO EM ESTRUTURAS DIVERSAS","KG","1,0000000",7.23,7.23]
[{"$nulls":7},0]
[null,"PRODUÇÃO DA EQUIPE",null,null,1,"CUSTO ",null,{"$f":"SUM(H230:H235)","v":9.33}]
[null,"TOTAL",{"$nulls":5},{"$f":"H236/E236","v":9.33},"OK"]
[null,"BDI                %",{"$nulls":5},{"$f":"1+$M$1","v":1.2603}]
[null,"TOTAL DO SERVIÇO - R$",{"$nulls":5},{"$f":"H237*H238","v":11.758599}]
[]
[{"$f":"A225+1","v":25},"CODEVASF",null,null," COMPOSIÇÃO DE PREÇO UNITÁRIO",null,null,null,{"$f":"H253","v":10.11},{"$f":"H255","v":12.741632999999998}]
[null,"OBRA:  ",{"$f":"$C$2","v":"CONSTRUÇÃO DE PONTE SOBRE O RIO SÃO DOMINGOS (CONTINUAÇÃO)"},null,null,null,"DATA: ",{"$f":"$H$2","v":"NOVEMBRO / 2023"}]
[null,"SERVIÇO:  ",{"$f":"VLOOKUP(A241,ORÇAMENTO!$A$27:$I$41,3)","v":"ARMAÇÃO DE PILAR OU VIGA DE UMA ESTRUTURA CONVENCIONAL DE CONCRETO ARMADO UTILIZANDO AÇO CA-50 DE 20 MM"},null,"SICRO",{"$f":"VLOOKUP(A241,ORÇAMENTO!$A$27:$I$40,4)","v":92781},"UNIDADE: ",{"$f":"VLOOKUP(A241,ORÇAMENTO!$A$27:$I$40,5)","v":"KG"},"OK"]
[]
[null,"TIPO ITEM","CODIGO ITEM","DESCRIÇÃO ITEM","UNIDADE ITEM","COEFICIENTE","PRECO UNITARIO","CUSTO TOTAL"]
[null,"INSUMO","39017","ESPACADOR / DISTANCIADOR CIRCULAR COM ENTRADA LATERAL, EM PLASTICO, PARA VERGALHAO *4,2 A 12,5* MM, COBRIMENTO 20 MM","UN","0,1130000","0,20",{"$f":"ROUNDDOWN(F246*G246,2)","v":0.02}]
[null,"INSUMO","43132","ARAME RECOZIDO 16 BWG, D = 1,65 MM (0,016 KG/M) OU 18 BWG, D = 1,25 MM (0,01 KG/M)","KG","0,0250000","25,40",0.63]
[null,"COMPOSICAO","88238","AJUDANTE DE ARMADOR COM ENCARGOS COMPLEMENTARES","H","0,0051000","20,18",0.1]
[null,"COMPOSICAO","88245","ARMADOR COM ENCARGOS COMPLEMENTARES","H","0,0312000","27,23",0.84]
[null,"COMPOSICAO",92806,"CORTE E DOBRA DE AÇO CA-50, DIÂMETRO DE 20,0 MM, UTILIZADO EM ESTRUTURAS DIVERSAS","KG","1,0000000",8.52,8.52]
[{"$nulls":7},0]
[null,"PRODUÇÃO DA EQUIPE",null,null,1,"CUSTO ",null,{"$f":"SUM(H246:H251)","v":10.11}]
[null,"TOTAL",{"$nulls":5},{"$f":"H252/E252","v":10.11},"OK"]
[null,"BDI                %",{"$nulls":5},{"$f":"1+$M$1","v":1.2603}]
[null,"TOTAL DO SERVIÇO - R$",{"$nulls":5},{"$f":"H253*H254","v":12.741632999999998}]
[]
[{"$f":"A241+1","v":26},"CODEVASF",null,null," COMPOSIÇÃO DE PREÇO UNITÁRIO",null,null,null,{"$f":"H269","v":10.26},{"$f":"H271","v":12.930678}]
[null,"OBRA:  ",{"$f":"$C$2","v":"CONSTRUÇÃO DE PONTE SOBRE O RIO SÃO DOMINGOS (CONTINUAÇÃO)"},null,null,null,"DATA: ",{"$f":"$H$2","v":"NOVEMBRO / 2023"}]
[null,"SERVIÇO:  ",{"$f":"VLOOKUP(A257,ORÇAMENTO!$A$27:$I$41,3)","v":"ARMAÇÃO DE PILAR OU VIGA DE UMA ESTRUTURA CONVENCIONAL DE CONCRETO ARMADO UTILIZANDO AÇO CA-50 DE 25 MM"},null,"SICRO",{"$f":"VLOOKUP(A257,ORÇAMENTO!$A$27:$I$40,4)","v":92782},"UNIDADE: ",{"$f":"VLOOKUP(A257,ORÇAMENTO!$A$27:$I$40,5)","v":"KG"},"OK"]
[]
[null,"TIPO ITEM","CODIGO ITEM","DESCRIÇÃO ITEM","UNIDADE ITEM","COEFICIENTE","PRECO UNITARIO","CUSTO TOTAL"]
[null,"INSUMO","39017","ESPACADOR / DISTANCIADOR CIRCULAR COM ENTRADA LATERAL, EM PLASTICO, PARA VERGALHAO *4,2 A 12,5* MM, COBRIMENTO 20 MM","UN",6.0000000000000001E-3,0.19,{"$f":"ROUNDDOWN(F262*G262,2)","v":0}]
[null,"INSUMO","43132","ARAME RECOZIDO 16 BWG, D = 1,65 MM (0,016 KG/M) OU 18 BWG, D = 1,25 MM (0,01 KG/M)","KG","0,0250000","26,90",0.67]
[null,"COMPOSICAO","88238","AJUDANTE DE ARMADOR COM ENCARGOS COMPLEMENTARES","H","0,0030000","16,52",0.04]
[null,"COMPOSICAO","88245","ARMADOR COM ENCARGOS COMPLEMENTARES","H","0,0183000","21,94",0.4]
[null,"COMPOSICAO",92807,"CORTE E DOBRA DE AÇO CA-50, DIÂMETRO DE 25,0 MM, UTILIZADO EM ESTRUTURAS DIVERSAS","KG","1,0000000",9.15,9.15]
[{"$nulls":7},0]
[null,"PRODUÇÃO DA EQUIPE",null,null,1,"CUSTO ",null,{"$f":"SUM(H262:H267)","v":10.26}]
[null,"TOTAL",{"$nulls":5},{"$f":"H268/E268","v":10.26},"OK"]
[null,"BDI                %",{"$nulls":5},{"$f":"1+$M$1","v":1.2603}]
[null,"TOTAL DO SERVIÇO - R$",{"$nulls":5},{"$f":"H269*H270","v":12.930678}]
[]
[{"$f":"A257+1","v":27},"CODEVASF",null,null," COMPOSIÇÃO DE PREÇO UNITÁRIO",null,null,null,{"$f":"H287","v":162.91},{"$f":"H289","v":205.315473}]
[null,"OBRA:  ",{"$f":"$C$2","v":"CONSTRUÇÃO DE PONTE SOBRE O RIO SÃO DOMINGOS (CONTINUAÇÃO)"},null,null,null,"DATA: ",{"$f":"$H$2","v":"NOVEMBRO / 2023"}]
[null,"SERVIÇO:  ",{"$f":"VLOOKUP(A273,ORÇAMENTO!$A$11:$I$40,3)","v":"FABRICAÇÃO DE FÔRMA PARA PILARES E VIGAS, EM CHAPA DE MADEIRA COMPENSADA RESINADA, E = 17 MM"},null,"SINAPI",{"$f":"VLOOKUP(A273,ORÇAMENTO!$A$11:$I$40,4)","v":92263},"UNIDADE: ",{"$f":"VLOOKUP(A273,ORÇAMENTO!$A$11:$I$40,5)","v":"M2"},"OK"]
[]
[null,"TIPO ITEM","CODIGO ITEM","DESCRIÇÃO ITEM","UNIDADE ITEM","COEFICIENTE","PRECO UNITARIO","CUSTO TOTAL"]
[null,"INSUMO","1358","CHAPA DE MADEIRA COMPENSADA RESINADA PARA FORMA DE CONCRETO, DE *2,2 X 1,1* M, E = 17 MM","M2","1,3360000","46,88",{"$f":"ROUNDDOWN(F278*G278,2)","v":62.63}]
[null,"INSUMO","4491","PONTALETE *7,5 X 7,5* CM EM PINUS, MISTA OU EQUIVALENTE DA REGIAO - BRUTA","M","2,3080000","8,68",20.03]
[null,"INSUMO","4517","SARRAFO *2,5 X 7,5* CM EM PINUS, MISTA OU EQUIVALENTE DA REGIAO - BRUTA","M","9,2370000","3,04",28.08]
[null,"INSUMO","5068","PREGO DE ACO POLIDO COM CABECA 17 X 21 (2 X 11)","KG","0,2080000","19,23",3.99]
[null,"COMPOSICAO","88239","AJUDANTE DE CARPINTEIRO COM ENCARGOS COMPLEMENTARES","H","0,2500000","21,78",5.44]
[null,"COMPOSICAO","88262","CARPINTEIRO DE FORMAS COM ENCARGOS COMPLEMENTARES","H",1.18,"27,05",31.91]
[null,"COMPOSICAO","91692","SERRA CIRCULAR DE BANCADA COM MOTOR ELÉTRICO POTÊNCIA DE 5HP, COM COIFA ","CHP","0,0630000","35,13",2.21]
[null,"COMPOSICAO","91693","SERRA CIRCULAR DE BANCADA COM MOTOR ELÉTRICO POTÊNCIA DE 5HP, COM COIFA","CHI",0.255,"33,81",8.6199999999999992]
[null,"PRODUÇÃO DA EQUIPE",null,null,1,"CUSTO ",null,{"$f":"SUM(H278:H285)","v":162.91}]
[null,"TOTAL",{"$nulls":5},{"$f":"H286/E286","v":162.91},"OK"]
[null,"BDI                %",{"$nulls":5},{"$f":"1+$M$1","v":1.2603}]
[null,"TOTAL DO SERVIÇO - R$",{"$nulls":5},{"$f":"H287*H288","v":205.315473}]
[]
[{"$f":"A273+1","v":28},"CODEVASF",null,null," COMPOSIÇÃO DE PREÇO UNITÁRIO",null,null,null,{"$f":"H305","v":34.879999999999995},{"$f":"H307","v":43.95926399999999}]
[null,"OBRA:  ",{"$f":"$C$2","v":"CONSTRUÇÃO DE PONTE SOBRE O RIO SÃO DOMINGOS (CONTINUAÇÃO)"},null,null,null,"DATA: ",{"$f":"$H$2","v":"NOVEMBRO / 2023"}]
[null,"SERVIÇO:  ",{"$f":"VLOOKUP(A291,ORÇAMENTO!$A$11:$I$40,3)","v":"MONTAGEM E DESMONTAGEM DE FÔRMA DE PILARES RETANGULARES E VIGAS, EM CHAPA DE MADEIRA COMPENSADA PLASTIFICADA, 10 UTILIZAÇÕES"},null,"SINAPI",{"$f":"VLOOKUP(A291,ORÇAMENTO!$A$11:$I$40,4)","v":92431},"UNIDADE: ",{"$f":"VLOOKUP(A291,ORÇAMENTO!$A$11:$I$40,5)","v":"M2"},"OK"]
[]
[null,"TIPO ITEM","CODIGO ITEM","DESCRIÇÃO ITEM","UNIDADE ITEM","COEFICIENTE","PRECO UNITARIO","CUSTO TOTAL"]
[null,"INSUMO","2692","DESMOLDANTE PROTETOR PARA FORMAS DE MADEIRA, DE BASE OLEOSA EMULSIONADA EM AGUA","L","0,0040000","5,86",{"$f":"ROUNDDOWN(F296*G296,2)","v":0.02}]
[null,"INSUMO","40271","LOCACAO DE APRUMADOR METALICO DE PILAR, COM ALTURA E ANGULO REGULAVEIS, EXTENSAO DE *1,50* A *2,80* M","MES","0,1960000","15,31",3]
[null,"INSUMO","40275","LOCACAO DE VIGA SANDUICHE METALICA VAZADA PARA TRAVAMENTO DE PILARES, ALTURA DE *8* CM, LARGURA DE *6* CM E EXTENSAO DE 2 M","MES","0,3930000","16,00",6.28]
[null,"INSUMO","40287","LOCACAO DE BARRA DE ANCORAGEM DE 0,80 A 1,20 M DE EXTENSAO, COM ROSCA DE 5/8\", INCLUINDO PORCA E FLANGE","MES","0,7850000","5,89",4.62]
[null,"INSUMO","40304","PREGO DE ACO POLIDO COM CABECA DUPLA 17 X 27 (2 1/2 X 11)","KG","0,0190000","23,73",0.45]
[null,"COMPOSICAO","88239","AJUDANTE DE CARPINTEIRO COM ENCARGOS COMPLEMENTARES","H","0,1210000","21,78",2.63]
[null,"COMPOSICAO","88262","CARPINTEIRO DE FORMAS COM ENCARGOS COMPLEMENTARES","H","0,6610000","27,05",17.88]
[{"$nulls":7},0]
[null,"PRODUÇÃO DA EQUIPE",null,null,1,"CUSTO ",null,{"$f":"SUM(H296:H303)","v":34.879999999999995}]
[null,"TOTAL",{"$nulls":5},{"$f":"H304/E304","v":34.879999999999995},"OK"]
[null,"BDI                %",{"$nulls":5},{"$f":"1+$M$1","v":1.2603}]
[null,"TOTAL DO SERVIÇO - R$",{"$nulls":5},{"$f":"H305*H306","v":43.95926399999999}]
[]
[{"$f":"A291+1","v":29},"CODEVASF",null,null," COMPOSIÇÃO DE PREÇO UNITÁRIO",null,null,null,{"$f":"H321","v":50.360000000000007},{"$f":"H323","v":63.468708000000007}]
[null,"OBRA:  ",{"$f":"$C$2","v":"CONSTRUÇÃO DE PONTE SOBRE O RIO SÃO DOMINGOS (CONTINUAÇÃO)"},null,null,null,"DATA: ",{"$f":"$H$2","v":"NOVEMBRO / 2023"}]
[null,"SERVIÇO:  ",{"$f":"VLOOKUP(A309,ORÇAMENTO!$A$32:$I$51,3)","v":"FABRICAÇÃO DE FÔRMA PARA LAJES, EM CHAPA DE MADEIRA COMPENSADA RESINADA, E = 17 MM"},null,"SINAPI",{"$f":"VLOOKUP(A309,ORÇAMENTO!$A$32:$I$51,4)","v":92267},"UNIDADE: ",{"$f":"VLOOKUP(A309,ORÇAMENTO!$A$32:$I$51,5)","v":"M2"},"OK"]
[]
[null,"TIPO ITEM","CODIGO ITEM","DESCRIÇÃO ITEM","UNIDADE ITEM","COEFICIENTE","PRECO UNITARIO","CUSTO TOTAL"]
[null,"INSUMO","1358","CHAPA DE MADEIRA COMPENSADA RESINADA PARA FORMA DE CONCRETO, DE *2,2 X 1,1* M, E = 17 MM","M2","1,0500000","46,88",{"$f":"ROUNDDOWN(F314*G314,2)","v":49.22}]
[null,"COMPOSICAO","88239","AJUDANTE DE CARPINTEIRO COM ENCARGOS COMPLEMENTARES","H","0,0050000","21,78",{"$f":"ROUNDDOWN(F315*G315,2)","v":0.1}]
[null,"COMPOSICAO","88262","CARPINTEIRO DE FORMAS COM ENCARGOS COMPLEMENTARES","H",5.0000000000000001E-3,"27,05",0.13]
[null,"COMPOSICAO","91692","SERRA CIRCULAR DE BANCADA COM MOTOR ELÉTRICO POTÊNCIA DE 5HP, COM COIFA PARA DISCO 10\"","CHP","0,0050000","35,13",0.17]
[null,"COMPOSICAO","91693","SERRA CIRCULAR DE BANCADA COM MOTOR ELÉTRICO POTÊNCIA DE 5HP, COM COIFA PARA DISCO 10\"","CHI",2.1999999999999999E-2,"33,81",0.74]
[{"$nulls":7},0]
[null,"PRODUÇÃO DA EQUIPE",null,null,1,"CUSTO ",null,{"$f":"SUM(H314:H319)","v":50.360000000000007}]
[null,"TOTAL",{"$nulls":5},{"$f":"H320/E320","v":50.360000000000007},"OK"]
[null,"BDI                %",{"$nulls":5},{"$f":"1+$M$1","v":1.2603}]
[null,"TOTAL DO SERVIÇO - R$",{"$nulls":5},{"$f":"H321*H322","v":63.468708000000007}]
[]
[{"$f":"A309+1","v":30},"CODEVASF",null,null," COMPOSIÇÃO DE PREÇO UNITÁRIO",null,null,null,{"$f":"H336","v":48.89},{"$f":"H338","v":61.616067000000001}]
[null,"OBRA:  ",{"$f":"$C$2","v":"CONSTRUÇÃO DE PONTE SOBRE O RIO SÃO DOMINGOS (CONTINUAÇÃO)"},null,null,null,"DATA: ",{"$f":"$H$2","v":"NOVEMBRO / 2023"}]
[null,"SERVIÇO:  ",{"$f":"VLOOKUP(A325,ORÇAMENTO!$A$32:$I$51,3)","v":"MONTAGEM E DESMONTAGEM DE FÔRMA DE LAJE MACIÇA, EM CHAPA DE MADEIRA COMPENSADA RESINADA, 2 UTILIZAÇÕES"},null,"SINAPI",{"$f":"VLOOKUP(A325,ORÇAMENTO!$A$32:$I$51,4)","v":92508},"UNIDADE: ",{"$f":"VLOOKUP(A325,ORÇAMENTO!$A$32:$I$51,5)","v":"M2"},"OK"]
[]
[null,"TIPO ITEM","CODIGO ITEM","DESCRIÇÃO ITEM","UNIDADE ITEM","COEFICIENTE","PRECO UNITARIO","CUSTO TOTAL"]
[null,"INSUMO","2692","DESMOLDANTE PROTETOR PARA FORMAS DE MADEIRA, DE BASE OLEOSA EMULSIONADA EM AGUA","L","0,0100000","5,86",{"$f":"ROUNDDOWN(F330*G330,2)","v":0.05}]
[null,"INSUMO","40270","VIGA DE ESCORAMAENTO H20, DE MADEIRA, PESO DE 5,00 A 5,20 KG/M, COM EXTREMIDADES PLASTICAS","M","0,0950000","126,05",11.97]
[null,"COMPOSICAO","88239","AJUDANTE DE CARPINTEIRO COM ENCARGOS COMPLEMENTARES","H","0,2180000","21,78",4.74]
[null,"COMPOSICAO","88262","CARPINTEIRO DE FORMAS COM ENCARGOS COMPLEMENTARES","H","1,1880000","27,05",32.130000000000003]
[{"$nulls":7},0]
[null,"PRODUÇÃO DA EQUIPE",null,null,1,"CUSTO ",null,{"$f":"SUM(H330:H334)","v":48.89}]
[null,"TOTAL",{"$nulls":5},{"$f":"H335/E335","v":48.89},"OK"]
[null,"BDI                %",{"$nulls":5},{"$f":"1+$M$1","v":1.2603}]
[null,"TOTAL DO SERVIÇO - R$",{"$nulls":5},{"$f":"H336*H337","v":61.616067000000001}]
[]
[{"$f":"A325+1","v":31},"CODEVASF",null,null," COMPOSIÇÃO DE PREÇO UNITÁRIO",null,null,null,{"$f":"H353","v":138.20000000000002},{"$f":"H355","v":174.17346000000001}]
[null,"OBRA:  ",{"$f":"$C$2","v":"CONSTRUÇÃO DE PONTE SOBRE O RIO SÃO DOMINGOS (CONTINUAÇÃO)"},null,null,null,"DATA: ",{"$f":"$H$2","v":"NOVEMBRO / 2023"}]
[null,"SERVIÇO:  ",{"$f":"VLOOKUP(A340,ORÇAMENTO!$A$32:$I$51,3)","v":"ESCORAMENTO DE FÔRMAS DE VIGAS E LAJES COM ESTRUTURA METÁLICA EM TORRE OU TRELIÇA, ALTURA ATÉ 18 METROS, INCLUSO MONTAGEM, TRAVAMENTO E DESMONTAGEM"},null,"SINAPI",{"$f":"VLOOKUP(A340,ORÇAMENTO!$A$32:$I$51,4)","v":"101792a"},"UNIDADE: ",{"$f":"VLOOKUP(A340,ORÇAMENTO!$A$32:$I$51,5)","v":"M3"},"OK"]
[]
[null,"TIPO ITEM","CODIGO ITEM","DESCRIÇÃO ITEM","UNIDADE ITEM","COEFICIENTE","PRECO UNITARIO","CUSTO TOTAL"]
[null,"INSUMO","COTAÇÃO","LOCACAO DE ESTRUTURA TRELIÇADA OU TORRE METALICA COMPLETA PARA UMA CARGA DE 8 TF (80 KN), INCLUINDO MODULOS , DIAGONAIS, SAPATAS E FORCADOS","KG/MÊS",{"$f":"(63108.71+4282.36)/3000","v":22.463689999999996},{"$f":"4813.03/63108.71*60","v":4.5759420530066297},{"$f":"ROUNDDOWN(F345*G345,2)","v":102.79}]
[null,"INSUMO","11977","CHUMBADOR DE ACO, DIAMETRO 1/2\", COMPRIMENTO 75 MM","UN",{"$f":"27.68*0.0169","v":0.46779199999999993},"14,62",6.83]
[null,"COMPOSICAO","88240","AJUDANTE DE ESTRUTURA METÁLICA COM ENCARGOS COMPLEMENTARES","H",{"$f":"27.68*0.0019","v":5.2592E-2},"24,92",1.31]
[null,"COMPOSICAO","88278","MONTADOR DE ESTRUTURA METÁLICA COM ENCARGOS COMPLEMENTARES","H",{"$f":"27.68*0.0097","v":0.26849600000000001},"32,14",8.6199999999999992]
[null,"COMPOSICAO","93287","GUINDASTE HIDRÁULICO AUTOPROPELIDO, COM LANÇA TELESCÓPICA 40 M, CAPACIDADE MÁXIMA 60 T, POTÊNCIA 260 KW","CHP",{"$f":"27.68*0.0014","v":3.8752000000000002E-2},"334,92",12.97]
[null,"COMPOSICAO","93288","GUINDASTE HIDRÁULICO AUTOPROPELIDO, COM LANÇA TELESCÓPICA 40 M, CAPACIDADE MÁXIMA 60 T, POTÊNCIA 260 KW","CHI",{"$f":"27.68*0.0012","v":3.3215999999999996E-2},"171,30",5.68]
[{"$nulls":7},0]
[null,"PRODUÇÃO DA EQUIPE",null,null,1,"CUSTO ",null,{"$f":"SUM(H345:H351)","v":138.20000000000002}]
[null,"TOTAL",{"$nulls":5},{"$f":"H352/E352","v":138.20000000000002},"OK"]
[null,"BDI                %",{"$nulls":5},{"$f":"1+$M$1","v":1.2603}]
[null,"TOTAL DO SERVIÇO - R$",{"$nulls":5},{"$f":"H353*H354","v":174.17346000000001}]
[]
[33,"CODEVASF",null,null," COMPOSIÇÃO DE PREÇO UNITÁRIO",null,null,null,{"$f":"H370","v":753.42},{"$f":"H372","v":949.53522599999997}]
[null,"OBRA:  ",{"$f":"$C$2","v":"CONSTRUÇÃO DE PONTE SOBRE O RIO SÃO DOMINGOS (CONTINUAÇÃO)"},null,null,null,"DATA: ",{"$f":"$H$2","v":"NOVEMBRO / 2023"}]
[null,"SERVIÇO:  ",{"$f":"ORÇAMENTO!C36","v":"CONCRETAGEM DE ESTRUTURAS (VIGAS E LAJES) COM CONCRETO USINADO BOMBEÁVEL FCK 30 MPA - LANÇAMENTO, ADENSAMENTO E ACABAMENTO"},null,"SINAPI",{"$f":"ORÇAMENTO!D36","v":"103684.a"},"UNIDADE: ",{"$f":"ORÇAMENTO!E36","v":"M3"}]
[]
[null,"TIPO ITEM","CODIGO ITEM","DESCRIÇÃO ITEM","UNIDADE ITEM","COEFICIENTE","PRECO UNITARIO","CUSTO TOTAL"]
[null,"INSUMO","1525","CONCRETO USINADO BOMBEAVEL, CLASSE DE RESISTENCIA C30, COM BRITA 0 E 1, SLUMP = 100 +/- 20 MM, INCLUI SERVICO DE BOMBEAMENTO (NBR 8953)","M3","1,1030000",631.47,{"$f":"ROUNDDOWN(F362*G362,2)","v":696.51}]
[null,"COMPOSICAO","88262","CARPINTEIRO DE FORMAS COM ENCARGOS COMPLEMENTARES","H","0,1710000","27,05",4.62]
[null,"COMPOSICAO","88309","PEDREIRO COM ENCARGOS COMPLEMENTARES","H","1,0260000","27,45",28.16]
[null,"COMPOSICAO","88316","SERVENTE COM ENCARGOS COMPLEMENTARES","H","1,2130000","19,76",23.96]
[null,"COMPOSICAO","90586","VIBRADOR DE IMERSÃO, DIÂMETRO DE PONTEIRA 45MM, MOTOR ELÉTRICO TRIFÁSICO POTÊNCIA 2CV","CHP","0,1200000","1,29",0.15]
[null,"COMPOSICAO","90587","VIBRADOR DE IMERSÃO, DIÂMETRO DE PONTEIRA 45MM, MOTOR ELÉTRICO TRIFÁSICO POTÊNCIA 2CV","CHI","0,0510000","0,49",0.02]
[{"$nulls":7},0]
[null,"PRODUÇÃO DA EQUIPE",null,null,1,"CUSTO ",null,{"$f":"SUM(H362:H368)","v":753.42}]
[null,"TOTAL",{"$nulls":5},{"$f":"H369/E369","v":753.42},"OK"]
[null,"BDI                %",{"$nulls":5},{"$f":"1+$M$1","v":1.2603}]
[null,"TOTAL DO SERVIÇO - R$",{"$nulls":5},{"$f":"H370*H371","v":949.53522599999997}]
[]
[{"$f":"A357+1","v":34},"CODEVASF",null,null," COMPOSIÇÃO DE PREÇO UNITÁRIO",null,null,null,{"$f":"H384","v":323.94},{"$f":"H386","v":408.26158199999998}]
[null,"OBRA:  ",{"$f":"$C$2","v":"CONSTRUÇÃO DE PONTE SOBRE O RIO SÃO DOMINGOS (CONTINUAÇÃO)"},null,null,null,"DATA: ",{"$f":"$H$2","v":"NOVEMBRO / 2023"}]
[null,"SERVIÇO:  ",{"$f":"ORÇAMENTO!C35","v":"POLIESTIRENO EXPANDIDO (EPS - ISOPOR), TIPO 2F, BLOCO - FORNECIMENTO E COLOCAÇÃO"},null,"SINAPI",{"$f":"ORÇAMENTO!D35","v":"CPU.5"},"UNIDADE: ",{"$f":"ORÇAMENTO!E35","v":"M3"},"OK"]
[]
[null,"TIPO ITEM","CODIGO ITEM","DESCRIÇÃO ITEM","UNIDADE ITEM","COEFICIENTE","PRECO UNITARIO","CUSTO TOTAL"]
[null,"INSUMO",39995,"POLIESTIRENO EXPANDIDO/EPS (ISOPOR), TIPO 2F, BLOCO","M3",1.05,308.08,{"$f":"ROUNDDOWN(F379*G379,2)","v":323.48}]
[null,"COMPOSICAO","88262","CARPINTEIRO DE FORMAS COM ENCARGOS COMPLEMENTARES","H",0.01,27.05,0.27]
[null,"COMPOSICAO","88316","SERVENTE COM ENCARGOS COMPLEMENTARES","H",0.01,19.760000000000002,0.19]
[{"$nulls":7},0]
[null,"PRODUÇÃO DA EQUIPE",null,null,1,"CUSTO ",null,{"$f":"SUM(H379:H382)","v":323.94}]
[null,"TOTAL",{"$nulls":5},{"$f":"H383/E383","v":323.94},"OK"]
[null,"BDI                %",{"$nulls":5},{"$f":"1+$M$1","v":1.2603}]
[null,"TOTAL DO SERVIÇO - R$",{"$nulls":5},{"$f":"H384*H385","v":408.26158199999998}]
[]
[35,"CODEVASF",null,null," COMPOSIÇÃO DE PREÇO UNITÁRIO",null,null,null,{"$f":"H398","v":109.06},{"$f":"H400","v":137.448318}]
[null,"OBRA:  ",{"$f":"$C$2","v":"CONSTRUÇÃO DE PONTE SOBRE O RIO SÃO DOMINGOS (CONTINUAÇÃO)"},null,null,null,"DATA: ",{"$f":"$H$2","v":"NOVEMBRO / 2023"}]
[null,"SERVIÇO:  ",{"$f":"ORÇAMENTO!C37","v":"APARELHO DE APOIO EM NEOPRENE FRETADO, COM FRETAGEM DE AÇO 4MM INTERCALADAS COM ELASTÔMERO DE 11MM E REVESTIMENTO FINAL COM ELASTÔMERO DE 6MM"},null,"SINAPI",{"$f":"ORÇAMENTO!D37","v":"CPU.6"},"UNIDADE: ",{"$f":"ORÇAMENTO!E37","v":"DM3"},"OK"]
[]
[null,"TIPO ITEM","CODIGO ITEM","DESCRIÇÃO ITEM","UNIDADE ITEM","COEFICIENTE","PRECO UNITARIO","CUSTO TOTAL"]
[null,"INSUMO",12888,"APARELHO DE APOIO DE NEOPRENE FRETADO, 50 X 50 X 4,35 CM, COM FRETAGEM DE ACO DE 3 MM INTERCALADAS COM ELASTOMERO DE 12,5 MM E REVESTIMENTO FINAL COM ELASTOMERO DE 12,5 MM","DM3",1,104.77,{"$f":"ROUNDDOWN(F393*G393,2)","v":104.77}]
[null,"COMPOSICAO","88262","CARPINTEIRO DE FORMAS COM ENCARGOS COMPLEMENTARES","H",{"$f":"1/10.88","v":9.1911764705882346E-2},27.05,2.48]
[null,"COMPOSICAO","88316","SERVENTE COM ENCARGOS COMPLEMENTARES","H",{"$f":"1/10.88","v":9.1911764705882346E-2},19.760000000000002,1.81]
[{"$nulls":7},0]
[null,"PRODUÇÃO DA EQUIPE",null,null,1,"CUSTO ",null,{"$f":"SUM(H393:H396)","v":109.06}]
[null,"TOTAL",{"$nulls":5},{"$f":"H397/E397","v":109.06},"OK"]
[null,"BDI                %",{"$nulls":5},{"$f":"1+$M$1","v":1.2603}]
[null,"TOTAL DO SERVIÇO - R$",{"$nulls":5},{"$f":"H398*H399","v":137.448318}]
[]
[{"$f":"A374+2","v":36},"CODEVASF",null,null," COMPOSIÇÃO DE PREÇO UNITÁRIO",null,null,null,{"$f":"H414","v":20.459999999999997},{"$f":"H416","v":25.785737999999995}]
[null,"OBRA:  ",{"$f":"$C$2","v":"CONSTRUÇÃO DE PONTE SOBRE O RIO SÃO DOMINGOS (CONTINUAÇÃO)"},null,null,null,"DATA: ",{"$f":"$H$2","v":"NOVEMBRO / 2023"}]
[null,"SERVIÇO:  ",{"$f":"VLOOKUP(A402,ORÇAMENTO!$A$11:$I$51,3)","v":"TRATAMENTO DE JUNTA DE DILATAÇÃO COM MANTA ASFÁLTICA ADERIDA COM MAÇARICO"},null,"SINAPI",{"$f":"VLOOKUP(A402,ORÇAMENTO!$A$11:$I$51,4)","v":98576},"UNIDADE: ",{"$f":"VLOOKUP(A402,ORÇAMENTO!$A$11:$I$51,5)","v":"M"},"OK"]
[]
[null,"TIPO ITEM","CODIGO ITEM","DESCRIÇÃO ITEM","UNIDADE ITEM","COEFICIENTE","PRECO UNITARIO","CUSTO TOTAL"]
[null,"INSUMO","511","PRIMER PARA MANTA ASFALTICA A BASE DE ASFALTO MODIFICADO DILUIDO EM SOLVENTE, APLICACAO A FRIO","L","0,1850000",17,{"$f":"ROUNDDOWN(F407*G407,2)","v":3.14}]
[null,"INSUMO","4226","GAS DE COZINHA - GLP","KG","0,0078000",7.89,0.06]
[null,"INSUMO","11621","MANTA ASFALTICA ELASTOMERICA EM POLIESTER ALUMINIZADA 3 MM, TIPO III, CLASSE B (NBR 9952)","M2","0,3380000",48.62,16.43]
[null,"COMPOSICAO","88270","IMPERMEABILIZADOR COM ENCARGOS COMPLEMENTARES","H","0,0270000","27,45",0.74]
[null,"COMPOSICAO","88316","SERVENTE COM ENCARGOS COMPLEMENTARES","H","0,0050000","19,76",0.09]
[{"$nulls":7},0]
[null,"PRODUÇÃO DA EQUIPE",null,null,1,"CUSTO ",null,{"$f":"SUM(H407:H412)","v":20.459999999999997}]
[null,"TOTAL",{"$nulls":5},{"$f":"H413/E413","v":20.459999999999997},"OK"]
[null,"BDI                %",{"$nulls":5},{"$f":"1+$M$1","v":1.2603}]
[null,"TOTAL DO SERVIÇO - R$",{"$nulls":5},{"$f":"H414*H415","v":25.785737999999995}]
[]
[{"$f":"A402+1","v":37},"CODEVASF",null,null," COMPOSIÇÃO DE PREÇO UNITÁRIO",null,null,null,{"$f":"H432","v":2.48},{"$f":"H434","v":3.1255440000000001}]
[null,"OBRA:  ",{"$f":"$C$2","v":"CONSTRUÇÃO DE PONTE SOBRE O RIO SÃO DOMINGOS (CONTINUAÇÃO)"},null,null,null,"DATA: ",{"$f":"$H$2","v":"NOVEMBRO / 2023"}]
[null,"SERVIÇO:  ",{"$f":"VLOOKUP(A418,ORÇAMENTO!$A$11:$I$51,3)","v":"EXECUÇÃO DE PINTURA DE LIGAÇÃO COM EMULSÃO ASFÁLTICA RR-2C"},null,"SINAPI",{"$f":"VLOOKUP(A418,ORÇAMENTO!$A$11:$I$51,4)","v":96402},"UNIDADE: ",{"$f":"VLOOKUP(A418,ORÇAMENTO!$A$11:$I$51,5)","v":"M2"},"OK"]
[]
[null,"TIPO ITEM","CODIGO ITEM","DESCRIÇÃO ITEM","UNIDADE ITEM","COEFICIENTE","PRECO UNITARIO","CUSTO TOTAL"]
[null,"COMPOSICAO","5839","VASSOURA MECÂNICA REBOCÁVEL COM ESCOVA CILÍNDRICA, LARG. ÚTIL VARRIMENTO DE 2,44 M","CHP","0,0020000",10.3,{"$f":"ROUNDDOWN(F423*G423,2)","v":0.02}]
[null,"COMPOSICAO","5841","VASSOURA MECÂNICA REBOCÁVEL COM ESCOVA CILÍNDRICA, LARG. ÚTIL VARRIMENTO DE 2,44 M","CHI","0,0040000",5.18,0.02]
[null,"INSUMO","41903","EMULSAO ASFALTICA CATIONICA RR-2C PARA USO EM PAVIMENTACAO ASFALTICA (COLETADO CAIXA NA ANP ACRESCIDO DE ICMS)","KG","0,4500000",{"$f":"2.68167*1.2195122","v":3.2703292813739999},1.47]
[null,"COMPOSICAO","83362","ESPARGIDOR DE ASFALTO PRESSURIZADO, TANQUE 6 M3 COM ISOLAÇÃO TÉRMICA, AQUECIDO COM 2 MAÇARICOS, COM BARRA ESPARGIDORA 3,60 M, MONTADO SOBRE CAMINHÃO  TOCO","CHP","0,0004000",273.10000000000002,0.1]
[null,"COMPOSICAO","88316","SERVENTE COM ENCARGOS COMPLEMENTARES","H","0,0055000",19.760000000000002,0.1]
[null,"COMPOSICAO","89035","TRATOR DE PNEUS, POTÊNCIA 85 CV, TRAÇÃO 4X4, PESO COM LASTRO DE 4.675 KG","CHP","0,0017000",138.33000000000001,0.23]
[null,"COMPOSICAO","89036","TRATOR DE PNEUS, POTÊNCIA 85 CV, TRAÇÃO 4X4, PESO COM LASTRO DE 4.675 KG","CHI","0,0038000",54.12,0.2]
[null,"COMPOSICAO","91486","ESPARGIDOR DE ASFALTO PRESSURIZADO, TANQUE 6 M3 COM ISOLAÇÃO TÉRMICA, AQUECIDO COM 2 MAÇARICOS, COM BARRA ESPARGIDORA 3,60 M, MONTADO SOBRE CAMINHÃO  TOCO","CHI","0,0051000",67.62,0.34]
[null,"PRODUÇÃO DA EQUIPE",null,null,1,"CUSTO ",null,{"$f":"SUM(H423:H430)","v":2.48}]
[null,"TOTAL",{"$nulls":5},{"$f":"H431/E431","v":2.48},"OK"]
[null,"BDI                %",{"$nulls":5},{"$f":"1+$M$1","v":1.2603}]
[null,"TOTAL DO SERVIÇO - R$",{"$nulls":5},{"$f":"H432*H433","v":3.1255440000000001}]
[]
[{"$f":"A418+1","v":38},"CODEVASF",null,null," COMPOSIÇÃO DE PREÇO UNITÁRIO",null,null,null,{"$f":"H453","v":1855.72},{"$f":"H455","v":2338.7639159999999}]
[null,"OBRA:  ",{"$f":"$C$2","v":"CONSTRUÇÃO DE PONTE SOBRE O RIO SÃO DOMINGOS (CONTINUAÇÃO)"},null,null,null,"DATA: ",{"$f":"$H$2","v":"NOVEMBRO / 2023"}]
[null,"SERVIÇO:  ",{"$f":"VLOOKUP(A436,ORÇAMENTO!$A$11:$I$51,3)","v":"EXECUÇÃO DE PAVIMENTO COM APLICAÇÃO DE CONCRETO ASFÁLTICO, CAMADA DE ROLAMENTO - EXCLUSIVE CARGA E TRANSPORTE"},null,"SINAPI",{"$f":"VLOOKUP(A436,ORÇAMENTO!$A$11:$I$51,4)","v":95995},"UNIDADE: ",{"$f":"VLOOKUP(A436,ORÇAMENTO!$A$11:$I$51,5)","v":"M3"},"OK"]
[]
[null,"TIPO ITEM","CODIGO ITEM","DESCRIÇÃO ITEM","UNIDADE ITEM","COEFICIENTE","PRECO UNITARIO","CUSTO TOTAL"]
[null,"INSUMO","1518","CONCRETO BETUMINOSO USINADO A QUENTE (CBUQ) PARA PAVIMENTACAO ASFALTICA, PADRAO DNIT, FAIXA C, COM CAP 50/70 - AQUISICAO POSTO USINA","T","2,5548000","674,90",{"$f":"ROUNDDOWN(F441*G441,2)","v":1724.23}]
[null,"COMPOSICAO","5835","VIBROACABADORA DE ASFALTO SOBRE ESTEIRAS, LARGURA DE PAVIMENTAÇÃO 1,90 M A 5,30 M, POTÊNCIA 105 HP CAPACIDADE 450 T/H","CHP","0,0464000","404,38",18.760000000000002]
[null,"COMPOSICAO","5837","VIBROACABADORA DE ASFALTO SOBRE ESTEIRAS, LARGURA DE PAVIMENTAÇÃO 1,90 M A 5,30 M, POTÊNCIA 105 HP CAPACIDADE 450 T/H","CHI","0,0949000","163,99",15.56]
[null,"COMPOSICAO","88314","RASTELEIRO COM ENCARGOS COMPLEMENTARES","H","1,1301000","26,52",29.97]
[null,"COMPOSICAO","91386","CAMINHÃO BASCULANTE 10 M3, TRUCADO CABINE SIMPLES, PESO BRUTO TOTAL 23.000 KG, CARGA ÚTIL MÁXIMA 15.935 KG, INCLUSIVE CAÇAMBA METÁLICA","CHP","0,0464000","265,97",12.34]
[null,"COMPOSICAO","95631","ROLO COMPACTADOR VIBRATORIO TANDEM, ACO LISO, POTENCIA 125 HP, PESO SEM/COM LASTRO 10,20/11,65 T, LARGURA DE TRABALHO 1,73M","CHP","0,0805000","238,16",19.170000000000002]
[null,"COMPOSICAO","95632","ROLO COMPACTADOR VIBRATORIO TANDEM, ACO LISO, POTENCIA 125 HP, PESO SEM/COM LASTRO 10,20/11,65 T, LARGURA DE TRABALHO 1,73M","CHI","0,0607000","89,32",5.42]
[null,"COMPOSICAO","96155","TRATOR DE PNEUS COM POTÊNCIA DE 85 CV, TRAÇÃO 4X4, COM VASSOURA MECÂNICA ACOPLADA","CHI","0,1071000","59,06",6.32]
[null,"COMPOSICAO","96157","TRATOR DE PNEUS COM POTÊNCIA DE 85 CV, TRAÇÃO 4X4, COM VASSOURA MECÂNICA ACOPLADA","CHP","0,0341000","147,54",5.03]
[null,"COMPOSICAO","96463","ROLO COMPACTADOR DE PNEUS, ESTATICO, PRESSAO VARIAVEL, POTENCIA 110 HP, PESO SEM/COM LASTRO 10,8/27 T, LARG. ROLAGEM 2,30M","CHP","0,0419000","225,47",9.44]
[null,"COMPOSICAO","96464","ROLO COMPACTADOR DE PNEUS, ESTATICO, PRESSAO VARIAVEL, POTENCIA 110 HP, PESO SEM/COM LASTRO 10,8/27 T, LARG. ROLAGEM 2,30M","CHI","0,0990000","95,83",9.48]
[null,"PRODUÇÃO DA EQUIPE",null,null,1,"CUSTO ",null,{"$f":"SUM(H441:H451)","v":1855.72}]
[null,"TOTAL",{"$nulls":5},{"$f":"H452/E452","v":1855.72},"OK"]
[null,"BDI                %",{"$nulls":5},{"$f":"1+$M$1","v":1.2603}]
[null,"TOTAL DO SERVIÇO - R$",{"$nulls":5},{"$f":"H453*H454","v":2338.7639159999999}]
[]
[{"$f":"A436+1","v":39},"CODEVASF",null,null," COMPOSIÇÃO DE PREÇO UNITÁRIO",null,null,null,{"$f":"H466","v":1.5299999999999998},{"$f":"H468","v":1.9282589999999997}]
[null,"OBRA:  ",{"$f":"$C$2","v":"CONSTRUÇÃO DE PONTE SOBRE O RIO SÃO DOMINGOS (CONTINUAÇÃO)"},null,null,null,"DATA: ",{"$f":"$H$2","v":"NOVEMBRO / 2023"}]
[null,"SERVIÇO:  ",{"$f":"VLOOKUP(A457,ORÇAMENTO!$A$11:$I$51,3)","v":"TRANSPORTE DE MATERIAL ASFÁLTICO EM VIA URBANA EM REVESTIMENTO PRIMÁRIO"},null,"SINAPI",{"$f":"VLOOKUP(A457,ORÇAMENTO!$A$11:$I$51,4)","v":100965},"UNIDADE: ",{"$f":"VLOOKUP(A457,ORÇAMENTO!$A$11:$I$51,5)","v":"TXKM"},"OK"]
[]
[null,"TIPO ITEM","CODIGO ITEM","DESCRIÇÃO ITEM","UNIDADE ITEM","COEFICIENTE","PRECO UNITARIO","CUSTO TOTAL"]
[null,"COMPOSICAO","91645","CAMINHÃO DE TRANSPORTE DE MATERIAL ASFÁLTICO 30.000 L, COM CAVALO MECÂNICO DE CAPACIDADE MÁXIMA DE TRAÇÃO COMBINADO DE 66.000 KG, POTÊNCIA 360 CV, INCLUSIVE TANQUE DE ASFALTO COM SERPENTINA","CHP","0,0030000","470,92",{"$f":"ROUNDDOWN(F462*G462,2)","v":1.41}]
[null,"COMPOSICAO","91646","CAMINHÃO DE TRANSPORTE DE MATERIAL ASFÁLTICO 30.000 L, COM CAVALO MECÂNICO DE CAPACIDADE MÁXIMA DE TRAÇÃO COMBINADO DE 66.000 KG, POTÊNCIA 360 CV, INCLUSIVE TANQUE DE ASFALTO COM SERPENTINA","CHI","0,0013000","96,38",0.12]
[{"$nulls":7},0]
[null,"PRODUÇÃO DA EQUIPE",null,null,1,"CUSTO ",null,{"$f":"SUM(H462:H464)","v":1.5299999999999998}]
[null,"TOTAL",{"$nulls":5},{"$f":"H465/E465","v":1.5299999999999998},"OK"]
[null,"BDI                %",{"$nulls":5},{"$f":"1+$M$1","v":1.2603}]
[null,"TOTAL DO SERVIÇO - R$",{"$nulls":5},{"$f":"H466*H467","v":1.9282589999999997}]
[]
[{"$f":"A457+1","v":40},"CODEVASF",null,null," COMPOSIÇÃO DE PREÇO UNITÁRIO",null,null,null,{"$f":"H479","v":1.4200000000000002},{"$f":"H481","v":1.7896260000000002}]
[null,"OBRA:  ",{"$f":"$C$2","v":"CONSTRUÇÃO DE PONTE SOBRE O RIO SÃO DOMINGOS (CONTINUAÇÃO)"},null,null,null,"DATA: ",{"$f":"$H$2","v":"NOVEMBRO / 2023"}]
[null,"SERVIÇO:  ",{"$f":"VLOOKUP(A470,ORÇAMENTO!$A$11:$I$51,3)","v":"TRANSPORTE DE MATERIAL ASFÁLTICO EM VIA URBANA PAVIMENTADA"},null,"SINAPI",{"$f":"VLOOKUP(A470,ORÇAMENTO!$A$11:$I$51,4)","v":102330},"UNIDADE: ",{"$f":"VLOOKUP(A470,ORÇAMENTO!$A$11:$I$51,5)","v":"TXKM"},"OK"]
[]
[null,"TIPO ITEM","CODIGO ITEM","DESCRIÇÃO ITEM","UNIDADE ITEM","COEFICIENTE","PRECO UNITARIO","CUSTO TOTAL"]
[null,"COMPOSICAO","91645","CAMINHÃO DE TRANSPORTE DE MATERIAL ASFÁLTICO 30.000 L, COM CAVALO MECÂNICO DE CAPACIDADE MÁXIMA DE TRAÇÃO COMBINADO DE 66.000 KG, POTÊNCIA 360 CV, INCLUSIVE TANQUE DE ASFALTO COM SERPENTINA","CHP","0,0028000","470,92",{"$f":"ROUNDDOWN(F475*G475,2)","v":1.31}]
[null,"COMPOSICAO","91646","CAMINHÃO DE TRANSPORTE DE MATERIAL ASFÁLTICO 30.000 L, COM CAVALO MECÂNICO DE CAPACIDADE MÁXIMA DE TRAÇÃO COMBINADO DE 66.000 KG, POTÊNCIA 360 CV, INCLUSIVE TANQUE DE ASFALTO COM SERPENTINA","CHI","0,0012000","96,38",0.11]
[{"$nulls":7},0]
[null,"PRODUÇÃO DA EQUIPE",null,null,1,"CUSTO ",null,{"$f":"SUM(H475:H477)","v":1.4200000000000002}]
[null,"TOTAL",{"$nulls":5},{"$f":"H478/E478","v":1.4200000000000002}]
[null,"BDI                %",{"$nulls":5},{"$f":"1+$M$1","v":1.2603}]
[null,"TOTAL DO SERVIÇO - R$",{"$nulls":5},{"$f":"H479*H480","v":1.7896260000000002}]
[]
[{"$f":"A470+1","v":41},"CODEVASF",null,null," COMPOSIÇÃO DE PREÇO UNITÁRIO",null,null,null,{"$f":"H498","v":5.84},{"$f":"H500","v":7.3601519999999994}]
[null,"OBRA:  ",{"$f":"$C$2","v":"CONSTRUÇÃO DE PONTE SOBRE O RIO SÃO DOMINGOS (CONTINUAÇÃO)"},null,null,null,"DATA: ",{"$f":"$H$2","v":"NOVEMBRO / 2023"}]
[null,"SERVIÇO:  ",{"$f":"VLOOKUP(A483,ORÇAMENTO!$A$11:$I$51,3)","v":"PINTURA DE EIXO VIÁRIO SOBRE ASFALTO COM TINTA RETRORREFLETIVA A BASE DE RESINA ACRÍLICA COM MICROESFERAS DE VIDRO, APLICAÇÃO MECÂNICA COM DEMARCADORA AUTOPROPELIDA"},null,"SINAPI",{"$f":"VLOOKUP(A483,ORÇAMENTO!$A$11:$I$51,4)","v":102512},"UNIDADE: ",{"$f":"VLOOKUP(A483,ORÇAMENTO!$A$11:$I$51,5)","v":"M"},"OK"]
[]
[null,"TIPO ITEM","CODIGO ITEM","DESCRIÇÃO ITEM","UNIDADE ITEM","COEFICIENTE","PRECO UNITARIO","CUSTO TOTAL"]
[null,"INSUMO","5318","DILUENTE AGUARRAS","L","0,0020000","26,16",{"$f":"ROUNDDOWN(F488*G488,2)","v":0.05}]
[null,"INSUMO","7343","TINTA ACRILICA A BASE DE SOLVENTE, PARA SINALIZACAO HORIZONTAL VIARIA (NBR 11862)","L","0,0430000","17,82",0.76]
[null,"INSUMO","44477","MICROESFERAS DE VIDRO PARA SINALIZACAO HORIZONTAL VIARIA, TIPO II-A (DROP-ON) - NBR  16184","KG","0,0250000","10,74",0.26]
[null,"INSUMO","44478","MICROESFERAS DE VIDRO PARA SINALIZACAO HORIZONTAL VIARIA, TIPO I-B (PREMIX) - NBR  16184","KG","0,0110000","10,74",0.11]
[null,"COMPOSICAO","88310","PINTOR COM ENCARGOS COMPLEMENTARES","H","0,0340000","28,66",0.97]
[null,"COMPOSICAO","88316","SERVENTE COM ENCARGOS COMPLEMENTARES","H","0,0140000","19,76",0.27]
[null,"COMPOSICAO","95133","MÁQUINA DEMARCADORA DE FAIXA DE TRÁFEGO À FRIO, AUTOPROPELIDA, POTÊNCIA 38 HP","CHP","0,0003000","189,78",0.05]
[null,"COMPOSICAO","96159","MÁQUINA DEMARCADORA DE FAIXA DE TRÁFEGO À FRIO, AUTOPROPELIDA, POTÊNCIA 38 HP","CHI","0,0334000","100,90",3.37]
[{"$nulls":7},0]
[null,"PRODUÇÃO DA EQUIPE",null,null,1,"CUSTO ",null,{"$f":"SUM(H488:H496)","v":5.84}]
[null,"TOTAL",{"$nulls":5},{"$f":"H497/E497","v":5.84},"OK"]
[null,"BDI                %",{"$nulls":5},{"$f":"1+$M$1","v":1.2603}]
[null,"TOTAL DO SERVIÇO - R$",{"$nulls":5},{"$f":"H498*H499","v":7.3601519999999994}]
[]
[{"$f":"A483+1","v":42},"CODEVASF",null,null," COMPOSIÇÃO DE PREÇO UNITÁRIO",null,null,null,{"$f":"H515","v":835.47},{"$f":"H517","v":1052.942841}]
[null,"OBRA:  ",{"$f":"$C$2","v":"CONSTRUÇÃO DE PONTE SOBRE O RIO SÃO DOMINGOS (CONTINUAÇÃO)"},null,null,null,"DATA: ",{"$f":"$H$2","v":"NOVEMBRO / 2023"}]
[null,"SERVIÇO:  ",{"$f":"VLOOKUP(A502,ORÇAMENTO!$A$11:$I$51,3)","v":"PLACA DE AÇO CARBONO COM PELÍCULA REFLETIVA GRAU TÉCNICO TIPO I DA ABNT - PLACA CIRCULAR, INCLUSIVE POSTE DE SUSTENTAÇÃO - FORNECIMENTO E INSTALAÇÃO"},null,"SINAPI",{"$f":"VLOOKUP(A502,ORÇAMENTO!$A$11:$I$51,4)","v":"RO-41841"},"UNIDADE: ",{"$f":"VLOOKUP(A502,ORÇAMENTO!$A$11:$I$51,5)","v":"M2"},"OK"]
[]
[null,"TIPO ITEM","CODIGO ITEM","DESCRIÇÃO ITEM","UNIDADE ITEM","COEFICIENTE","PRECO UNITARIO","CUSTO TOTAL"]
[null,"INSUMO",34723,"PLACA DE SINALIZACAO EM CHAPA DE ACO NUM 16 COM PINTURA REFLETIVA","M2",1.1000000000000001,577.5,{"$f":"ROUNDDOWN(F507*G507,2)","v":635.25}]
[null,"INSUMO","4491","PONTALETE DE MADEIRA NAO APARELHADA *7,5 X 7,5* CM (3 X 3 \") PINUS, MISTA OU EQUIVALENTE DA REGIAO","M",4,8.68,34.72]
[null,"INSUMO","4417","SARRAFO DE MADEIRA NAO APARELHADA *2,5 X 7* CM, MACARANDUBA, ANGELIM OU EQUIVALENTE DA REGIAO","M",1,10.66,10.66]
[null,"INSUMO",436,"PARAFUSO FRANCES M16 EM ACO GALVANIZADO, COMPRIMENTO = 150 MM, DIAMETRO = 16 MM","UN.",4,13.25,53]
[null,"COMPOSICAO","88309","PEDREIRO COM ENCARGOS COMPLEMENTARES","H",1,27.45,27.45]
[null,"COMPOSICAO","88316","SERVENTE COM ENCARGOS COMPLEMENTARES","H",2,19.760000000000002,39.520000000000003]
[null,"INSUMO",34744,"PELICULA REFLETIVA DE ALTA INTENSIDADE, TIPO I DA ABNT, PARA SINALIZACAO VERTICAL","M2",1.5,23.25,34.869999999999997]
[null,"PRODUÇÃO DA EQUIPE",null,null,1,"CUSTO ",null,{"$f":"SUM(H507:H513)","v":835.47}]
[null,"TOTAL",{"$nulls":5},{"$f":"H514/E514","v":835.47},"OK"]
[null,"BDI                %",{"$nulls":5},{"$f":"1+$M$1","v":1.2603}]
[null,"TOTAL DO SERVIÇO - R$",{"$nulls":5},{"$f":"H515*H516","v":1052.942841}]
[]
[{"$f":"A502+1","v":43},"CODEVASF",null,null," COMPOSIÇÃO DE PREÇO UNITÁRIO",null,null,null,{"$f":"H532","v":803.57},{"$f":"H534","v":1012.739271}]
[null,"OBRA:  ",{"$f":"$C$2","v":"CONSTRUÇÃO DE PONTE SOBRE O RIO SÃO DOMINGOS (CONTINUAÇÃO)"},null,null,null,"DATA: ",{"$f":"$H$2","v":"NOVEMBRO / 2023"}]
[null,"SERVIÇO:  ",{"$f":"VLOOKUP(A519,ORÇAMENTO!$A$11:$I$51,3)","v":"PLACA DE AÇO CARBONO COM PELÍCULA REFLETIVA GRAU TÉCNICO TIPO I DA ABNT - PLACA QUADRADA, INCLUSIVE POSTE DE SUSTENTAÇÃO - FORNECIMENTO E INSTALAÇÃO"},null,"SINAPI",{"$f":"VLOOKUP(A519,ORÇAMENTO!$A$11:$I$51,4)","v":"RO-41842"},"UNIDADE: ",{"$f":"VLOOKUP(A519,ORÇAMENTO!$A$11:$I$51,5)","v":"M2"},"OK"]
[]
[null,"TIPO ITEM","CODIGO ITEM","DESCRIÇÃO ITEM","UNIDADE ITEM","COEFICIENTE","PRECO UNITARIO","CUSTO TOTAL"]
[null,"INSUMO",34723,"PLACA DE SINALIZACAO EM CHAPA DE ACO NUM 16 COM PINTURA REFLETIVA","M2",1.05,{"$f":"G507","v":577.5},{"$f":"ROUNDDOWN(F524*G524,2)","v":606.37}]
[null,"INSUMO","4491","PONTALETE DE MADEIRA NAO APARELHADA *7,5 X 7,5* CM (3 X 3 \") PINUS, MISTA OU EQUIVALENTE DA REGIAO","M",4,{"$f":"G508","v":8.68},34.72]
[null,"INSUMO","4417","SARRAFO DE MADEIRA NAO APARELHADA *2,5 X 7* CM, MACARANDUBA, ANGELIM OU EQUIVALENTE DA REGIAO","M",1,10.66,10.66]
[null,"INSUMO",436,"PARAFUSO FRANCES M16 EM ACO GALVANIZADO, COMPRIMENTO = 150 MM, DIAMETRO = 16 MM","UN.",4,13.25,53]
[null,"COMPOSICAO","88309","PEDREIRO COM ENCARGOS COMPLEMENTARES","H",1,27.45,27.45]
[null,"COMPOSICAO","88316","SERVENTE COM ENCARGOS COMPLEMENTARES","H",2,19.760000000000002,39.520000000000003]
[null,"COMPOSICAO",34744,"PELICULA REFLETIVA DE ALTA INTENSIDADE, TIPO I DA ABNT, PARA SINALIZACAO VERTICAL","M2",1.37,23.25,31.85]
[null,"PRODUÇÃO DA EQUIPE",null,null,1,"CUSTO ",null,{"$f":"SUM(H524:H530)","v":803.57}]
[null,"TOTAL",{"$nulls":5},{"$f":"H531/E531","v":803.57}]
[null,"BDI                %",{"$nulls":5},{"$f":"1+$M$1","v":1.2603}]
[null,"TOTAL DO SERVIÇO - R$",{"$nulls":5},{"$f":"H532*H533","v":1012.739271}]
[]
[44,"CODEVASF",null,null," COMPOSIÇÃO DE PREÇO UNITÁRIO",null,null,null,{"$f":"H547","v":9.0499999999999989},{"$f":"H549","v":11.405714999999999}]
[null,"OBRA:  ",{"$f":"$C$2","v":"CONSTRUÇÃO DE PONTE SOBRE O RIO SÃO DOMINGOS (CONTINUAÇÃO)"},null,null,null,"DATA: ",{"$f":"$H$2","v":"NOVEMBRO / 2023"}]
[null,"SERVIÇO:  ",{"$f":"VLOOKUP(A536,ORÇAMENTO!$A$44:$I$51,3)","v":"CARGA, MANOBRA E DESCARGA DE SOLOS E MATERIAIS EM GERAL (ENTULHO) EM CAMINHÃO BASCULANTE"},null,"SINAPI",{"$f":"VLOOKUP(A536,ORÇAMENTO!$A$44:$I$51,4)","v":100984},"UNIDADE: ",{"$f":"VLOOKUP(A536,ORÇAMENTO!$A$44:$I$51,5)","v":"M3"},"OK"]
[]
[null,"TIPO ITEM","CODIGO ITEM","DESCRIÇÃO ITEM","UNIDADE ITEM","COEFICIENTE","PRECO UNITARIO","CUSTO TOTAL"]
[null,"COMPOSICAO","5631","ESCAVADEIRA HIDRÁULICA SOBRE ESTEIRAS, CAÇAMBA 0,80 M3, PESO OPERACIONAL 17 T, POTENCIA BRUTA 111 HP","CHP","0,0083000","221,61",{"$f":"ROUNDDOWN(F541*G541,2)","v":1.83}]
[null,"COMPOSICAO","5632","ESCAVADEIRA HIDRÁULICA SOBRE ESTEIRAS, CAÇAMBA 0,80 M3, PESO OPERACIONAL 17 T, POTENCIA BRUTA 111 HP","CHI","0,0074000","98,05",0.72]
[null,"COMPOSICAO","89883","CAMINHÃO BASCULANTE 18 M3, COM CAVALO MECÂNICO DE CAPACIDADE MÁXIMA DE TRAÇÃO COMBINADO DE 45000 KG, POTÊNCIA 330 CV, INCLUSIVE SEMIREBOQUE COM CAÇAMBA METÁLICA","CHP","0,0153000","368,22",5.63]
[null,"COMPOSICAO","89884","CAMINHÃO BASCULANTE 18 M3, COM CAVALO MECÂNICO DE CAPACIDADE MÁXIMA DE TRAÇÃO COMBINADO DE 45000 KG, POTÊNCIA 330 CV, INCLUSIVE SEMIREBOQUE COM CAÇAMBA METÁLICA","CHI","0,0095000","92,13",0.87]
[{"$nulls":7},0]
[null,"PRODUÇÃO DA EQUIPE",null,null,1,"CUSTO ",null,{"$f":"SUM(H541:H545)","v":9.0499999999999989}]
[null,"TOTAL",{"$nulls":5},{"$f":"H546/E546","v":9.0499999999999989},"OK"]
[null,"BDI                %",{"$nulls":5},{"$f":"1+$M$1","v":1.2603}]
[null,"TOTAL DO SERVIÇO - R$",{"$nulls":5},{"$f":"H547*H548","v":11.405714999999999}]
[]
[45,"CODEVASF",null,null," COMPOSIÇÃO DE PREÇO UNITÁRIO",null,null,null,{"$f":"H565","v":11.940000000000001},{"$f":"H567","v":15.047982000000001}]
[null,"OBRA:  ",{"$f":"$C$2","v":"CONSTRUÇÃO DE PONTE SOBRE O RIO SÃO DOMINGOS (CONTINUAÇÃO)"},null,null,null,"DATA: ",{"$f":"$H$2","v":"NOVEMBRO / 2023"}]
[null,"SERVIÇO:  ",{"$f":"ORÇAMENTO!C48","v":"EXECUÇÃO E COMPACTAÇÃO DE ATERRO COM SOLO PREDOMINANTEMENTE ARGILOSO - EXCLUSIVE SOLO, CARGA E TRANSPORTE (ENCABEÇAMENTO)"},null,"SINAPI",{"$f":"ORÇAMENTO!D48","v":96385},"UNIDADE: ",{"$f":"ORÇAMENTO!E48","v":"M3"},"OK"]
[]
[null,"TIPO ITEM","CODIGO ITEM","DESCRIÇÃO ITEM","UNIDADE ITEM","COEFICIENTE","PRECO UNITARIO","CUSTO TOTAL"]
[null,"COMPOSICAO","5901","CAMINHÃO PIPA 10.000 L TRUCADO, PESO BRUTO TOTAL 23.000 KG, CARGA ÚTIL MÁXIMA 15.935 KG, DISTÂNCIA ENTRE EIXOS 4,8 M, POTÊNCIA 230 CV, INCLUSIVE TANQUE DE AÇO PARA TRANSPORTE DE ÁGUA","CHP","0,0040000","314,33",{"$f":"ROUNDDOWN(F556*G556,2)","v":1.25}]
[null,"COMPOSICAO","5903","CAMINHÃO PIPA 10.000 L TRUCADO, PESO BRUTO TOTAL 23.000 KG, CARGA ÚTIL MÁXIMA 15.935 KG, DISTÂNCIA ENTRE EIXOS 4,8 M, POTÊNCIA 230 CV, INCLUSIVE TANQUE DE AÇO PARA TRANSPORTE DE ÁGUA","CHI","0,0300000","71,41",2.14]
[null,"COMPOSICAO","5932","MOTONIVELADORA POTÊNCIA BÁSICA LÍQUIDA (PRIMEIRA MARCHA) 125 HP, PESO BRUTO 13032 KG, LARGURA DA LÂMINA DE 3,7 M","CHP","0,0060000","272,22",1.63]
[null,"COMPOSICAO","5934","MOTONIVELADORA POTÊNCIA BÁSICA LÍQUIDA (PRIMEIRA MARCHA) 125 HP, PESO BRUTO 13032 KG, LARGURA DA LÂMINA DE 3,7 M","CHI","0,0270000","109,40",2.95]
[null,"COMPOSICAO","73436","ROLO COMPACTADOR VIBRATÓRIO PÉ DE CARNEIRO PARA SOLOS, POTÊNCIA 80 HP, PESO OPERACIONAL SEM/COM LASTRO 7,4 / 8,8 T, LARGURA DE TRABALHO 1,68 M","CHP","0,0100000","169,68",1.69]
[null,"COMPOSICAO","88316","SERVENTE COM ENCARGOS COMPLEMENTARES","H","0,0330000","19,76",0.65]
[null,"COMPOSICAO","93244","ROLO COMPACTADOR VIBRATÓRIO PÉ DE CARNEIRO PARA SOLOS, POTÊNCIA 80 HP, PESO OPERACIONAL SEM/COM LASTRO 7,4 / 8,8 T, LARGURA DE TRABALHO 1,68 M","CHI","0,0230000","71,18",1.63]
[{"$nulls":7},0]
[null,"PRODUÇÃO DA EQUIPE",null,null,1,"CUSTO ",null,{"$f":"SUM(H556:H563)","v":11.940000000000001}]
[null,"TOTAL",{"$nulls":5},{"$f":"H564/E564","v":11.940000000000001},"OK"]
[null,"BDI                %",{"$nulls":5},{"$f":"1+$M$1","v":1.2603}]
[null,"TOTAL DO SERVIÇO - R$",{"$nulls":5},{"$f":"H565*H566","v":15.047982000000001}]

{"sheet":"BDI SERV","index":2,"n_rows":37,"n_cols":5,"rows_kept":37,"cut":false,"hidden":false,"merged":[[36,0,36,5],[3,1,4,1],[3,2,4,2],[0,1,2,4],[32,0,34,5],[28,0,28,5],[30,1,30,2],[31,1,31,2]]}
[null,"DETALHAMENTO DO BDI - SERVIÇOS"]
[]
[]
[null,"Item","Descrição dos Serviços","%","%"]
[null,null,null,"PV","CD"]
[]
[null,1,"ADMINISTRAÇÃO CENTRAL"," ",4]
[null,"1.1","ESCRITÓRIO CENTRAL"," "," "]
[null,"1.2","VIAGENS"," "," "]
[null,"1.3","OUTROS"," "," "]
[null," "," "," "," "]
[null,2,"IMPOSTOS E TAXAS",{"$f":"SUM(D13:D16)","v":7.65},{"$f":"SUM(E13:E16)","v":9.57}]
[null,"2.1","ISS (*)",{"$f":"0.8*5","v":4},{"$f":"ROUND(D13*1.2515,2)","v":5.01}]
[null,"2.2","PIS",0.65,0.81]
[null,"2.3","Cofins",3,3.75]
[null,"2.4","CONTRIBUIÇÃO PREVIDENCIÁRIA SOBRE A RENDA BRUTA",0,0]
[]
[null,3,"TAXA DE RISCO"," ",{"$f":"SUM(E19:E22)","v":2.6799999999999997}]
[null,"3.1","SEGURO",null,0.61]
[null,"3.2","RISCO",null,1.46]
[null,"3.3","GARANTIA",null,0.61]
[]
[null,4,"DESPESAS FINANCEIRAS"," ",1.02]
[]
[null,5,"LUCRO",null,8]
[]
[null," ","BDI - CALCULADO"," ",{"$f":"ROUND((((1+(E7+E18)/100)*(1+E23/100)*(1+E25/100)/(1-D12/100)-1)*100),2)","v":26.03}]
[]
["BDI = ((1+((AC+S+R+G)/100))x(1+DF/100)x(1+L/100)/(1-I/100)-1)*100"]
[]
[null,"BDI (CALCULADO):",null,{"$f":"ROUND((((1+((E7+E18)/100))*(1+E23/100)*(1+E25/100))/(1-D12/100)-1)*100,2)","v":26.03},"%"]
[null," "]
["(*) ISS CONFORME LEI COMPLEMENTAR Nº 006/2003 E LEI COMPLEMENTAR Nº 59/2009 QUE ALTEROU A ALÍQUOTA PARA ITENS 7 A 7.05 (ART. 9º ) - QUANT. ESTIMADA DE MATERIAIS = 20%"]
[]
[]
[]
["BDI EM CONFORMIDADE COM OS ACÓRDÃOS Nº 2369/2011 e ACÓRDÃO Nº 2.622/2013 - TCU - PLENÁRIO"]

{"sheet":"CRONOGRAMA","index":3,"n_rows":14,"n_cols":11,"rows_kept":14,"cut":false,"hidden":false,"merged":[[7,0,8,0],[9,0,10,0],[0,1,0,10],[3,1,3,6],[5,0,6,0],[5,2,6,2],[1,1,2,1],[5,1,6,1],[1,2,2,4],[11,1,12,2],[13,1,17,10],[9,2,10,2],[9,1,10,1],[7,1,8,1],[7,2,8,2]]}
[null,"CRONOGRAMA FÍSICO-FINANCEIRO"]
[null,"OBRA: ",{"$f":"ORÇAMENTO!C5","v":"CONSTRUÇÃO DE PONTE SOBRE O RIO SÃO DOMINGOS (CONTINUAÇÃO)"},null,null,"VALOR:",{"$f":"ORÇAMENTO!I51","v":1825219.63}]
[{"$nulls":5},"PRAZO: ","150 DIAS "]
[]
[null,"ITEM","ETAPAS/DESCRIÇAO","FISICO/  FINANCEIRO","TOTAL    ETAPAS","MÊS 1","MÊS 2","MÊS 3","MÊS 4","MÊS 5","TOTAL"]
["A",{"$f":"VLOOKUP(A6,ORÇAMENTO!$A$10:$I$51,2)","v":1},{"$f":"VLOOKUP(A6,ORÇAMENTO!$A$10:$I$51,3)","v":"SERVIÇOS PRELIMINARES "},"FISICO ",{"$f":"ROUND(E7/$G$2,4)","v":0.1193},0.2,0.2,0.2,0.2,0.2,{"$f":"SUM(F6:J6)","v":1}]
[null,null,null,"FINANCEIRO",{"$f":"ORÇAMENTO!I10","v":217707.91000000003},{"$f":"ROUND($E$7*F6,2)","v":43541.58},43541.58,{"$f":"ROUND($E$7*H6,2)","v":43541.58},43541.58,43541.58,{"$f":"SUM(F7:J7)","v":217707.90000000002}]
["D",{"$f":"VLOOKUP(A8,ORÇAMENTO!$A$10:$I$51,2)","v":2},{"$f":"VLOOKUP(A8,ORÇAMENTO!$A$10:$I$51,3)","v":"SUPERESTRUTURA E LAJES DE APROXIMAÇÃO"},"FISICO ",{"$f":"ROUND(E9/$G$2,4)","v":0.6794},0.1,0.7,0.2,0,0,{"$f":"SUM(F8:J8)","v":1}]
[null,null,null,"FINANCEIRO",{"$f":"ORÇAMENTO!I17","v":1239986.6099999999},{"$f":"ROUND($E$9*F8,2)","v":123998.66},{"$f":"ROUND($E$9*G8,2)","v":867990.63},247997.32,0,0,{"$f":"SUM(F9:J9)","v":1239986.6100000001}]
["E",{"$f":"VLOOKUP(A10,ORÇAMENTO!$A$10:$I$51,2)","v":3},{"$f":"VLOOKUP(A10,ORÇAMENTO!$A$10:$I$51,3)","v":"SERVIÇOS DIVERSOS - PAVIMENTAÇÃO, LIMPEZA FINAL E SINALIZAÇÃO"},"FISICO ",{"$f":"ROUND(E11/$G$2,4)","v":0.2014},0,0,0.25,0.5,0.25,{"$f":"SUM(F10:J10)","v":1}]
[null,null,null,"FINANCEIRO",{"$f":"ORÇAMENTO!I38","v":367525.11},{"$f":"ROUND($E$11*F10,2)","v":0},0,{"$f":"ROUND($E$11*H10,2)","v":91881.279999999999},183762.56,91881.279999999999,{"$f":"SUM(F11:J11)","v":367525.12}]
[null,"TOTAL",null,"FISICO ",{"$f":"SUM(F12:J12)","v":1},{"$f":"F13/E13","v":9.179182452689269E-2},{"$f":"G13/E13","v":0.49940960255835076},{"$f":"H13/E13","v":0.21006796864221761},{"$f":"I13/E13","v":0.12453522648120983},{"$f":"J13/E13","v":7.4195377791329148E-2},{"$f":"SUM(F12:J12)","v":1}]
[null,null,null,"FINANCEIRO",{"$f":"E7+E11+E9","v":1825219.63},{"$f":"F7+F11+F9","v":167540.24},{"$f":"G7+G11+G9","v":911532.21},383420.18,227304.14,135422.85999999999,{"$f":"SUM(F13:J13)","v":1825219.63}]
[null,"OBSERVAÇÕES:"]