{"text_format":"2","workbook":"xlsx","n_sheets":14,"sheets":["Planilha RESMO","Planilha MEDIÇÃO","FSUP","FSUP-I","FSUP-II","FSUP-III","FSUP-IV","Memória de Cálculo","BDI","Encargos Sociais","SICRO ABR-23","DNIT 23","SICRO EQUIP","DNIT EQUIP"],"not_rendered":{"charts":0,"images":3,"macros":0,"external_links":0,"defined_names":6,"comments":0,"pivot_tables":0},"unopened":[],"bounds":{"document_bytes":16777216,"sheet_cells":100000,"run_cost":"one","rows_first":2000,"rows_last":500,"rows_between":2000,"halvings":0,"cell_chars":16384,"cell_head_chars":4096},"cells_cut":0,"cells_raw":0,"read":"whole","date_system":"1900"}

{"sheet":"Planilha RESMO","index":0,"n_rows":12,"n_cols":11,"rows_kept":12,"cut":false,"hidden":false,"merged":[[3,0,3,8],[4,0,4,4],[6,6,6,7],[7,0,7,8],[11,2,11,3]]}
[null,null,"MINISTÉRIO DO DESENVOLVIMENTO REGIONAL"]
[null,null,"COMPANHIA DE DESENVOLVIMENTO DOS VALES DO SÃO FRANCISCO E PARNAÍBA"]
[null,null,"2ª SUPERINTENDÊNCIA REGIONAL - Bom Jesus da Lapa/BA"]
[{"$f":"FSUP!A8","v":"SERVIÇOS TOPOGRÁFICOS E DE APOIO À FISCALIZAÇÃO E SUPERVISÃO TÉCNICA DE INSTRUMENTOS NA ÁREA DE ABRANGÊNCIA DA CODEVASF, NO ESTADO DE PERNAMBUCO"}]
["Local: Área de abrangência da 2ª Superintendência Regional"]
[]
["BASES:",null,"SICRO-BA: JUL/2022; TC-DNIT-BA: JUL/2022; BDI-TC-DNT: AGO/2022 (Ofício-Circular n. 4499/2022)",null,null,null,"BDI (%):",null,{"$f":"0.4496","v":0.4496}]
["PLANILHA RESUMO"]
[]
[]
[null,"Item","Descrição",null,"Unidade","Quantidade","Preço Unitário","Preço Total"]
[null,1,"Serviços Topográficos e de Supervisão Técnica de Instrumentos",null,"Relatório",12,{"$f":"'Planilha MEDIÇÃO'!H40","v":410003.35},{"$f":"F12*G12","v":4920040.2},null,null,{"$f":"G12*0.5/100","v":2050.02}]

{"sheet":"Planilha MEDIÇÃO","index":1,"n_rows":40,"n_cols":16,"rows_kept":40,"cut":false,"hidden":false,"merged":[[3,0,3,8],[4,0,4,4],[6,6,6,7],[7,0,7,8],[20,1,20,2],[36,0,36,2],[36,5,36,6],[36,7,36,8],[38,0,38,6],[38,7,38,8],[39,0,39,6],[39,7,39,8]]}
[null,null,"MINISTÉRIO DA INTEGRAÇÃO E DO DESENVOLVIMENTO REGIONAL"]
[null,null,"COMPANHIA DE DESENVOLVIMENTO DOS VALES DO SÃO FRANCISCO E PARNAÍBA"]
[null,null,"3ª SUPERINTENDÊNCIA REGIONAL - Petrolina/PE"]
[{"$f":"FSUP!A8","v":"SERVIÇOS TOPOGRÁFICOS E DE APOIO À FISCALIZAÇÃO E SUPERVISÃO TÉCNICA DE INSTRUMENTOS NA ÁREA DE ABRANGÊNCIA DA CODEVASF, NO ESTADO DE PERNAMBUCO"},{"$nulls":12},"Período =",12,"meses"]
["Local: Área de abrangência da 3ª Superintendência Regional"]
[]
["BASES:",null,"SICRO-PE: JAN/2023; TC-DNIT-PE: JAN/2023; BDI-TC-DNT: AGO/2022 (Ofício-Circular n. 4499/2022)",null,null,null,"BDI (%):",null,{"$f":"0.4496","v":0.4496},"BDI - Tabela de Consultoria DNIT (ago/2022)"]
["PLANILHA ORÇAMENTÁRIA"]
["Item","Código","Banco","Descrição","Und","Quant.","Valor Unit","Valor Unit com BDI","Total"]
[1,null,null,"MÃO-DE-OBRA",{"$nulls":4},{"$f":"I11+I20","v":3674405.76}]
["1.1",null,null,"Salário da Equipe Técnica",{"$nulls":4},{"$f":"SUM(I12:I18)","v":3037027.2}]
["1.1.1","P9812","SICRO","Engenheiro","PROFISSIONAIS X MÊS",{"$f":"'FSUP-I'!I14","v":48},{"$f":"'FSUP-I'!H14","v":22943.04},{"$f":"G12*(1+$I$7)","v":33258.23},{"$f":"ROUND(H12*F12,2)","v":1596395.04}]
["1.1.2","P8147","SICRO","Técnico de obras","PROFISSIONAIS X MÊS",{"$f":"'FSUP-I'!I15","v":48},{"$f":"'FSUP-I'!H15","v":6743.43},{"$f":"G13*(1+$I$7)","v":9775.28},{"$f":"ROUND(H13*F13,2)","v":469213.44}]
["1.1.3","P9848","SICRO","Desenhista","PROFISSIONAIS X MÊS",{"$f":"'FSUP-I'!I17","v":24},{"$f":"'FSUP-I'!H17","v":6074},{"$f":"G14*(1+$I$7)","v":8804.87},{"$f":"ROUND(H14*F14,2)","v":211316.88}]
["1.1.4","P8163","SICRO","Topógrafo","PROFISSIONAIS X MÊS",{"$f":"'FSUP-I'!I18","v":24},{"$f":"'FSUP-I'!H18","v":7661.93},{"$f":"G15*(1+$I$7)","v":11106.73},{"$f":"ROUND(H15*F15,2)","v":266561.52}]
["1.1.5","P8028","SICRO","Auxiliar de Topografia","PROFISSIONAIS X MÊS",{"$f":"'FSUP-I'!I19","v":24},{"$f":"'FSUP-I'!H19","v":5167.56},{"$f":"G16*(1+$I$7)","v":7490.89},{"$f":"ROUND(H16*F16,2)","v":179781.36},{"$nulls":5},{"$f":"I10/H39","v":0.7468}]
["1.1.7","P8027","TC-DNIT","Auxiliar de Laboratorio","PROFISSIONAIS X MÊS",{"$f":"'FSUP-I'!I21","v":24},{"$f":"'FSUP-I'!H21","v":4045.74},{"$f":"G17*(1+$I$7)","v":5864.7},{"$f":"ROUND(H17*F17,2)","v":140752.8}]
["1.1.8","P8098","TC-DNIT","Laboratorista","PROFISSIONAIS X MÊS",{"$f":"'FSUP-I'!I22","v":24},{"$f":"'FSUP-I'!H22","v":4972.81},7208.59,173006.16]
[]
["1.2",null,null,"Viagens",{"$nulls":4},{"$f":"SUM(I21:I21)","v":637378.56}]
["1.2.1","Tabela Diárias da Codevasf",null,"Diárias","UND.",{"$f":"J21*O4","v":2016},{"$f":"'FSUP-II'!M13","v":218.1},{"$f":"G21*(1+$I$7)","v":316.16},{"$f":"ROUND(F21*H21,2)","v":637378.56},{"$f":"'Memória de Cálculo'!AE16","v":168},"diárias/mês x 12 meses"]
[]
[2,null,null,"MANUTENÇÃO OPERACIONAL",{"$nulls":4},{"$f":"I24+I30","v":1245632.16}]
["2.1",null,null,"Veículos",{"$nulls":4},{"$f":"SUM(I25:I28)","v":509724.96}]
["2.1.1","E9093","SICRO","Veículo leve - 53 kW (sem motorista)","UND. X MÊS",{"$f":"'FSUP-III'!K13*$O$4","v":24},{"$f":"'Memória de Cálculo'!AF33","v":2835.83},4110.82,{"$f":"ROUND(F25*H25,2)","v":98659.68}]
["2.1.2","E8891","TC-DNIT","Veículo leve picape 4x4 - 147 kW (sem motorista) ","UND. X MÊS",{"$f":"'FSUP-III'!K14*$O$4","v":12},{"$f":"'Memória de Cálculo'!AF41","v":8979.65},13016.9,{"$f":"ROUND(F26*H26,2)","v":156202.8}]
["2.1.3","E9093","SICRO","Veículo leve - 53 kW (sem motorista) ","UND. X MÊS",{"$f":"'FSUP-III'!K16*$O$4","v":24},{"$f":"'Memória de Cálculo'!AF33","v":2835.83},4110.82,98659.68]
["2.1.4","E8891","TC-DNIT","Veículo leve picape 4x4 - 147 kW (sem motorista) - disponibilizado em Irecê/BA","UND. X MÊS",{"$f":"'FSUP-III'!K17*$O$4","v":12},{"$f":"'Memória de Cálculo'!AF41","v":8979.65},13016.9,156202.8]
[]
["2.2",null,null,"Manutenção e Administração do Escritório",{"$nulls":4},{"$f":"SUM(I31:I36)","v":735907.2}]
["2.2.1","B8951","TC-DNIT","IMÓVEL COMERCIAL (2,60 do CMCC - SINAPI)","M² X MÊS",{"$f":"'FSUP-III'!G21","v":1296},{"$f":"'FSUP-III'!H21","v":46.78},{"$f":"G31*(1+$I$7)","v":67.81},{"$f":"ROUND(F31*H31,2)","v":87881.76},"6 m² x equipe mínima/mês x 12 meses"]
["2.2.2","B8953","TC-DNIT","MOBILIÁRIO - ESCRITÓRIO","FUNCIONÁRIOS X MÊS",{"$f":"'FSUP-III'!G22","v":216},{"$f":"'FSUP-III'!H22","v":510.96},740.69,159989.04]
["2.2.3","B8959","TC-DNIT","CUSTOS DIVERSOS - ESCRITÓRIO","FUNCIONÁRIOS X MÊS",{"$f":"'FSUP-III'!G23","v":216},{"$f":"'FSUP-III'!H23","v":131.32},190.36,41117.76]
["2.2.4","B8958","TC-DNIT","TOPOGRAFIA","EQUIPE X MÊS",{"$f":"'FSUP-III'!G24","v":24},{"$f":"'FSUP-III'!H24","v":3134.16},4543.28,109038.72,2,"equipes de topografia"]
["2.2.5","B8955","TC-DNIT","LABORATÓRIO DE ASFALTO","UNID. X MÊS",{"$f":"'FSUP-III'!G25","v":24},{"$f":"'FSUP-III'!H25","v":5400.53},{"$f":"G35*(1+$I$7)","v":7828.61},{"$f":"ROUND(F35*H35,2)","v":187886.64}]
["2.2.6","B8957","TC-DNIT","LABORATÓRIO DE SOLOS","UNID. X MÊS",{"$f":"'FSUP-III'!G26","v":24},{"$f":"'FSUP-III'!H26","v":4311.34},6249.72,149993.28,{"$f":"'FSUP-III'!K26","v":2},"laboratório de solos"]
[]
["2.2",null,null,"Manutenção e Administração do Escritório",{"$nulls":4},{"$f":"SUM(I39:I44)","v":0}]
["Total Geral (Período de 12 meses)",{"$nulls":6},{"$f":"I10+I23+2.25","v":4920040.17},null,null,{"$f":"FSUP!N43-H39","v":-3.87}]
["Preço Unitário por Relatório Mensal",{"$nulls":6},{"$f":"H39/O4","v":410003.35}]

{"sheet":"FSUP","index":2,"n_rows":49,"n_cols":21,"rows_kept":49,"cut":false,"hidden":false,"merged":[[4,13,4,14],[5,13,5,14],[6,0,6,12],[6,13,6,14],[7,0,7,12],[7,13,7,14],[8,0,8,14],[9,0,9,14],[10,0,10,14],[11,0,11,12],[11,13,11,14],[12,0,12,12],[12,13,12,14],[13,0,13,12],[13,13,13,14],[14,0,14,12],[14,13,14,14],[15,0,15,12],[15,13,15,14],[16,0,16,12],[16,13,16,14],[17,0,17,12],[17,13,17,14],[18,0,18,12],[18,13,18,14],[19,0,19,14],[20,0,20,14],[21,0,21,12],[21,13,21,14],[22,0,22,12],[22,13,22,14],[23,0,23,12],[23,13,23,14],[24,0,24,12],[24,13,24,14],[25,0,25,14],[26,0,26,14],[27,0,27,12],[27,13,27,14],[28,0,28,12],[28,13,28,14],[29,0,29,12],[29,13,29,14],[30,0,30,12],[30,13,30,14],[31,0,31,12],[31,13,31,14],[32,0,32,14],[33,0,33,14],[34,0,34,12],[34,13,34,14],[35,0,35,14],[36,0,36,14],[37,0,37,12],[37,13,37,14],[38,0,38,12],[38,13,38,14],[39,0,39,12],[39,13,39,14],[40,0,40,12],[40,13,40,14],[41,0,41,12],[41,13,41,14],[42,0,42,12],[42,13,42,14],[43,0,43,12],[43,13,43,14],[46,0,46,14],[48,0,48,14],[4,0,5,12]]}
[{"$nulls":7},"Ministério da Integração e do Desenvolvimento Regional - MIDR"]
[{"$nulls":7},"Companhia de Desenvolvimento dos Vales do São Francisco e do Parnaíba"]
[{"$nulls":7},"3ª Superintendência Regional da Codevasf"]
[]
["PROPOSTA FINANCEIRA APOIO A FISC. E SUP. DE OBRA",{"$nulls":12},"CODIGO:"]
[{"$nulls":13},"FSUP"]
["OBJETO:",{"$nulls":12},"EDITAL:",{"$nulls":4},"Período =",12,"meses"]
["SERVIÇOS TOPOGRÁFICOS E DE APOIO À FISCALIZAÇÃO E SUPERVISÃO TÉCNICA DE INSTRUMENTOS NA ÁREA DE ABRANGÊNCIA DA CODEVASF, NO ESTADO DE PERNAMBUCO"]
["SERVIÇOS PAGOS A PREÇO UNITÁRIO"]
[]
["MÃO-DE-OBRA"]
["A1 - TOTAL DE SALÁRIO DA EQUIPE COM VÍNCULO ( FSUP-I )",{"$nulls":12},{"$f":"'FSUP-I'!J24","v":1058609.04}]
["A2 - TOTAL DE SALÁRIO DO AUTÔNOMO ( FSUP-I )",{"$nulls":12},0]
["A - TOTAL DOS CUSTOS DE SALÁRIOS DA EQUIPE",{"$nulls":12},{"$f":"SUM(N12:O13)","v":1058609.04}]
["B1 - ENCARGOS TOTAIS DA EQUIPE TÉCNICA ( FSUP-I )",{"$nulls":12},{"$f":"'FSUP-I'!K24","v":1036470.61}]
["B - TOTAL DOS CUSTOS COM ENCARGOS",{"$nulls":12},{"$f":"SUM(N15:O15)","v":1036470.61}]
["C1 - CUSTO TOTAL DAS PASSAGENS AÉREAS E TERRESTRES ( FSUP-II )",{"$nulls":12},0]
["C2 - CUSTO TOTAL DAS DIÁRIAS ( FSUP-II )",{"$nulls":12},{"$f":"'FSUP-II'!K23","v":439689.6}]
["C - TOTAL DO CUSTO COM VIAGENS",{"$nulls":12},{"$f":"SUM(N17:O18)","v":439689.6}]
[]
["MANUTENÇÃO OPERACIONAL"]
["D1 - CUSTO DOS VEÍCULOS ( FSUP-III, ITEM 1 )",{"$nulls":12},{"$f":"'FSUP-III'!I18","v":351631.44}]
["D2 - CUSTO DA MANUTENÇÃO E ADMINISTRAÇÃO DE ESCRITÓRIO ( FSUP-III, ITEM 2 )",{"$nulls":12},{"$f":"'FSUP-III'!I27","v":507664.08}]
["D - TOTAL DOS PREÇOS COM MANUTENÇÃO OPERACIONAL",{"$nulls":12},{"$f":"SUM(N22:O23)","v":859295.52}]
["TOTAL DOS CUSTOS DIRETOS",{"$nulls":12},{"$f":"N24+N19+N16+N14","v":3394064.77}]
[]
["DESPESAS INDIRETAS",{"$nulls":18},"% sobre o PV","% sobre o CD"]
["E1 - ADMINISTRAÇÃO CENTRAL ( 10% SOBRE O CUSTO DIRETO )",{"$nulls":12},{"$f":"N25*0.1","v":339406.48},null,null,"Tabela de Preços de Consultoria DNIT",null,null,{"$f":"N28/$N$43","v":0.069},0.1]
["E2 - DESPESAS FINANCEIRAS ( 1,44% SOBRE O CUSTO DIRETO )",{"$nulls":12},{"$f":"N25*1.44/100","v":48874.53},null,null,"Tabela de Preços de Consultoria DNIT",null,null,{"$f":"N29/$N$43","v":0.0099},0.0144]
["E3 - RISCOS ( 0,72% SOBRE O CUSTO DIRETO )",{"$nulls":12},{"$f":"N25*0.72/100","v":24437.27},null,null,"Tabela de Preços de Consultoria DNIT",null,null,0.005,0.0072]
["E4 - SEGUROS E GARANTIAS CONTRATUAIS ( 0,14% SOBRE O CUSTO DIRETO )",{"$nulls":12},{"$f":"N25*0.14/100","v":4751.69},null,null,"Tabela de Preços de Consultoria DNIT",null,null,0.001,0.0014]
["TOTAL DOS CUSTOS INDIRETOS",{"$nulls":12},{"$f":"ROUND(SUM(N28:O31),2)","v":417469.97},null,null,"Tabela de Preços de Consultoria DNIT"]
[]
["BENEFÍCIOS"]
["F1 - LUCRO (12% SOBRE O CUSTO DIRETO )",{"$nulls":12},{"$f":"ROUND(N25*0.12,2)","v":407287.77},null,null,"Tabela de Preços de Consultoria DNIT",null,null,0.0828,0.12]
[]
["TRIBUTOS"]
["G1 - PIS ( 2,39% DO CUSTO DIRETO )",{"$nulls":12},{"$f":"$N$25*2.39/100","v":81118.15},null,null,"Tabela de Preços de Consultoria DNIT",null,null,0.0165,0.0239]
["G2 - COFINS ( 11,02% DO CUSTO DIRETO )",{"$nulls":12},{"$f":"$N$25*11.02/100","v":374025.94},null,null,"Tabela de Preços de Consultoria DNIT",null,null,0.076,0.1102]
["G3 - ISS ( 7,25% DO CUSTO DIRETO )",{"$nulls":12},{"$f":"$N$25*7.25/100","v":246069.7},null,null,"Tabela de Preços de Consultoria DNIT",null,null,0.05,0.0725]
["TOTAL DE TRIBUTOS",{"$nulls":12},{"$f":"ROUND(SUM(N38:O40),2)","v":701213.79}]
[]
["TOTAL DA PROPOSTA (R$)",{"$nulls":12},{"$f":"ROUND((N25+N32+N35+N41),2)","v":4920036.3}]
["R$/Relatório Mensal",{"$nulls":12},{"$f":"ROUND(N43/T7,2)","v":410003.03},null,null,{"$f":"N44*6","v":2460018.18}]
["OBSERVAÇÃO:"]
["ESTE ORÇAMENTO FOI CALCULADO COM OS SEGUINTES % MÁXIMOS DE ENCARGOS SOCIAIS E CUSTOS INDIRETOS: "]
["1. ENCARGOS SOCIAIS DA EQUIPE COM VÍNCULO = 70,91% SOBRE O SALÁRIO MENSAL"]
["2. CUSTO DE ADMINISTRAÇÃO = 10,00% SOBRE O CUSTO DIRETO CONFORME TABELA DE PREÇOS DE CONSULTORIA (BDI) A PARTIR DE 16/08/2022",{"$nulls":15},{"$f":"'FSUP-I'!L26+'FSUP-II'!K23+'FSUP-III'!I29","v":3394064.64},{"$f":"Q48*(1+44.96%)","v":4920036.1}]
["3. REMUNERAÇÃO DA EMPRESA (LUCRO) = 12,00% SOBRE O CUSTO DIRETO CONFORME TABELA DE PREÇOS DE CONSULTORIA (BDI) A PARTIR DE 16/08/2022"]

{"sheet":"FSUP-I","index":3,"n_rows":38,"n_cols":16,"rows_kept":38,"cut":false,"hidden":false,"merged":[[4,8,4,11],[5,8,5,11],[6,8,6,11],[7,0,7,7],[7,8,7,11],[8,0,8,4],[8,5,8,7],[8,9,8,11],[22,0,22,11],[23,0,23,7],[24,0,24,11],[25,0,25,7],[8,8,9,8],[4,0,5,7]]}
[null,null,null,{"$f":"FSUP!H1","v":"Ministério da Integração e do Desenvolvimento Regional - MIDR"}]
[null,null,null,{"$f":"FSUP!H2","v":"Companhia de Desenvolvimento dos Vales do São Francisco e do Parnaíba"}]
[null,null,null,{"$f":"FSUP!H3","v":"3ª Superintendência Regional da Codevasf"}]
[]
["SALÁRIOS DA EQUIPE TÉCNICA",{"$nulls":7},"CODIGO:"]
[{"$nulls":8},"FSUP-I"]
["OBJETO",{"$nulls":7},"EDITAL:"]
[{"$f":"FSUP!A8","v":"SERVIÇOS TOPOGRÁFICOS E DE APOIO À FISCALIZAÇÃO E SUPERVISÃO TÉCNICA DE INSTRUMENTOS NA ÁREA DE ABRANGÊNCIA DA CODEVASF, NO ESTADO DE PERNAMBUCO"},{"$nulls":11},"Período =",12,"meses"]
["EQUIPE TÉCNICA",{"$nulls":4},"COMPOSIÇÃO DOS SALÁRIOS POR PROFISSÃO/FUNÇÃO",null,null,"QTD","CUSTO TOTAL (R$)"]
[{"$nulls":6},"ENC."]
["ITEM","BASE","CÓDIGO","PROFISSÃO/FUNÇÃO","UND.","SALÁRIO","TOTAIS","CUSTO UN.","FUNC X MÊS","S/ ENCARGOS","DOS ENCARGOS","C/ ENCARGOS"]
[null,null,"(1)","(2)","(3)","(4)","(5)","(6)","(7)","(8)","(9)","(10)"]
[1,null,null,"PROFISSIONAIS DE NÍVEL SUPERIOR"]
["1.1","SICRO-PE","P9812",{"$f":"IF(B14=\"SICRO-PE\",VLOOKUP(C14,'SICRO ABR-23'!A:F,2,0),IF(B14=\"TC-DNIT\",VLOOKUP(C14,'DNIT 23'!A:V,2,0)))","v":"Engenheiro"},"mês",{"$f":"IF(B14=\"SICRO-PE\",VLOOKUP(C14,'SICRO ABR-23'!A:F,4,0),IF(B14=\"TC-DNIT\",VLOOKUP(C14,'DNIT 23'!A:C,4,0)))","v":12570.15},{"$f":"IF(B14=\"SICRO-PE\",VLOOKUP(C14,'SICRO ABR-23'!A:E,5,0),IF(B14=\"TC-DNIT\",VLOOKUP(C14,'DNIT 23'!A:V,23,0)))","v":0.8252},{"$f":"F14+G14*F14","v":22943.04},{"$f":"N14*$N$8","v":48},{"$f":"F14*I14","v":603367.2},{"$f":"F14*G14*I14","v":497898.61},{"$f":"H14*I14","v":1101265.92},"Engenheiros =",4]
["1.3","SICRO-PE","P9867",{"$f":"IF(B15=\"SICRO-PE\",VLOOKUP(C15,'SICRO ABR-23'!A:F,2,0),IF(B15=\"TC-DNIT\",VLOOKUP(C15,'DNIT 23'!A:V,2,0)))","v":"Técnico especializado - mensalista"},"mês",{"$f":"IF(B15=\"SICRO-PE\",VLOOKUP(C15,'SICRO ABR-23'!A:F,4,0),IF(B15=\"TC-DNIT\",VLOOKUP(C15,'DNIT 23'!A:C,4,0)))","v":3150.4},{"$f":"IF(B15=\"SICRO-PE\",VLOOKUP(C15,'SICRO ABR-23'!A:E,5,0),IF(B15=\"TC-DNIT\",VLOOKUP(C15,'DNIT 23'!A:V,23,0)))","v":1.1405},{"$f":"F15+G15*F15","v":6743.43},{"$f":"N15*$N$8","v":48},{"$f":"F15*I15","v":151219.2},{"$f":"F15*G15*I15","v":172465.5},{"$f":"H15*I15","v":323684.64},"Técnico =",4]
[2,null,null,"PROFISSIONAIS DE NÍVEL TÉCNICO"]
["2.1","SICRO-PE","P9848",{"$f":"IF(B17=\"SICRO-PE\",VLOOKUP(C17,'SICRO ABR-23'!A:F,2,0),IF(B17=\"TC-DNIT\",VLOOKUP(C17,'DNIT 23'!A:V,2,0)))","v":"Desenhista"},"mês",{"$f":"IF(B17=\"SICRO-PE\",VLOOKUP(C17,'SICRO ABR-23'!A:F,4,0),IF(B17=\"TC-DNIT\",VLOOKUP(C17,'DNIT 23'!A:C,4,0)))","v":2830.91},{"$f":"IF(B17=\"SICRO-PE\",VLOOKUP(C17,'SICRO ABR-23'!A:E,5,0),IF(B17=\"TC-DNIT\",VLOOKUP(C17,'DNIT 23'!A:V,23,0)))","v":1.1456},{"$f":"F17+G17*F17","v":6074},{"$f":"N17*$N$8","v":24},{"$f":"F17*I17","v":67941.84},{"$f":"F17*G17*I17","v":77834.17},{"$f":"H17*I17","v":145776},"Cadista =",2]
["2.2","SICRO-PE","P9949",{"$f":"IF(B18=\"SICRO-PE\",VLOOKUP(C18,'SICRO ABR-23'!A:F,2,0),IF(B18=\"TC-DNIT\",VLOOKUP(C18,'DNIT 23'!A:V,2,0)))","v":"Topógrafo"},"mês",{"$f":"IF(B18=\"SICRO-PE\",VLOOKUP(C18,'SICRO ABR-23'!A:F,4,0),IF(B18=\"TC-DNIT\",VLOOKUP(C18,'DNIT 23'!A:C,4,0)))","v":3825.8},{"$f":"IF(B18=\"SICRO-PE\",VLOOKUP(C18,'SICRO ABR-23'!A:E,5,0),IF(B18=\"TC-DNIT\",VLOOKUP(C18,'DNIT 23'!A:V,23,0)))","v":1.0027},{"$f":"F18+G18*F18","v":7661.93},{"$f":"N18*$N$8","v":24},{"$f":"F18*I18","v":91819.2},{"$f":"F18*G18*I18","v":92067.11},{"$f":"H18*I18","v":183886.32},"Topógrafo =",2,null,"p/ cada topografo 2 aux"]
["2.3","SICRO-PE","P9950",{"$f":"IF(B19=\"SICRO-PE\",VLOOKUP(C19,'SICRO ABR-23'!A:F,2,0),IF(B19=\"TC-DNIT\",VLOOKUP(C19,'DNIT 23'!A:V,2,0)))","v":"Auxiliar de topografia"},"mês",{"$f":"IF(B19=\"SICRO-PE\",VLOOKUP(C19,'SICRO ABR-23'!A:F,4,0),IF(B19=\"TC-DNIT\",VLOOKUP(C19,'DNIT 23'!A:C,4,0)))","v":2255},{"$f":"IF(B19=\"SICRO-PE\",VLOOKUP(C19,'SICRO ABR-23'!A:E,5,0),IF(B19=\"TC-DNIT\",VLOOKUP(C19,'DNIT 23'!A:V,23,0)))","v":1.2916},{"$f":"F19+G19*F19","v":5167.56},{"$f":"N19*$N$8","v":24},{"$f":"F19*I19","v":54120},{"$f":"F19*G19*I19","v":69901.39},{"$f":"H19*I19","v":124021.44},"Auxiliar Topo =",2]
[3,null,null,"PROFISSIONAIS DE NÍVEL MÉDIO"]
["3.2","TC-DNIT","P8027","Auxiliar de Laboratorio","mês",{"$f":"IF(B21=\"SICRO-PE\",VLOOKUP(C21,'SICRO ABR-23'!A:F,4,0),IF(B21=\"TC-DNIT\",VLOOKUP(C21,'DNIT 23'!A:D,4,0)))","v":1609.67},{"$f":"IF(B21=\"SICRO-PE\",VLOOKUP(C21,'SICRO ABR-23'!A:E,5,0),IF(B21=\"TC-DNIT\",VLOOKUP(C21,'DNIT 23'!A:Y,23,0)))","v":1.5134},{"$f":"F21+G21*F21","v":4045.74},{"$f":"N21*$N$8","v":24},{"$f":"F21*I21","v":38632.08},{"$f":"F21*G21*I21","v":58465.79},{"$f":"H21*I21","v":97097.76},"Aux. Laboratorista =",2]
["3.3","TC-DNIT","P8098",{"$f":"IF(B22=\"SICRO-PE\",VLOOKUP(C22,'SICRO ABR-23'!A:F,2,0),IF(B22=\"TC-DNIT\",VLOOKUP(C22,'DNIT 23'!A:V,2,0)))","v":"Laboratorista"},"mês",{"$f":"IF(B22=\"SICRO-PE\",VLOOKUP(C22,'SICRO ABR-23'!A:F,4,0),IF(B22=\"TC-DNIT\",VLOOKUP(C22,'DNIT 23'!A:D,4,0)))","v":2146.23},{"$f":"IF(B22=\"SICRO-PE\",VLOOKUP(C22,'SICRO ABR-23'!A:E,5,0),IF(B22=\"TC-DNIT\",VLOOKUP(C22,'DNIT 23'!A:Y,23,0)))","v":1.317},{"$f":"F22+G22*F22","v":4972.81},{"$f":"N22*$N$8","v":24},{"$f":"F22*I22","v":51509.52},{"$f":"F22*G22*I22","v":67838.04},{"$f":"H22*I22","v":119347.44},"Laboratorista =",2]
[]
["TOTAIS (R$)",{"$nulls":7},{"$f":"SUM(I14:I22)","v":216},{"$f":"SUM(J14:J22)","v":1058609.04},{"$f":"SUM(K14:K22)","v":1036470.61}]
[]
["TOTAL DOS SALÁRIOS DA EQUIPE TÉCNICA (R$)",{"$nulls":10},{"$f":"SUM(L14:L22)","v":2095079.52}]
["OBSERVAÇÃO:"]
["1 - CÓDIGOS REFERENTES AO SISTEMA DE CUSTOS SICRO (ABR/2022) "]
["2 - DESCRIÇÃO DO PROFISSIONAL/FUNÇÃO"]
["3 - UNIDADE DE REFERÊNCIA PARA CÁLCULO DO CUSTO"]
["4- SALÁRIO NA BASE DE DADOS REFERENCIAL"]
["5 - ENCARGOS TOTAIS (SOCIAIS, COMPLEMENTARES E ADICIONAIS) NA BASE DE DADOS REFERENCIAL"]
["6- CUSTO UNITÁRIO"]
["7 - QUANTIDADE TOTAL DE FUNCIONÁRIOS POR TIPO POR 12 MESES"]
["8 - CUSTO TOTAL DOS SALÁRIOS SEM ENCARGOS POR 12 MESES SEM DESPESAS INDIRETAS, LUCRO E TRIBUTOS"]
["9 - CUSTO TOTAL DOS ENCARGOS POR 12 MESES SEM DESPESAS INDIRETAS, LUCRO E TRIBUTOS"]
["10 - CUSTO TOTAL DOS SALÁRIOS COM ENCARGOS POR 12 MESES SEM DESPESAS INDIRETAS, LUCRO E TRIBUTOS"]
["11 - TC-DNIT = TABELA CONSULTORIA DNIT"]

{"sheet":"FSUP-II","index":4,"n_rows":33,"n_cols":14,"rows_kept":33,"cut":false,"hidden":false,"merged":[[4,9,4,10],[5,9,5,10],[6,4,6,8],[7,0,7,8],[8,5,8,8],[9,7,9,8],[20,0,20,5],[21,1,21,10],[21,12,21,13],[22,0,22,6],[22,12,22,13],[23,0,23,10],[4,0,5,8]]}
[null,null,{"$f":"FSUP!H1","v":"Ministério da Integração e do Desenvolvimento Regional - MIDR"}]
[null,null,{"$f":"FSUP!H2","v":"Companhia de Desenvolvimento dos Vales do São Francisco e do Parnaíba"}]
[null,null,{"$f":"FSUP!H3","v":"3ª Superintendência Regional da Codevasf"}]
[]
["VIAGENS DA EQUIPE TÉCNICA",{"$nulls":8},"CODIGO:"]
[{"$nulls":9},"FSUP-II",null,"Período =",12,"meses"]
["OBJETO:",{"$nulls":8},"EDITAL:"]
[{"$f":"FSUP!A8","v":"SERVIÇOS TOPOGRÁFICOS E DE APOIO À FISCALIZAÇÃO E SUPERVISÃO TÉCNICA DE INSTRUMENTOS NA ÁREA DE ABRANGÊNCIA DA CODEVASF, NO ESTADO DE PERNAMBUCO"}]
[null,null,"QTD","DIAS TRABALHADOS",null,"DIÁRIAS   (6)",null,null,null,"PERÍODO","CUSTO"]
["ITEM","PROFISSÃO/FUNÇÃO","FUNC.","EM CAMPO NO MÊS","ROTEIRO","A/T","QTD","HOSPEDAGEM + ALIMENTAÇÃO",null,"(meses)","TOTAL"]
[null,"(1)","(2)","(3)","(4)","(5)","(noites/mês)","R$/noite","TOTAL","(7)","(8)"]
[1,"EQUIPE DE TOPOGRAFIA",{"$nulls":10},"Hospedagem + Alimentação"]
["1.1","Topógrafo",{"$f":"'FSUP-I'!N18","v":2},22,"Deslocamentos da área de atuação da 3ª SR transportados nos veículos do contrato","T",{"$f":"'Memória de Cálculo'!AA13*C13","v":34},{"$f":"$M$13","v":218.1},{"$f":"G13*H13","v":7415.4},{"$f":"$M$6","v":12},{"$f":"J13*(I13)","v":88984.8},null,218.1]
["1.2","Auxiliar de Topografia",{"$f":"'FSUP-I'!N19","v":2},22,"Deslocamentos da área de atuação da 3ª SR transportados nos veículos do contrato","T",{"$f":"'Memória de Cálculo'!AA14*C14","v":34},{"$f":"$M$13","v":218.1},{"$f":"G14*H14","v":7415.4},{"$f":"$M$6","v":12},{"$f":"J14*(I14)","v":88984.8}]
[2]
["2.2","Engenheiro (Exp. Pavimentação)",2,15,"Deslocamentos da área de atuação da 3ª SR transportados nos veículos do contrato","T",{"$f":"'Memória de Cálculo'!AA10*C16","v":24},{"$f":"$M$13","v":218.1},{"$f":"G16*H16","v":5234.4},{"$f":"$M$6","v":12},{"$f":"J16*(I16)","v":62812.8}]
["2.3","Engenheiro (Orçamentista)",2,5,"Deslocamentos da área de atuação da 3ª SR transportados nos veículos do contrato","T",{"$f":"C17*'Memória de Cálculo'!AA9","v":8},{"$f":"$M$13","v":218.1},{"$f":"G17*H17","v":1744.8},{"$f":"$M$6","v":12},{"$f":"J17*(I17)","v":20937.6}]
["2.5","Técnico especializado (Estradas)",4,15,"Deslocamentos da área de atuação da 3ª SR transportados nos veículos do contrato","T",{"$f":"'Memória de Cálculo'!AA11*C18","v":48},{"$f":"$M$13","v":218.1},{"$f":"G18*H18","v":10468.8},{"$f":"$M$6","v":12},{"$f":"J18*(I18)","v":125625.6}]
["2.7","Auxiliar de Laboratorista",2,14,"Deslocamentos da área de atuação da 3ª SR transportados nos veículos do contrato","T",{"$f":"'Memória de Cálculo'!AA17*C19","v":10},{"$f":"$M$13","v":218.1},{"$f":"G19*H19","v":2181},{"$f":"$M$6","v":12},{"$f":"J19*(I19)","v":26172}]
["2.9","Laboratorista",{"$f":"'FSUP-I'!N22","v":2},14,"Deslocamentos da área de atuação da 3ª SR transportados nos veículos do contrato","T",{"$f":"'Memória de Cálculo'!AA18*C20","v":10},{"$f":"$M$13","v":218.1},{"$f":"G20*H20","v":2181},{"$f":"$M$6","v":12},{"$f":"J20*(I20)","v":26172}]
["TOTAIS",{"$nulls":5},{"$f":"SUM(G13:G20)","v":168},{"$f":"G21*$M$13","v":36640.8},{"$f":"SUM(I13:I20)","v":36640.8}]
[{"$nulls":12},"Custo com BDI"]
["TOTAIS DE CUSTOS E DE PREÇOS DE PASSAGENS E DIÁRIAS (R$)",{"$nulls":7},{"$f":"SUM(I12:I20)","v":36640.8},null,{"$f":"SUM(K13:K20)","v":439689.6},null,{"$f":"K23*1.4496","v":637374.04}]
["OBSERVAÇÃO:"]
["1 - RELAÇÃO DE PROFISSIONAIS"]
["2 - QUANTIDADE DE FUNCIONÁRIOS POR TIPO DE PROFISSIONAL"]
["3 - DIAS ÚTEIS DEDICADOS A TRABALHOS FORA DO ESCRITÓRIO (EM CAMPO)"]
["4 - DESCRIÇÃO DOS ROTEIROS DE VIAGEM ESPERADOS",{"$nulls":5},{"$f":"G21*12","v":2016}]
["5 - INDICAR (A) PARA AS PASSAGENS AÉREAS E (T) PARA AS TERRESTRES",{"$nulls":5},{"$f":"G28*H20","v":439689.6}]
["6 - DESCRIÇÃO DAS DIÁRIAS E O CUSTO POR TIPO (ALIMENTAÇÃO E HOSPEDAGEM)",{"$nulls":5},{"$f":"G29*(1+44.96%)","v":637374.04},null,null,{"$f":"J16+J17+J18+J19+J20+J13+J14","v":84}]
["7 - PERÍODO ESTIMADO DE VIGÊNCIA DO CONTRATO"]
["8 - CUSTO TOTAL POR 12 MESES SEM DESPESAS INDIRETAS, LUCRO E TRIBUTOS"]
["9 - O CUSTO DAS DIÁRIAS DE ALIMENTAÇÃO E HOSPEDAGEM SE BASEIA NA TABELA DE DIÁRIAS DA CODEVASF"]

{"sheet":"FSUP-III","index":5,"n_rows":36,"n_cols":14,"rows_kept":36,"cut":false,"hidden":false,"merged":[[4,1,4,7],[7,1,7,4],[17,1,17,7],[26,1,26,7],[28,1,28,7],[30,1,30,8],[31,1,31,8],[32,1,32,8],[33,1,33,8],[34,1,34,8],[35,1,35,8]]}
[{"$nulls":4},{"$f":"FSUP!H1","v":"Ministério da Integração e do Desenvolvimento Regional - MIDR"}]
[{"$nulls":4},{"$f":"FSUP!H2","v":"Companhia de Desenvolvimento dos Vales do São Francisco e do Parnaíba"}]
[{"$nulls":4},{"$f":"FSUP!H3","v":"3ª Superintendência Regional da Codevasf"}]
[]
[null,"DESPESAS OPERACIONAIS",{"$nulls":6},"CODIGO:"]
[{"$nulls":8},"FSUP-III"]
[null,"PROJETO:",null,null,null,"REFERÊNCIA",null,null,"EDITAL:"]
[null,{"$f":"FSUP!A8","v":"SERVIÇOS TOPOGRÁFICOS E DE APOIO À FISCALIZAÇÃO E SUPERVISÃO TÉCNICA DE INSTRUMENTOS NA ÁREA DE ABRANGÊNCIA DA CODEVASF, NO ESTADO DE PERNAMBUCO"},null,null,null,"Relatório de Custos Gerais e BDI DNIT - Ago/2022"]
[null,"ITEM","BASE","CÓDIGO","DESCRIÇÃO","UNID.","QUANT.","CUSTOS (R$)   (3)"]
[{"$nulls":7},"UNITÁRIO","TOTAL"]
[null,"1.",null,null,"VEÍCULOS (1)",{"$nulls":4},"Período =",12,"meses"]
[null,"1.1",null,null,"Área de atuação da Codevasf/PE"]
[null,"1.1.1","TC-DNIT","E8889","Veículo leve - 53 kW (sem motorista)","UND X MÊS",{"$f":"K13*$K$11","v":24},{"$f":"'Memória de Cálculo'!AF33","v":2835.83},{"$f":"ROUND(H13*G13,2)","v":68059.92},"Veículo =",2,null,null,{"$f":"8*20*12","v":1920}]
[null,"1.1.2","TC-DNIT","E8891","Veículo leve picape 4x4 - 147 kW (sem motorista)","UND X MÊS",{"$f":"K14*$K$11","v":12},{"$f":"'Memória de Cálculo'!AF41","v":8979.65},107755.8,"Veículo =",1,null,null,{"$f":"8*22*12","v":2112}]
[null,"1.2",null,null,"Área de atuação da 3ª SR"]
[null,"1.2.1","TC-DNIT","E8889","Veículo leve - 53 kW (sem motorista)","UND X MÊS",{"$f":"K16*$K$11","v":24},{"$f":"'Memória de Cálculo'!AF33","v":2835.83},68059.92,"Veículo =",2,null,null,{"$f":"8*15*12","v":1440}]
[null,"1.2.1","TC-DNIT","E8891","Veículo leve picape 4x4 - 147 kW (sem motorista)","UND X MÊS",{"$f":"K17*$K$11","v":12},{"$f":"'Memória de Cálculo'!AF41","v":8979.65},107755.8,"Veículo =",1]
[null,"TOTAL DOS CUSTOS DOS VEÍCULOS (R$)",{"$nulls":6},{"$f":"SUM(I13:I17)","v":351631.44}]
[]
[null,"2.",null,null,"MANUTENÇÃO E ADMINISTRAÇÃO DE ESCRITÓRIO (2)"]
[null,"2.1","TC-DNIT","B8951","IMÓVEL COMERCIAL (2,60 do CMCC - SINAPI)","M² X MÊS",{"$f":"6*K21*$K$11","v":1296},{"$f":"IF(C21=\"SICRO-PE\",VLOOKUP(D21,'SICRO EQUIP'!A:J,10,0),IF(C21=\"TC-DNIT\",VLOOKUP(D21,'DNIT EQUIP'!B:F,5,0)))","v":46.78},{"$f":"ROUND(G21*H21,2)","v":60626.88},"Equipe mínima =",{"$f":"SUM('Memória de Cálculo'!AE8:AE15)","v":18}]
[null,"2.2","TC-DNIT","B8953","MOBILIÁRIO - ESCRITÓRIO","FUNCIONÁRIOS X MÊS",{"$f":"'FSUP-I'!I24","v":216},{"$f":"IF(C22=\"SICRO-PE\",VLOOKUP(D22,'SICRO EQUIP'!A:J,10,0),IF(C22=\"TC-DNIT\",VLOOKUP(D22,'DNIT EQUIP'!B:F,5,0)))","v":510.96},{"$f":"ROUND(G22*H22,2)","v":110367.36}]
[null,"2.3","TC-DNIT","B8959","CUSTOS DIVERSOS - ESCRITÓRIO","FUNCIONÁRIOS X MÊS",{"$f":"'FSUP-I'!I24","v":216},{"$f":"IF(C23=\"SICRO-PE\",VLOOKUP(D23,'SICRO EQUIP'!A:J,10,0),IF(C23=\"TC-DNIT\",VLOOKUP(D23,'DNIT EQUIP'!B:F,5,0)))","v":131.32},28365.12]
[null,"2.4","TC-DNIT","B8958","TOPOGRAFIA","EQUIPE X MÊS",{"$f":"K24*$K$11","v":24},{"$f":"IF(C24=\"SICRO-PE\",VLOOKUP(D24,'SICRO EQUIP'!A:J,10,0),IF(C24=\"TC-DNIT\",VLOOKUP(D24,'DNIT EQUIP'!B:F,5,0)))","v":3134.16},75219.84,"Equipes de topografia =",2]
[null,"2.5","TC-DNIT","B8955","LABORATÓRIO DE ASFALTO","UNIDADE X MÊS",{"$f":"K25*$K$11","v":24},{"$f":"IF(C25=\"SICRO-PE\",VLOOKUP(D25,'SICRO EQUIP'!A:J,10,0),IF(C25=\"TC-DNIT\",VLOOKUP(D25,'DNIT EQUIP'!B:F,5,0)))","v":5400.53},129612.72,"Laboratório de Asfalto =",2]
[null,"2.6","TC-DNIT","B8957","LABORATÓRIO DE SOLOS","UNIDADE X MÊS",{"$f":"K26*K11","v":24},{"$f":"IF(C26=\"SICRO-PE\",VLOOKUP(D26,'SICRO EQUIP'!A:J,10,0),IF(C26=\"TC-DNIT\",VLOOKUP(D26,'DNIT EQUIP'!B:F,5,0)))","v":4311.34},103472.16,"Laboratório de Solos =",2]
[null,"TOTAL DOS CUSTOS DE MANUTENÇÃO E ADMINISTRAÇÃO DE ESCRITÓRIO (R$)",{"$nulls":6},{"$f":"SUM(I21:I26)","v":507664.08}]
[]
[null,"TOTAL DAS DESPESAS OPERACIONAIS (R$)",{"$nulls":6},{"$f":"I27+I18","v":859295.52}]
[null,"OBSERVAÇÃO:"]
[null,"1. O CUSTO HORÁRIO DOS VEÍCULOS INCLUI DESPESAS COM MANUTENÇÃO E COMBUSTÍVEL, CONFORME A COMPOSIÇÃO DE CUSTO DA TABELA DE CONSUTORIA DO DNIT"]
[null,"2. VER DESCRIÇÃO DOS ITENS ABAIXO NA TABELA DE CONSULTORIA DO DNIT - CESTAS DE MOBILIÁRIO, DE INSTALAÇÕES E CUSTOS DIVERSOS"]
[null,"3. CUSTO DO ITEM SEM LUCRO E DESPESAS FISCAIS"]
[null,"3. CUSTO TOTAL POR 12 MESES SEM DESPESAS INDIRETAS, LUCRO E TRIBUTOS"]
[null,"4. OS ITENS RELATIVOS AO MOBILIÁRIO E AOS CUSTOS DIVERSOS DO ESCRITÓRIO SERVIRÃO PARA COBRIR AS DESPESAS COM OS PROFISSIONAIS DISPONIBILIZADOS AO ESCRITÓRIO DE APOIO TÉCNICO DE IRECÊ E A UNIDADE DESCENTRALIZADA DE VITÓRIA DA CONQUISTA."]
[null,"5. NÃO SERÁ EXIGIDO ENTREGA DE DOCUMENTOS IMPRESSOS. A VERSÃO DIGITAL SERÁ ACEITA PARA MEDIÇÃO DOS SERVIÇOS, CONFORME CRITÉRIOS ESTABELECIDOS EM EDITAL"]

{"sheet":"FSUP-IV","index":6,"n_rows":26,"n_cols":8,"rows_kept":26,"cut":false,"hidden":false,"merged":[[6,0,6,5],[7,0,7,5],[8,2,8,4],[8,6,8,7],[21,0,21,5],[4,0,5,6]]}
[null,null,{"$f":"FSUP!H1","v":"Ministério da Integração e do Desenvolvimento Regional - MIDR"}]
[null,null,{"$f":"FSUP!H2","v":"Companhia de Desenvolvimento dos Vales do São Francisco e do Parnaíba"}]
[null,null,{"$f":"FSUP!H3","v":"3ª Superintendência Regional da Codevasf"}]
[]
["CRONOGRAMA FINANCEIRO",{"$nulls":6},"CODIGO:"]
[{"$nulls":7},"FSUP-IV"]
["OBJETO:",{"$nulls":6},"EDITAL:"]
[{"$f":"FSUP!A8","v":"SERVIÇOS TOPOGRÁFICOS E DE APOIO À FISCALIZAÇÃO E SUPERVISÃO TÉCNICA DE INSTRUMENTOS NA ÁREA DE ABRANGÊNCIA DA CODEVASF, NO ESTADO DE PERNAMBUCO"}]
["Nº","TAREFA","RELATÓRIO / SERVIÇO DE CAMPO",null,null,"MESES\nCORRIDOS","VALOR DA PARCELA (R$)"]
[1,"APOIO À FISCALIZAÇÃO E SUPERVISÃO TÉCNICA DE OBRAS","RELATÓRIO MENSAL 01",null,null,30,{"$f":"FSUP!#REF!*(1+0.1)*(1+0.1662)","v":{"$error":"#REF!"}},{"$f":"FSUP!$N$44","v":410003.03}]
[2,"APOIO À FISCALIZAÇÃO E SUPERVISÃO TÉCNICA DE OBRAS","RELATÓRIO MENSAL 02",null,null,{"$f":"F10+30","v":60},{"$f":"(FSUP!#REF!-FSUP!#REF!*(1+0.1)*(1+0.1662))*8/100","v":{"$error":"#REF!"}},{"$f":"FSUP!$N$44","v":410003.03}]
[3,"APOIO À FISCALIZAÇÃO E SUPERVISÃO TÉCNICA DE OBRAS","RELATÓRIO MENSAL 03",null,null,{"$f":"F11+30","v":90},{"$f":"(FSUP!#REF!-FSUP!#REF!*(1+0.1)*(1+0.1662))*5/100","v":{"$error":"#REF!"}},{"$f":"FSUP!$N$44","v":410003.03}]
[4,"APOIO À FISCALIZAÇÃO E SUPERVISÃO TÉCNICA DE OBRAS","RELATÓRIO MENSAL 04",null,null,{"$f":"F12+30","v":120},{"$f":"(FSUP!#REF!-FSUP!#REF!*(1+0.1)*(1+0.1662))*7.5/100","v":{"$error":"#REF!"}},{"$f":"FSUP!$N$44","v":410003.03}]
[5,"APOIO À FISCALIZAÇÃO E SUPERVISÃO TÉCNICA DE OBRAS","RELATÓRIO MENSAL 05",null,null,{"$f":"F13+30","v":150},{"$f":"(FSUP!#REF!-FSUP!#REF!*(1+0.1)*(1+0.1662))*7.5/100","v":{"$error":"#REF!"}},{"$f":"FSUP!$N$44","v":410003.03}]
[6,"APOIO À FISCALIZAÇÃO E SUPERVISÃO TÉCNICA DE OBRAS","RELATÓRIO MENSAL 06",null,null,{"$f":"F14+30","v":180},{"$f":"(FSUP!#REF!-FSUP!#REF!*(1+0.1)*(1+0.1662))*9/100","v":{"$error":"#REF!"}},{"$f":"FSUP!$N$44","v":410003.03}]
[7,"APOIO À FISCALIZAÇÃO E SUPERVISÃO TÉCNICA DE OBRAS","RELATÓRIO MENSAL 07",null,null,210,{"$f":"(FSUP!#REF!-FSUP!#REF!*(1+0.1)*(1+0.1662))*9/100","v":{"$error":"#REF!"}},{"$f":"FSUP!$N$44","v":410003.03}]
[8,"APOIO À FISCALIZAÇÃO E SUPERVISÃO TÉCNICA DE OBRAS","RELATÓRIO MENSAL 08",null,null,240,{"$f":"(FSUP!#REF!-FSUP!#REF!*(1+0.1)*(1+0.1662))*9/100","v":{"$error":"#REF!"}},{"$f":"FSUP!$N$44","v":410003.03}]
[9,"APOIO À FISCALIZAÇÃO E SUPERVISÃO TÉCNICA DE OBRAS","RELATÓRIO MENSAL 09",null,null,270,{"$f":"(FSUP!#REF!-FSUP!#REF!*(1+0.1)*(1+0.1662))*9/100","v":{"$error":"#REF!"}},{"$f":"FSUP!$N$44","v":410003.03}]
[10,"APOIO À FISCALIZAÇÃO E SUPERVISÃO TÉCNICA DE OBRAS","RELATÓRIO MENSAL 10",null,null,300,{"$f":"(FSUP!#REF!-FSUP!#REF!*(1+0.1)*(1+0.1662))*9/100","v":{"$error":"#REF!"}},{"$f":"FSUP!$N$44","v":410003.03}]
[11,"APOIO À FISCALIZAÇÃO E SUPERVISÃO TÉCNICA DE OBRAS","RELATÓRIO MENSAL 11",null,null,330,{"$f":"(FSUP!#REF!-FSUP!#REF!*(1+0.1)*(1+0.1662))*9/100","v":{"$error":"#REF!"}},{"$f":"FSUP!$N$44","v":410003.03}]
[12,"APOIO À FISCALIZAÇÃO E SUPERVISÃO TÉCNICA DE OBRAS","RELATÓRIO MENSAL 12",null,null,360,null,{"$f":"FSUP!$N$44","v":410003.03}]
["TOTAL",{"$nulls":5},{"$f":"SUM(G10:G21)","v":{"$error":"#REF!"}},{"$f":"SUM(H10:H21)","v":4920036.36}]
["OBSERVAÇÃO: O relatório Mensal é mero instrumento de registro das atividades desenvolvidas pela(s) equipe(s) de supervisão e os valores"]
["aqui dispostos são meras estimativas de desembolso, cabendo ao Fiscal da Supervisora coordenar e medir os serviços efetivamentes prestados"]
["na supervisão das atividades da(s) Executora(s) previstos no tópico 5 do Anexo III da  IS DG DNIT 3/2016 comprovados mediante relatórios, "]
["pareceres e laudos correspondentes."]

{"sheet":"Memória de Cálculo","index":7,"n_rows":44,"n_cols":33,"rows_kept":44,"cut":false,"hidden":false,"merged":[[4,2,4,23],[5,2,5,6],[5,7,5,11],[5,12,5,16],[5,17,5,21],[5,22,5,23],[27,28,27,31],[35,28,35,31],[43,28,43,31],[4,0,6,0],[4,1,6,1],[4,26,5,26],[7,28,14,28],[15,28,16,28],[17,28,21,28],[22,28,24,28],[4,24,5,25],[4,28,5,31]]}
[null,"MINISTÉRIO DA INTEGRAÇÃO E DO DESENVOLVIMENTO REGIONAL",{"$nulls":27},"MINISTÉRIO DO DESENVOLVIMENTO REGIONAL"]
[null,"COMPANHIA DE DESENVOLVIMENTO DOS VALES DO SÃO FRANCISCO E PARNAÍBA",{"$nulls":27},"COMPANHIA DE DESENVOLVIMENTO DOS VALES DO SÃO FRANCISCO E PARNAÍBA"]
[null,"3ª SUPERINTENDÊNCIA REGIONAL - Petrolina/PE",{"$nulls":27},"3ª SUPERINTENDÊNCIA REGIONAL - Petrolina/PE"]
[]
["Item","Profissional","Mês de Referência - Dias úteis",{"$nulls":21},"DIAS TRABALHADOS EM",null,"PERNOITES",null,"Memória de cálculo mensal (22 DIAS ÚTEIS)"]
[null,null,"Semana 1",{"$nulls":4},"Semana 2",{"$nulls":4},"Semana 3",{"$nulls":4},"Semana 4",{"$nulls":4},"Início da Semana 5"]
[null,null,1,2,3,4,5,6,7,8,9,10,11,12,13,14,15,16,17,18,19,20,21,22,"Escritório","Campo","Campo",null,"Itens","Descrição","Quantidade","Unidade"]
[1,"ÁREA DE ATUAÇÃO DA 3ª SR",{"$nulls":26},"Equipe","Engenheiro",{"$f":"'FSUP-I'!N14","v":4},"un."]
["1.1","Engenheiro (Orçamentista)","Visitas Técnicas",{"$nulls":21},{"$f":"22-Z9","v":17},5,4,null,null,"Técnico especializado",{"$f":"'FSUP-I'!N15","v":4},"un."]
["1.2","Engenheiro",{"$nulls":5},"Fiscalização/Supervisão Técnica",{"$nulls":11},"Medição",{"$nulls":4},7,15,{"$f":"4*3","v":12},null,null,"Desenhista/Cadista",{"$f":"'FSUP-I'!N17","v":2},"un."]
["1.3","Técnico especializado",{"$nulls":5},"Fiscalização/Supervisão Técnica",{"$nulls":11},"Medição",{"$nulls":4},{"$f":"22-Z11","v":7},15,{"$f":"4*3","v":12},null,null,"Topógrafo",{"$f":"'FSUP-I'!N18","v":2},"un."]
["1.4","Desenhista/Cadista",{"$nulls":22},{"$f":"22-Z12","v":22},0,0,null,null,"Auxiliar de Topografia",{"$f":"'FSUP-I'!N19","v":2},"un."]
["1.5","Topógrafo","Serviços topográficos",{"$nulls":16},"Medição",{"$nulls":4},0,22,{"$f":"4*4+1","v":17},null,null,"Motorista",0,"un."]
["1.6","Auxiliar de Topografia","Serviços topográficos",{"$nulls":16},"Medição",{"$nulls":4},0,22,{"$f":"4*4+1","v":17},null,null,"Auxiliar de Laboratorista",2,"un."]
["1.7","Motorista","Acompanhar equipe de topografia",{"$nulls":21},0,22,{"$f":"4*4+1","v":17},null,null,"Laboratorista",{"$f":"'FSUP-I'!N22","v":2},"un."]
["1.8","Auxiliar Administrativo",{"$nulls":22},22,0,0,null,"Viagens","Diárias",{"$f":"'FSUP-II'!G21","v":168},"un."]
[null,"Auxiliar de Laboratorista","Amostragem",{"$nulls":4},"Amostragem",{"$nulls":4},"Amostragem",{"$nulls":4},"Amostragem",{"$nulls":4},"Amostragem",null,8,{"$f":"22-Y17","v":14},5]
["1.9","Laboratorista","Amostragem",{"$nulls":4},"Amostragem",{"$nulls":4},"Amostragem",{"$nulls":4},"Amostragem",{"$nulls":4},"Amostragem",null,8,{"$f":"22-Y18","v":14},5,null,"Equipamentos","Veículo leve",{"$f":"'FSUP-III'!K13+'FSUP-III'!K16","v":4},"un."]
["LEGENDA:",{"$nulls":28},"Veículo leve pick-up",{"$f":"'FSUP-III'!K14+'FSUP-III'!K17","v":2},"un."]
[null,"Trabalho em escritório",{"$nulls":27},"Cesta de Instalações de Topografia",{"$f":"'FSUP-III'!K24","v":2},"un."]
[null,"Trabalho em campo",{"$nulls":27},"Laboratório de asfalto",{"$f":"'FSUP-III'!K26","v":2},"un."]
[{"$nulls":29},"Laboratório de Solos",{"$f":"'FSUP-III'!K26","v":2},"un."]
[{"$nulls":28},"Instalações","Mobiliário",2,"un."]
[{"$nulls":29},"Cesta de Custos de Escritório",2,"un."]
[{"$nulls":29},"Escritório",2,"un."]
[]
[]
[{"$nulls":28},"CUSTO MENSAL DE E8889 VEÍCULO LEVE -  53 kW (sem motorista)"]
[]
[{"$nulls":29},"h","R$/h","Total"]
[{"$nulls":28},"Horas Operativas",66,{"$f":"'DNIT EQUIP'!E6","v":31.83},{"$f":"AD31*AE31","v":2100.78},{"$f":"AD31/$AD$33","v":0.36}]
[{"$nulls":28},"Horas Improdutivas",116.49,{"$f":"'DNIT EQUIP'!F6","v":6.31},{"$f":"AD32*AE32","v":735.05},{"$f":"AD32/$AD$33","v":0.64}]
[{"$nulls":28},"Horas globais/mês trabalháveis (*)",{"$f":"AD31+AD32","v":182.49},null,{"$f":"ROUND(AF31+AF32,2)","v":2835.83}]
[]
[]
[{"$nulls":28},"CUSTO MENSAL DE E8891 VEÍCULO LEVE picape 4x4 - 147 kW (sem motorista)"]
[]
[{"$nulls":29},"h","R$/h","Total"]
[{"$nulls":28},"Horas Operativas",66,{"$f":"'DNIT EQUIP'!E7","v":86.6},{"$f":"AD39*AE39","v":5715.6},{"$f":"AD39/$AD$33","v":0.36}]
[{"$nulls":28},"Horas Improdutivas",116.49,{"$f":"'DNIT EQUIP'!F7","v":28.02},{"$f":"AD40*AE40","v":3264.05},{"$f":"AD40/$AD$33","v":0.64}]
[{"$nulls":28},"Horas globais/mês trabalháveis (*)",{"$f":"AD39+AD40","v":182.49},null,{"$f":"ROUND(AF39+AF40,2)","v":8979.65}]
[]
[]
[{"$nulls":28},"(*) Fonte: Manual de Custos de Infraestrutura de Transportes - Volume 01, pág. 53"]

{"sheet":"BDI","index":8,"n_rows":26,"n_cols":4,"rows_kept":26,"cut":false,"hidden":false,"merged":[[3,0,3,4],[4,0,4,4],[5,1,5,4],[6,1,6,4],[7,0,7,4],[10,1,10,3],[11,1,11,3]]}
[null,"MINISTÉRIO DA INTEGRAÇÃO E DO DESENVOLVIMENTO REGIONAL"]
[null,"COMPANHIA DE DESENVOLVIMENTO DOS VALES DO SÃO FRANCISCO E PARNAÍBA"]
[null,"3ª SUPERINTENDÊNCIA REGIONAL - Petrolina/PE"]
["PLANILHA DE DETALHAMENTO DO BDI "]
[]
["OBJETO:",{"$f":"FSUP!A8","v":"SERVIÇOS TOPOGRÁFICOS E DE APOIO À FISCALIZAÇÃO E SUPERVISÃO TÉCNICA DE INSTRUMENTOS NA ÁREA DE ABRANGÊNCIA DA CODEVASF, NO ESTADO DE PERNAMBUCO"}]
[]
["MEMÓRIA DE CALCULO DO BDI  DOS SERVIÇOS - NÃO DESONERADO"]
[]
[]
[null,"TABELA DE PREÇOS DE CONSULTORIA (desde 16/08/2022)"]
[null,"Benefícios e Despesas Indiretas"]
[null,"Despesas Indiretas","% sobre PV","% sobre CD"]
[]
[null,"Administração Central",6.9,10]
[null,"Despesas Financeiras",0.99,1.44]
[null,"Riscos",0.5,0.72]
[null,"Seguros e Garantias Contratuais",0.1,0.14]
[]
[null,"Lucro",8.28,12]
[]
[null,"PIS",1.65,2.39]
[null,"COFINS",7.6,11.02]
[null,"ISSQN",5,7.25]
[]
[null,"FATOR K (ou, \"BDI\", CONFORME TC-DNIT)",{"$f":"SUM(C15:C24)","v":31.02},{"$f":"SUM(D15:D24)","v":44.96}]

{"sheet":"Encargos Sociais","index":9,"n_rows":43,"n_cols":9,"rows_kept":43,"cut":false,"hidden":false,"merged":[[1,1,1,8],[2,1,2,8],[3,1,3,8],[5,0,5,8],[7,2,7,8],[8,0,8,1],[9,0,9,8],[19,0,19,8],[30,0,30,8],[37,0,37,8],[42,0,42,1]]}
[]
[null,"MINISTÉRIO DA INTEGRAÇÃO E DO DESENVOLVIMENTO REGIONAL"]
[null,"COMPANHIA DE DESENVOLVIMENTO DOS VALES DO SÃO FRANCISCO E PARNAÍBA"]
[null,"3ªSUPERINTENDÊNCIA REGIONAL - Petrolina/PE"]
[]
["DETALHAMENTO DOS ENCARGOS SOCIAIS (%) - sem desoneração"]
[]
[null,null,"SEM DESONERAÇÃO - MENSALISTA"]
[null,null,"Auxiliar Administrativo (P9806)","Auxiliar de topografia (P9950)","Engenheiro (P9812)","Engenheiro supervisor (P9819)","Técnico especializado (P9867)","Topógrafo (P9949)","Motorista de veículo leve (P9948)"]
["GRUPO A"]
["A1","Previdência Social",20,20,20,20,20,20,20]
["A2","FGTS",8,8,8,8,8,8,8]
["A3","Salário Educação",2.5,2.5,2.5,2.5,2.5,2.5,2.5]
["A4","SESI",1.5,1.5,1.5,1.5,1.5,1.5,1.5]
["A5","SENAI/SEBRAE",1.6,1.6,1.6,1.6,1.6,1.6,1.6]
["A6","INCRA",0.2,0.2,0.2,0.2,0.2,0.2,0.2]
["A7","Seguro contra Risco e Acidente de Trabalho (INSS)",3,3,3,3,3,3,3]
["A8","Seconci","-",0.11,0.11,0.11,0.11,0.11,0.11]
["A","Total",{"$f":"ROUND(SUM(C11:C18),2)","v":36.8},36.91,36.91,36.91,36.91,36.91,36.91]
["GRUPO B"]
["B1","Repouso Semanal Remunerado",0,0,0,0,0,0,0]
["B2","Feriados",0,0,0,0,0,0,0]
["B3","Auxílio-enfermidade",5.87,5.7,8.33,8.33,7.07,5.7,7.2]
["B4","13° salário",0.9,0.91,0.91,0.91,0.91,0.91,0.91]
["B5","Licença-paternidade",0.04,0.04,0.01,0.04,0.04,0.04,0.04]
["B6","Faltas Justificadas",0.06,0.1,0.08,0.08,0.08,0.1,0.09]
["B7","Auxílio Acidente de Trabalho",9.25,9.24,9.24,9.24,9.24,9.24,9.24]
["B8","Férias Gozadas",0.74,0.74,0.74,0.74,0.74,0.74,0.74]
["B9","Férias em Licença Maternidade",0.12,0,0.04,0.04,0.07,0,0]
["B","Total ",{"$f":"ROUND(SUM(C21:C29),2)","v":16.98},16.73,19.35,19.38,18.15,16.73,18.22]
["GRUPO C"]
["C1","Aviso Prévio Indenizado",4.32,4.43,3.16,3.16,3.84,4.43,3.74]
["C2","Aviso Prévio Trabalhado",0.12,0.12,0.07,0.07,0.1,0.12,0.09]
["C3","Férias Indenizadas+1/3",6.45,6.62,3.99,3.99,5.26,6.62,5.12]
["C4","Depósito Rescisão Sem Justa Causa",3.74,3.74,3.82,3.82,3.78,3.74,3.78]
["C5","Indenização Adicional (Lei nº 7.238/1984)",0.93,0.93,0.93,0.93,0.93,0.93,0.93]
["C","Total ",{"$f":"ROUND(SUM(C32:C36),2)","v":15.56},15.84,11.97,11.97,13.91,15.84,13.66]
["GRUPO D"]
["D1","Reincidência de A sobre B",6.25,6.17,7.15,7.15,6.7,6.17,6.72]
["D2","Reincidência de Grupo A sobre Aviso Prévio Trabalhado e Reincidência do FGTS sobre Aviso Prévio Indenizado",0.39,0.4,0.28,0.28,0.34,0.4,0.33]
[]
["D","Total",{"$f":"ROUND(SUM(C39:C40),2)","v":6.64},{"$f":"ROUND(SUM(D39:D40),2)","v":6.57},7.43,7.43,7.04,6.57,7.05]
["T O T A L (%)",null,{"$f":"ROUND(C42+C37+C30+C19,2)","v":75.98},76.05,75.66,75.69,76.01,76.05,75.84]

{"sheet":"SICRO ABR-23","index":10,"n_rows":118,"n_cols":8,"rows_kept":118,"cut":false,"hidden":false,"merged":[[2,0,2,6],[3,0,3,6],[0,0,1,0],[0,6,1,6],[0,1,1,5]]}
["CGCIT","SISTEMA DE CUSTOS REFERENCIAIS DE OBRAS - SICRO",{"$nulls":4},"DNIT"]
[]
["Pernambuco - Abril/2023"]
["Sem desoneração"]
["Código","Descrição","Unidade","Salário (R$)","Encargos Totais","Custo (R$)","Periculosidade/\nInsalubridade"]
["P9801","Ajudante","h",6.8879,2.067394,21.1279,0]
["P9802","Ajudante especializado","h",8.2142,2.017127,24.7832,0]
["P9803","Almoxarife","mês",2582.8,1.220953,5736.2774,0]
["P9804","Apontador","mês",1953.6,1.37631,4642.3592,0]
["P9805","Armador","h",10.25,1.75223,28.2103,0]
["P9806","Auxiliar administrativo","mês",1953.6,1.37159,4633.1382,0]
["P9807","Bombeiro hidráulico","h",10.772,1.805628,30.2222,0]
["P9808","Carpinteiro","h",8.88,1.854801,25.3506,0]
["P9809","Encarregado administrativo","mês",3814.417,0.972263,7523.0335,0]
["P9810","Eletricista","h",10.2874,1.813187,28.9403,0]
["P9811","Encarregado especializado","mês",3572.7672,1.014049,7195.7282,0]
["P9812","Engenheiro","mês",12570.149,0.82518,22942.7845,0]
["P9814","Operacional","mês",1432.3199,1.506466,3590.0611,0]
["P9815","Jardineiro","h",7.75,1.969929,23.0169,0]
["P9819","Engenheiro supervisor","mês",12570.149,0.82518,22942.7845,0]
["P9821","Pedreiro","h",8.88,1.852876,25.3335,0]
["P9822","Pintor","h",10.25,1.764677,28.3379,0]
["P9823","Serralheiro","h",9.3101,1.824692,26.2981,0]
["P9824","Servente","h",6.7,2.09222,20.7178,0]
["P9825","Soldador","h",12.2767,1.653255,32.5732,0]
["P9826","Chefe setor de finanças","mês",7889.6392,0.874471,14788.8998,0]
["P9827","Vigia","mês",1391.4995,1.843341,4373.9574,0.3]
["P9830","Montador","h",10.2723,1.838015,29.1529,0,"A"]
["P9833","Auxiliar de laboratório","mês",2255,1.281238,5144.1916,0]
["P9836","Geólogo","h",53.0587,1.188601,116.1243,0]
["P9837","Oceanógrafo","mês",4408.8627,0.999965,8817.571,0]
["P9840","Encarregado geral","mês",5248.407,0.93096,10134.4639,0]
["P9842","Faxineiro","mês",1377.2,1.636689,3631.248,0]
["P9843","Operador de equipamento leve","h",8.88,1.833131,25.1582,0]
["P9844","Capitão fluvial","mês",5937.7022,0.934517,11486.5858,0]
["P9845","Operador de equipamento pesado","h",11.74,1.652132,31.136,0]
["P9846","Operador de equipamento especial","h",14.44,1.53309,36.5778,0]
["P9847","Perfurador de tubulão","h",6.8461,2.066431,20.993,0]
["P9848","Desenhista","mês",2830.9126,1.145553,6073.873,0]
["P9849","Condutor maquinista fluvial","mês",2146.73,1.253845,4838.3966,0]
["P9850","Copeiro","mês",1504.8,1.527063,3802.7244,0]
["P9851","Médico do trabalho","mês",9843.5398,0.844135,18152.8162,0]
["P9852","Blaster","h",9.8999,2.12771,33.9339,0.3]
["P9853","Pré-marcador","h",6.8452,2.039366,20.805,0]
["P9854","Recepcionista","mês",1632.0016,1.434933,3973.8145,0]
["P9855","Marinheiro de máquinas","mês",2001.6548,1.289828,4583.4452,0]
["P9856","Marinheiro de convés","h",8.8933,1.751391,24.4689,0]
["P9857","Marinheiro de convés - mensalista","mês",1956.5248,1.301273,4502.4976,0]
["P9858","Laboratorista","mês",3176.8,1.130709,6768.8363,0]
["P9859","Trabalhador de via","h",6.221,2.183704,19.8058,0]
["P9861","Selecionador de material pétreo","h",6.8452,2.051937,20.8911,0]
["P9864","Engenheiro de segurança do trabalho","mês",11149.0872,0.839279,20506.2819,0]
["P9865","Técnico em enfermagem","mês",2911.9894,1.178603,6344.0688,0]
["P9866","Motorista de caminhão","h",11.74,1.635685,30.9429,0]
["P9867","Técnico especializado - mensalista","mês",3150.4021,1.140486,6743.3915,0]
["P9869","Encarregado de obras de artes especiais","mês",3572.7672,1.014049,7195.7282,0]
["P9870","Motorista de veículo leve","h",10.25,1.714065,27.8191,0]
["P9871","Motorista de veículo especial","h",11.7483,1.635301,30.9603,0]
["P9875","Encarregado de turma","mês",2295.995,1.276366,5226.5249,0]
["P9876","Técnico de segurança do trabalho","mês",3093.2,1.142388,6626.8345,0]
["P9878","Secretária","mês",2593.8973,1.185133,5668.0105,0]
["P9880","Piloto fluvial","mês",3276.33,1.080258,6815.6116,0]
["P9882","Técnico especializado","h",14.32,1.55376,36.5698,0]
["P9883","Chefe do setor administrativo","mês",3814.411,0.972263,7523.0216,0]
["P9884","Encarregado de terraplenagem","mês",3572.7672,1.014049,7195.7282,0]
["P9885","Frentista de túnel","h",8.88,1.892258,25.6832,0]
["P9889","Técnico da qualidade","mês",3433.6928,1.031486,6975.4988,0]
["P9891","Engenheiro mecânico","mês",12633.3004,0.828942,23105.5737,0]
["P9892","Auxiliar de blaster","h",8.2651,2.266683,29.4789,0.3]
["P9893","Encarregado de pavimentação","mês",3572.7672,1.014049,7195.7282,0]
["P9896","Porteiro","mês",1431.4407,1.597809,3718.6095,0]
["P9897","Técnico de meio ambiente","mês",3429.5822,1.027682,6954.102,0]
["P9900","Comprador","mês",3174.5236,1.133783,6773.7444,0]
["P9901","Encarregado de superestrutura ferroviária","mês",3572.7672,1.014049,7195.7282,0]
["P9903","Auxiliar técnico","mês",1704.9316,1.448858,4175.1353,0]
["P9907","Comandante de longo curso","mês",14307.3935,0.82956,26176.2348,0]
["P9908","Imediato","mês",9204.4566,0.87084,17220.0655,0]
["P9909","Oficial de náutica","mês",2559.2555,1.174634,5565.444,0]
["P9910","Oficial de máquinas","mês",3003.1723,1.111844,6342.2314,0]
["P9911","Condutor de máquinas","mês",2146.73,1.253845,4838.3966,0]
["P9912","Capitão fluvial com periculosidade","h",26.9895,1.638889,79.3191,0.3]
["P9913","Draguista","mês",3595.3388,1.051407,7375.5031,0]
["P9915","Maquinista","h",12.5669,1.630902,33.0622,0]
["P9916","Encarregado de conservação rodoviária","mês",3572.7672,1.014049,7195.7282,0]
["P9920","Mestre fluvial","mês",5937.7022,0.934517,11486.5858,0]
["P9921","Mergulhador raso autônomo de emergência","h",9.0128,2.534226,34.2209,0.2627]
["P9922","Mergulhador raso dependente de emergência","h",8.9931,2.618729,35.2415,0.3]
["P9924","Mergulhador raso dependente","h",8.9931,4.101611,48.5772,0.3]
["P9925","Mergulhador raso autônomo","h",9.0128,3.681142,44.5578,0.2627]
["P9926","Mergulhador raso auxiliar de superfície","h",9.0128,2.282251,31.9499,0.2627]
["P9927","Frentista de túnel com periculosidade","h",8.88,2.219798,31.2558,0.3]
["P9928","Servente com periculosidade","h",6.7,2.41976,24.9223,0.3]
["P9929","Bombeiro hidráulico com periculosidade","h",10.772,2.133498,36.9856,0.3]
["P9930","Eletricista com periculosidade","h",10.2874,2.140875,35.3976,0.3]
["P9931","Operador de equipamento de mergulho","h",16.6882,1.815353,49.3512,0.1419]
["P9932","Operador de equipamento pesado com periculosidade","h",11.74,1.979612,38.5026,0.3]
["P9933","Supervisor de mergulho raso","mês",3671.3967,1.334482,9091.7807,0.1419]
["P9934","Motorista de veículo especial com periculosidade","h",11.7483,1.962962,38.3342,0.3]
["P9938","Operador de equipamento leve com periculosidade","h",8.88,2.160611,30.7302,0.3]
["P9939","Operador de equipamento leve com insalubridade","h",8.88,2.339711,32.024,0.2666]
["P9940","Piloto fluvial com periculosidade","h",14.8924,1.814583,46.3836,0.3]
["P9941","Mestre fluvial com periculosidade","h",26.9895,1.638889,79.3191,0.3]
["P9942","Marinheiro de convés com periculosidade","h",8.8933,2.079893,30.0584,0.3]
["P9943","Técnico de batimetria com periculosidade","h",11.6521,1.924869,37.5764,0.3]
["P9944","Operador de equipamento especial com periculosidade","h",14.44,1.86057,45.6386,0.3]
["P9945","Draguista com periculosidade","h",16.3424,1.779803,50.3313,0.3]
["P9946","Engenheiro auxiliar","mês",11067,0.834536,20302.8099,0]
["P9947","Técnico florestal","mês",3429.5822,1.027682,6954.102,0]
["P9948","Motorista de veículo leve - mensalista","mês",2255,1.272852,5125.2812,0]
["P9949","Topógrafo","mês",3825.8,1.002749,7662.1171,0]
["P9950","Auxiliar de topografia","mês",2255,1.291648,5167.6662,0]
["P9951","Médico de câmara hiperbárica","mês",9843.5398,1.034489,20547.2966,0.0529]
["P9952","Pedreiro - mensalista","mês",1953.6,1.390127,4669.3521,0]
["P9953","Eletricista - mensalista","mês",2263.2083,1.357579,5335.6923,0]
["P9954","Servente - mensalista","mês",1474,1.589845,3817.4315,0]
["P9955","Engenheiro chefe","mês",16619.4923,0.808397,30054.64,0]
["P9956","Motorista de caminhão com periculosidade","h",11.74,1.963345,38.3116,0.3]
["P9972","Técnico de batimetria","mês",2563.4643,1.173393,5571.4153,0]

{"sheet":"DNIT 23","index":11,"n_rows":102,"n_cols":25,"rows_kept":102,"cut":false,"hidden":false,"merged":[[0,6,0,15],[0,16,0,21],[1,6,1,7],[1,8,1,9],[1,10,1,11],[1,12,1,13],[1,14,1,15],[1,16,1,17],[1,18,1,19],[1,20,1,21],[0,0,2,0],[0,1,2,1],[0,2,2,2],[0,3,1,3],[0,24,1,24],[0,4,1,5],[0,22,1,23]]}
["Código","Categoria","Unid.","Salário","Encargos Sociais",null,"Encargos Complementares",{"$nulls":9},"Encargos Adicionais",{"$nulls":5},"Encargos Totais",null,"Valor Total"]
[{"$nulls":6},"Alimentação",null,"EPI",null,"Ferramenta",null,"Transporte",null,"Exame Ocupacional",null,"Cesta Básica",null,"Assistência Médica",null,"Seguro de Vida"]
[null,null,null,"R$","%","R$","%","R$","%","R$","%","R$","%","R$","%","R$","%","R$","%","R$","%","R$","%","R$","R$"]
["P8001","Advogado júnior","mês",4222.14,0.7963,3362.09,0.1603,677.01,0.0062,26.03,0,0,0,0,0.0008,3.47,0,0,0.0714,301.42,0.0024,9.98,1.0374,4379.99,8602.13]
["P8002","Advogado pleno","mês",5629.52,0.7963,4482.78,0.1203,677.01,0.0046,26.03,0,0,0,0,0.0006,3.47,0,0,0.0535,301.42,0.0018,9.98,0.9771,5500.69,11130.21]
["P8003","Advogado sênior","mês",9740.87,0.7963,7756.65,0.0695,677.01,0.0027,26.03,0,0,0,0,0.0004,3.47,0,0,0.0309,301.42,0.001,9.98,0.9008,8774.56,18515.43]
["P8007","Analista de desenvolvimento de sistemas júnior","mês",3731.91,0.7938,2962.39,0.1814,677.01,0,0,0,0,0,0,0.0009,3.29,0,0,0.0808,301.42,0.0027,9.98,1.0595,3954.09,7686]
["P8008","Analista de desenvolvimento de sistemas pleno","mês",4975.88,0.7938,3949.85,0.1361,677.01,0,0,0,0,0,0,0.0007,3.29,0,0,0.0606,301.42,0.002,9.98,0.9931,4941.55,9917.43]
["P8009","Analista de desenvolvimento de sistemas sênior","mês",8853.75,0.7938,7028.1,0.0765,677.01,0,0,0,0,0,0,0.0004,3.29,0,0,0.034,301.42,0.0011,9.98,0.9058,8019.8,16873.55]
["P8013","Arquiteto júnior","mês",11067,0.7924,8769.49,0.0612,677.01,0.0024,26.03,0,0,0,0,0.0002,2.6,0,0,0.0272,301.42,0.0009,9.98,0.8843,9786.52,20853.52]
["P8014","Arquiteto pleno","mês",11492.2,0.7924,9106.42,0.0589,677.01,0.0023,26.03,0,0,0,0,0.0002,2.6,0,0,0.0262,301.42,0.0009,9.98,0.8809,10123.45,21615.65]
["P8015","Arquiteto sênior","mês",14185.72,0.7924,11240.77,0.0477,677.01,0.0018,26.03,0,0,0,0,0.0002,2.6,0,0,0.0212,301.42,0.0007,9.98,0.8641,12257.8,26443.52]
["P8019","Assistente social júnior","mês",2867.66,0.7997,2293.27,0.2361,677.01,0.0091,26.03,0,0,0.0164,46.97,0.0013,3.82,0,0,0.1051,301.42,0.0035,9.98,1.1712,3358.5,6226.16]
["P8020","Assistente social pleno","mês",3823.55,0.7997,3057.69,0.1771,677.01,0.0068,26.03,0,0,0,0,0.001,3.82,0,0,0.0788,301.42,0.0026,9.98,1.066,4075.95,7899.5]
["P8021","Assistente social sênior","mês",6517.04,0.7997,5211.68,0.1039,677.01,0.004,26.03,0,0,0,0,0.0006,3.82,0,0,0.0463,301.42,0.0015,9.98,0.9559,6229.93,12746.97]
["P8025","Auxiliar","mês",1428.53,0.7998,1142.54,0.4739,677.01,0.0222,31.69,0.0011,1.62,0.0933,133.32,0.0025,3.57,0,0,0.211,301.42,0.007,9.98,1.6109,2301.15,3729.68]
["P8026","Auxiliar administrativo","mês",1708.51,0.8011,1368.69,0.3963,677.01,0,0,0,0,0.0682,116.52,0.0025,4.28,0,0,0.1764,301.42,0.0058,9.98,1.4503,2477.89,4186.4]
["P8027","Auxiliar de laboratório","mês",1609.67,0.7988,1285.81,0.4206,677.01,0.0197,31.69,0.0021,3.35,0.0761,122.45,0.0027,4.37,0,0,0.1873,301.42,0.0062,9.98,1.5134,2436.08,4045.75]
["P8028","Auxiliar de topografia","mês",1428.53,0.7994,1141.97,0.4739,677.01,0.0222,31.69,0.001,1.41,0.0933,133.32,0.0031,4.48,0,0,0.211,301.42,0.007,9.98,1.6109,2301.27,3729.8]
["P8032","Biólogo júnior","mês",3084.04,0.7948,2451.2,0.2195,677.01,0.0084,26.03,0,0,0.011,33.99,0.0011,3.31,0,0,0.0977,301.42,0.0032,9.98,1.1358,3502.93,6586.97]
["P8033","Biólogo pleno","mês",4112.06,0.7948,3268.26,0.1646,677.01,0.0063,26.03,0,0,0,0,0.0008,3.31,0,0,0.0733,301.42,0.0024,9.98,1.0423,4286.01,8398.06]
["P8034","Biólogo sênior","mês",7148.83,0.7948,5681.89,0.0947,677.01,0.0036,26.03,0,0,0,0,0.0005,3.31,0,0,0.0422,301.42,0.0014,9.98,0.9372,6699.64,13848.47]
["P8038","Chefe de escritório","mês",3122.68,0.7972,2489.4,0.2168,677.01,0,0,0,0,0.0101,31.67,0.001,3.05,0,0,0.0965,301.42,0.0032,9.98,1.1248,3512.52,6635.2]
["P8040","Contador júnior","mês",3909.36,0.7961,3112.24,0.1732,677.01,0,0,0,0,0,0,0.0008,3.14,0,0,0.0771,301.42,0.0026,9.98,1.0497,4103.79,8013.14]
["P8041","Contador pleno","mês",5212.47,0.7961,4149.65,0.1299,677.01,0,0,0,0,0,0,0.0006,3.14,0,0,0.0578,301.42,0.0019,9.98,0.9863,5141.2,10353.67]
["P8042","Contador sênior","mês",9737.02,0.7961,7751.64,0.0695,677.01,0,0,0,0,0,0,0.0003,3.14,0,0,0.031,301.42,0.001,9.98,0.8979,8743.19,18480.22]
["P8044","Coordenador ambiental ","mês",15552.43,0.7945,12356.4,0.0435,677.01,0.0015,23.77,0,0,0,0,0.0002,3.38,0,0,0.0194,301.42,0.0006,9.98,0.8598,13371.96,28924.39]
["P8045","Economista júnior","mês",4306.55,0.7922,3411.65,0.1572,677.01,0,0,0,0,0,0,0.0007,3.03,0,0,0.07,301.42,0.0023,9.98,1.0224,4403.09,8709.64]
["P8046","Economista pleno","mês",5742.07,0.7922,4548.87,0.1179,677.01,0,0,0,0,0,0,0.0005,3.03,0,0,0.0525,301.42,0.0017,9.98,0.9649,5540.31,11282.38]
["P8047","Economista sênior","mês",9853.56,0.7922,7805.99,0.0687,677.01,0,0,0,0,0,0,0.0003,3.03,0,0,0.0306,301.42,0.001,9.98,0.8928,8797.43,18650.99]
["P8054","Engenheiro agrônomo júnior","mês",11067,0.7903,8746.25,0.0612,677.01,0.0024,26.03,0,0,0,0,0.0003,3.08,0,0,0.0272,301.42,0.0009,9.98,0.8822,9763.76,20830.76]
["P8055","Engenheiro agrônomo pleno","mês",12027.17,0.7903,9505.07,0.0563,677.01,0.0022,26.03,0,0,0,0,0.0003,3.08,0,0,0.0251,301.42,0.0008,9.98,0.8749,10522.59,22549.76]
["P8056","Engenheiro agrônomo sênior","mês",12987.35,0.7903,10263.9,0.0521,677.01,0.002,26.03,0,0,0,0,0.0002,3.08,0,0,0.0232,301.42,0.0008,9.98,0.8686,11281.41,24268.76]
["P8057","Engenheiro ambiental júnior","mês",11067,0.7957,8806.01,0.0612,677.01,0.0024,26.03,0,0,0,0,0.0003,3.45,0,0,0.0272,301.42,0.0009,9.98,0.8877,9823.9,20890.9]
["P8058","Engenheiro ambiental pleno","mês",11113.77,0.7957,8843.23,0.0609,677.01,0.0023,26.03,0,0,0,0,0.0003,3.45,0,0,0.0271,301.42,0.0009,9.98,0.8873,9861.12,20974.89]
["P8059","Engenheiro ambiental sênior","mês",13306.5,0.7957,10587.98,0.0509,677.01,0.002,26.03,0,0,0,0,0.0003,3.45,0,0,0.0227,301.42,0.0008,9.98,0.8722,11605.87,24912.36]
["P8060","Engenheiro consultor especial","mês",20421.76,0.7939,16212.84,0.0332,677.01,0.0012,23.77,0,0,0,0,0.0002,3.32,0,0,0.0148,301.42,0.0005,9.98,0.8436,17228.34,37650.1]
["P8061","Engenheiro coordenador","mês",17018.13,0.7939,13510.7,0.0398,677.01,0.0014,23.77,0,0,0,0,0.0002,3.32,0,0,0.0177,301.42,0.0006,9.98,0.8536,14526.2,31544.33]
["P8062","Engenheiro de pesca júnior","mês",11067,0.7971,8821.51,0.0612,677.01,0.0024,26.03,0,0,0,0,0.0004,3.89,0,0,0.0272,301.42,0.0009,9.98,0.8891,9839.83,20906.83]
["P8063","Engenheiro de pesca pleno","mês",11199.09,0.7971,8926.8,0.0605,677.01,0.0023,26.03,0,0,0,0,0.0003,3.89,0,0,0.0269,301.42,0.0009,9.98,0.888,9945.12,21144.22]
["P8064","Engenheiro de pesca sênior","mês",12672.11,0.7971,10100.94,0.0534,677.01,0.0021,26.03,0,0,0,0,0.0003,3.89,0,0,0.0238,301.42,0.0008,9.98,0.8775,11119.27,23791.38]
["P8065","Engenheiro de projetos júnior","mês",11067,0.7939,8786.09,0.0612,677.01,0.0024,26.03,0,0,0,0,0.0003,3.32,0,0,0.0272,301.42,0.0009,9.98,0.8859,9803.85,20870.85]
["P8066","Engenheiro de projetos pleno","mês",11469.24,0.7939,9105.43,0.059,677.01,0.0023,26.03,0,0,0,0,0.0003,3.32,0,0,0.0263,301.42,0.0009,9.98,0.8826,10123.19,21592.42]
["P8067","Engenheiro de projetos sênior","mês",14672.91,0.7939,11648.82,0.0461,677.01,0.0018,26.03,0,0,0,0,0.0002,3.32,0,0,0.0205,301.42,0.0007,9.98,0.8633,12666.58,27339.49]
["P8068","Engenheiro florestal júnior","mês",11067,0.7971,8821.51,0.0612,677.01,0.0024,26.03,0,0,0,0,0.0004,3.89,0,0,0.0272,301.42,0.0009,9.98,0.8891,9839.83,20906.83]
["P8069","Engenheiro florestal pleno","mês",11199.11,0.7971,8926.81,0.0605,677.01,0.0023,26.03,0,0,0,0,0.0003,3.89,0,0,0.0269,301.42,0.0009,9.98,0.888,9945.14,21144.25]
["P8070","Engenheiro florestal sênior","mês",12672.11,0.7971,10100.94,0.0534,677.01,0.0021,26.03,0,0,0,0,0.0003,3.89,0,0,0.0238,301.42,0.0008,9.98,0.8775,11119.27,23791.38]
["P8080","Geólogo júnior","mês",10004.5,0.7959,7962.58,0.0677,677.01,0.0026,26.03,0,0,0,0,0.0004,3.55,0,0,0.0301,301.42,0.001,9.98,0.8977,8980.57,18985.07]
["P8081","Geólogo pleno","mês",10526.36,0.7959,8377.93,0.0643,677.01,0.0025,26.03,0,0,0,0,0.0003,3.55,0,0,0.0286,301.42,0.0009,9.98,0.8926,9395.92,19922.28]
["P8082","Geólogo sênior","mês",14001.61,0.7959,11143.88,0.0484,677.01,0.0019,26.03,0,0,0,0,0.0003,3.55,0,0,0.0215,301.42,0.0007,9.98,0.8686,12161.87,26163.48]
["P8092","Jornalista júnior","mês",2682.71,0.7963,2136.24,0.2524,677.01,0.0097,26.03,0,0,0.0216,58.07,0.0011,2.95,0,0,0.1124,301.42,0.0037,9.98,1.1972,3211.7,5894.4]
["P8093","Jornalista pleno","mês",3576.94,0.7963,2848.32,0.1893,677.01,0.0073,26.03,0,0,0.0012,4.42,0.0008,2.95,0,0,0.0843,301.42,0.0028,9.98,1.082,3870.12,7447.06]
["P8094","Jornalista sênior","mês",6931.43,0.7963,5519.5,0.0977,677.01,0.0038,26.03,0,0,0,0,0.0004,2.95,0,0,0.0435,301.42,0.0014,9.98,0.9431,6536.88,13468.31]
["P8098","Laboratorista","mês",2146.23,0.7988,1714.41,0.3154,677.01,0.0136,29.18,0,0,0.0421,90.26,0.002,4.37,0,0,0.1404,301.42,0.0047,9.98,1.317,2826.63,4972.86]
["P8102","Médico veterinário","mês",11067,0.792,8765.06,0.0612,677.01,0.0024,26.03,0,0,0,0,0.0003,2.98,0,0,0.0272,301.42,0.0009,9.98,0.8839,9782.48,20849.48]
["P8106","Meteorologista júnior","mês",4696.66,0.7956,3736.66,0.1441,677.01,0.0055,26.03,0,0,0,0,0.0006,2.8,0,0,0.0642,301.42,0.0021,9.98,1.0122,4753.9,9450.55]
["P8107","Meteorologista pleno","mês",6262.21,0.7956,4982.21,0.1081,677.01,0.0042,26.03,0,0,0,0,0.0004,2.8,0,0,0.0481,301.42,0.0016,9.98,0.958,5999.45,12261.66]
["P8108","Meteorologista sênior","mês",10569.08,0.7956,8408.76,0.0641,677.01,0.0025,26.03,0,0,0,0,0.0003,2.8,0,0,0.0285,301.42,0.0009,9.98,0.8918,9425.99,19995.07]
["P8112","Motorista de caminhão","mês",2096.81,0.7998,1677.03,0.3229,677.01,0.0151,31.69,0,0,0.0445,93.22,0.0021,4.41,0,0,0.1438,301.42,0.0048,9.98,1.3329,2794.76,4891.57]
["P8113","Motorista de veículo leve","mês",1918.44,0.7971,1529.19,0.3529,677.01,0.0165,31.69,0,0,0.0542,103.93,0.002,3.88,0,0,0.1571,301.42,0.0052,9.98,1.385,2657.09,4575.53]
["P8117","Oceanógrafo júnior","mês",4509.57,0.8358,3769.1,0.1501,677.01,0.0058,26.03,0,0,0,0,0.0016,7.38,0,0,0.0668,301.42,0.0022,9.98,1.0624,4790.92,9300.5]
["P8118","Oceanógrafo pleno","mês",6012.77,0.8358,5025.47,0.1126,677.01,0.0043,26.03,0,0,0,0,0.0012,7.38,0,0,0.0501,301.42,0.0017,9.98,1.0057,6047.29,12060.05]
["P8119","Oceanógrafo sênior","mês",9797.51,0.8358,8188.76,0.0691,677.01,0.0027,26.03,0,0,0,0,0.0008,7.38,0,0,0.0308,301.42,0.001,9.98,0.9401,9210.58,19008.09]
["P8129","Pedagogo júnior","mês",2605.46,0.7969,2076.29,0.2598,677.01,0.01,26.03,0,0,0.0241,62.7,0.0016,4.22,0,0,0.1157,301.42,0.0038,9.98,1.2119,3157.64,5763.1]
["P8130","Pedagogo pleno","mês",3473.94,0.7969,2768.38,0.1949,677.01,0.0075,26.03,0,0,0.003,10.6,0.0012,4.22,0,0,0.0868,301.42,0.0029,9.98,1.0932,3797.63,7271.57]
["P8131","Pedagogo sênior","mês",5794.12,0.7969,4617.34,0.1168,677.01,0.0045,26.03,0,0,0,0,0.0007,4.22,0,0,0.052,301.42,0.0017,9.98,0.9727,5635.99,11430.11]
["P8135","Secretária","mês",2335.81,0.7972,1862.11,0.2898,677.01,0,0,0,0,0.0338,78.88,0.0013,3.05,0,0,0.129,301.42,0.0043,9.98,1.2554,2932.45,5268.26]
["P8139","Sondador","mês",1843.72,0.7967,1468.89,0.3672,677.01,0.0158,29.18,0,0,0.0588,108.41,0.0022,4.01,0,0,0.1635,301.42,0.0054,9.98,1.4096,2598.9,4442.62]
["P8143","Técnico ambiental","mês",2751.31,0.7985,2196.92,0.2461,677.01,0.0106,29.18,0,0,0.0196,53.95,0.0015,4.05,0,0,0.1096,301.42,0.0036,9.98,1.1894,3272.51,6023.83]
["P8147","Técnico de obras","mês",3091.07,0.7968,2462.97,0.219,677.01,0.0094,29.18,0,0,0.0109,33.57,0.0012,3.84,0,0,0.0975,301.42,0.0032,9.98,1.1381,3517.96,6609.04]
["P8151","Técnico de segurança do trabalho","mês",4293.4,0.8018,3442.45,0.1577,677.01,0.0068,29.18,0,0,0,0,0.0011,4.61,0,0,0.0702,301.42,0.0023,9.98,1.0399,4464.64,8758.04]
["P8155","Técnico em geoprocessamento","mês",2522.76,0.7945,2004.33,0.2684,677.01,0.0116,29.18,0,0,0.0268,67.67,0.0013,3.27,0,0,0.1195,301.42,0.004,9.98,1.226,3092.86,5615.61]
["P8159","Técnico em informática - programador","mês",3610.93,0.7965,2876.1,0.1875,677.01,0,0,0,0,0.0007,2.38,0.0011,3.86,0,0,0.0835,301.42,0.0028,9.98,1.072,3870.75,7481.67]
["P8163","Topógrafo","mês",2323.3,0.7994,1857.25,0.2914,677.01,0.0126,29.18,0,0,0.0343,79.63,0.0019,4.48,0,0,0.1297,301.42,0.0043,9.98,1.2736,2958.95,5282.25]
["P8167","Arquivista júnior","mês",2018.26,0.7981,1610.77,0.3354,677.01,0,0,0,0,0.0485,97.94,0.0017,3.48,0,0,0.1493,301.42,0.0049,9.98,1.3381,2700.6,4718.86]
["P8168","Arquivista pleno","mês",2691.02,0.7981,2147.7,0.2516,677.01,0,0,0,0,0.0214,57.57,0.0013,3.48,0,0,0.112,301.42,0.0037,9.98,1.1881,3197.16,5888.17]
["P8169","Arquivista sênior","mês",4219.38,0.7981,3367.49,0.1605,677.01,0,0,0,0,0,0,0.0008,3.48,0,0,0.0714,301.42,0.0024,9.98,1.0332,4359.37,8578.76]
["P8173","Administrador júnior","mês",3097.97,0.7961,2466.29,0.2185,677.01,0,0,0,0,0.0107,33.15,0.001,3.11,0,0,0.0973,301.42,0.0032,9.98,1.1269,3490.96,6588.93]
["P8174","Administrador pleno","mês",4130.62,0.7961,3288.39,0.1639,677.01,0,0,0,0,0,0,0.0008,3.11,0,0,0.073,301.42,0.0024,9.98,1.0361,4279.91,8410.53]
["P8175","Administrador sênior","mês",7233.66,0.7961,5758.72,0.0936,677.01,0,0,0,0,0,0,0.0004,3.11,0,0,0.0417,301.42,0.0014,9.98,0.9332,6750.24,13983.9]
["P8180","Engenheiro agrimensor júnior","mês",11067,0.7933,8779.45,0.0612,677.01,0.0024,26.03,0,0,0,0,0.0002,2.71,0,0,0.0272,301.42,0.0009,9.98,0.8852,9796.59,20863.59]
["P8181","Engenheiro agrimensor pleno","mês",11198.11,0.7933,8883.46,0.0605,677.01,0.0023,26.03,0,0,0,0,0.0002,2.71,0,0,0.0269,301.42,0.0009,9.98,0.8841,9900.6,21098.71]
["P8182","Engenheiro agrimensor sênior","mês",12047.23,0.7933,9557.07,0.0562,677.01,0.0022,26.03,0,0,0,0,0.0002,2.71,0,0,0.025,301.42,0.0008,9.98,0.8777,10574.21,22621.44]
["P8183","Geógrafo júnior","mês",3351.22,0.7943,2661.87,0.202,677.01,0.0078,26.03,0,0,0.0054,17.96,0.0008,2.71,0,0,0.0899,301.42,0.003,9.98,1.1032,3696.98,7048.19]
["P8184","Geógrafo pleno","mês",4468.29,0.7943,3549.16,0.1515,677.01,0.0058,26.03,0,0,0,0,0.0006,2.71,0,0,0.0675,301.42,0.0022,9.98,1.0219,4566.31,9034.6]
["P8185","Geógrafo sênior","mês",8514.33,0.7943,6762.93,0.0795,677.01,0.0031,26.03,0,0,0,0,0.0003,2.71,0,0,0.0354,301.42,0.0012,9.98,0.9138,7780.08,16294.41]
["P8186","Antropólogo júnior","mês",3165.46,0.8072,2555.16,0.2139,677.01,0.0082,26.03,0,0,0.0092,29.1,0.0015,4.66,0,0,0.0952,301.42,0.0032,9.98,1.1383,3603.36,6768.82]
["P8187","Antropólogo pleno","mês",4220.61,0.8072,3406.88,0.1604,677.01,0.0062,26.03,0,0,0,0,0.0011,4.66,0,0,0.0714,301.42,0.0024,9.98,1.0487,4425.97,8646.58]
["P8188","Antropólogo sênior","mês",6078.95,0.8072,4906.93,0.1114,677.01,0.0043,26.03,0,0,0,0,0.0008,4.66,0,0,0.0496,301.42,0.0016,9.98,0.9748,5926.02,12004.97]
["P8189","Arqueólogo júnior","mês",3085.16,0.8271,2551.74,0.2194,677.01,0.0084,26.03,0,0,0.011,33.92,0.002,6.32,0,0,0.0977,301.42,0.0032,9.98,1.169,3606.42,6691.58]
["P8190","Arqueólogo pleno","mês",4113.55,0.8271,3402.32,0.1646,677.01,0.0063,26.03,0,0,0,0,0.0015,6.32,0,0,0.0733,301.42,0.0024,9.98,1.0752,4423.07,8536.62]
["P8191","Arqueólogo sênior","mês",5832.14,0.8271,4823.76,0.1161,677.01,0.0045,26.03,0,0,0,0,0.0011,6.32,0,0,0.0517,301.42,0.0017,9.98,1.0021,5844.52,11676.66]
["P8192","Historiador júnior","mês",3325.64,0.7967,2649.54,0.2036,677.01,0.0078,26.03,0,0,0.0059,19.49,0.0011,3.69,0,0,0.0906,301.42,0.003,9.98,1.1087,3687.15,7012.79]
["P8193","Historiador pleno","mês",4434.18,0.7967,3532.71,0.1527,677.01,0.0059,26.03,0,0,0,0,0.0008,3.69,0,0,0.068,301.42,0.0023,9.98,1.0263,4550.84,8985.02]
["P8194","Historiador sênior","mês",7403.84,0.7967,5898.64,0.0914,677.01,0.0035,26.03,0,0,0,0,0.0005,3.69,0,0,0.0407,301.42,0.0013,9.98,0.9342,6916.76,14320.6]
["P8195","Paleontólogo júnior","mês",3141.84,0.7981,2507.51,0.2155,677.01,0.0083,26.03,0,0,0.0097,30.52,0.0012,3.91,0,0,0.0959,301.42,0.0032,9.98,1.1319,3556.37,6698.22]
["P8196","Paleontólogo pleno","mês",4189.13,0.7981,3343.34,0.1616,677.01,0.0062,26.03,0,0,0,0,0.0009,3.91,0,0,0.072,301.42,0.0024,9.98,1.0412,4361.69,8550.81]
["P8197","Paleontólogo sênior","mês",6069.84,0.7981,4844.34,0.1115,677.01,0.0043,26.03,0,0,0,0,0.0006,3.91,0,0,0.0497,301.42,0.0016,9.98,0.9659,5862.69,11932.53]
["P8198","Sociólogo júnior","mês",3782.76,0.8191,3098.46,0.179,677.01,0.0069,26.03,0,0,0,0,0.0015,5.55,0,0,0.0797,301.42,0.0026,9.98,1.0887,4118.44,7901.19]
["P8199","Sociólogo pleno","mês",5043.67,0.8191,4131.27,0.1342,677.01,0.0052,26.03,0,0,0,0,0.0011,5.55,0,0,0.0598,301.42,0.002,9.98,1.0213,5151.26,10194.93]
["P8200","Sociólogo sênior","mês",7915.13,0.8191,6483.28,0.0855,677.01,0.0033,26.03,0,0,0,0,0.0007,5.55,0,0,0.0381,301.42,0.0013,9.98,0.948,7503.26,15418.39]
["Fonte: FGV IBRE"]

{"sheet":"SICRO EQUIP","index":12,"n_rows":533,"n_cols":11,"rows_kept":533,"cut":false,"hidden":false,"merged":[[0,1,0,9],[1,1,1,9],[374,2,374,8],[377,2,377,8],[381,2,381,8],[384,2,384,8],[387,2,387,8],[391,2,391,8],[396,2,396,8],[399,2,399,8],[402,2,402,8],[405,2,405,8],[407,2,407,8],[409,2,409,8],[411,2,411,8],[414,2,414,8],[417,2,417,8],[421,2,421,8],[426,2,426,8],[431,2,431,8],[434,2,434,8],[437,2,437,8],[440,2,440,8],[443,2,443,8],[446,2,446,8],[449,2,449,8],[452,2,452,8],[455,2,455,8],[458,2,458,8],[461,2,461,8],[464,2,464,8],[467,2,467,8],[470,2,470,8],[473,2,473,8],[476,2,476,8],[480,2,480,8],[483,2,483,8],[486,2,486,8],[489,2,489,8],[492,2,492,8],[495,2,495,8],[498,2,498,8],[501,2,501,8],[506,2,506,8],[509,2,509,8],[513,2,513,8],[516,2,516,8],[521,2,521,8],[524,2,524,8],[527,2,527,8],[530,2,530,8]]}
["CGCIT","SISTEMA DE CUSTOS REFERENCIAIS DE OBRAS - SICRO",{"$nulls":8},"DNIT"]
[null,"Pernambuco - Abril/2023"]
["Código","Descrição","Valor de Aquisição (R$)","Depreciação (R$/h)","Oportunidade de Capital (R$/h)","Seguros e Impostos (R$/h)","Manutenção (R$/h)","Operação (R$/h)","Mão de Obra de Operação (R$/h)","Custo Produtivo (R$/h)","Custo Improdutivo (R$/h)"]
["E9001","Conjunto vibratório para tubos de concreto com encaixe PB e 3 jogos de fôrmas - D = 0,60 m - 2,20 kW",76806.5453,10.2409,2.3695,0,7.6807,0,0,20.2911,12.6104]
["E9002","Conjunto vibratório para tubos de concreto com encaixe PB e 3 jogos de fôrmas - D = 0,80 m - 2,20 kW",83388.2319,11.1184,2.5725,0,8.3388,0,0,22.0297,13.6909]
["E9003","Conjunto vibratório para tubos de concreto com encaixe PB e 3 jogos de fôrmas - D = 1,00 m - 2,20 kW",91709.77,12.228,2.8292,0,9.171,0,0,24.2282,15.0572]
["E9004","Conjunto vibratório para tubos de concreto com encaixe PB e 3 jogos de fôrmas - D = 1,20 m - 2,20 kW",92222.4751,12.2963,2.8451,0,9.2222,0,0,24.3636,15.1414]
["E9005","Conjunto vibratório para tubos de concreto com encaixe PB e 3 jogos de fôrmas - D = 1,50 m - 2,20 kW",94214.5224,12.5619,2.9065,0,9.4215,0,0,24.8899,15.4684]
["E9006","Equipamento para sondagem manual",2422.2022,0.4118,0.0897,0,0.2422,0,0,0.7437,0.5015]
["E9007","Bomba de pistão triplex com capacidade de 7,80 m³/h (130 l/min) - 8,20 kW",126986.6956,10.1589,2.3505,0,8.8891,7.9349,0,29.3334,12.5094]
["E9008","Transportador manual de tubos de concreto com capacidade de 1 t",2368.7039,2.1318,0.1461,0,1.1844,0,0,3.4623,2.2779]
["E9009","Embarcação rebocadora - 268 kW",658695.2031,8.5768,3.8219,0,19.0595,259.3356,139.0418,429.8356,151.4405]
["E9010","Balança plataforma digital à bateria, com mesa de 75 x 75 cm e capacidade de 500 kg",5562.3245,0.8343,0.1144,0,0.4635,0,0,1.4122,0.9487]
["E9011","Carro manual modelo plataforma de 200 x 80 cm com capacidade de 800 kg",2112.6406,0.3803,0.0782,0,0.2113,0,0,0.6698,0.4585]
["E9014","Deflectômetro de impacto (FWD) instalado em picape com reboque e faixa de carga de 7 a 120 kN - 147 kW",2218300.2212,177.464,41.0607,0,110.915,0,30.9603,360.4,249.485]
["E9015","Elevador de obra com capacidade de 1.000 kg - 9 kW",56711.879,4.537,1.0497,0,3.9698,0,25.1582,34.7147,30.7449]
["E9016","Usina misturadora móvel de reciclagem a frio com sistema de espuma de asfalto - 129 kW",9247269.4,539.424,166.4123,67.428,693.5452,91.9796,36.5778,1595.3669,809.8421]
["E9017","Escavadeira hidráulica sobre esteira com capacidade de 0,4 m³ - 64 kW",927565.3937,64.9296,17.1692,0,64.9296,42.3738,31.136,220.5382,113.2348]
["E9020","Recicladora a frio - 455 kW",5004617.1217,291.936,90.0623,0,417.0514,463.463,36.5778,1299.0905,418.5761]
["E9021","Grupo gerador - 456 kVA",350195.6528,17.5098,6.1734,0,12.507,353.1996,0,389.3898,23.6832]
["E9022","Pórtico metálico rolante com capacidade de 25 t - 30 kW",892959.2519,40.1832,15.1513,0,31.2536,0,25.1582,111.7463,80.4927]
["E9023","Guindaste móvel sobre esteiras com dragline com capacidade de 1,9 a 2,3 m³ - 270 kW",3687500.1194,129.0625,62.5677,0,184.375,68.7555,36.5778,481.3385,228.208]
["E9024","Misturador de nata cimento - 1,50 kW",7671.3664,0.6137,0.142,0,0.537,0,25.1582,26.4509,25.9139]
["E9025","Conjunto bomba e macaco hidráulico para protensão com capacidade de 7.000 kN - 15 kW",102595.9637,5.8626,1.8086,0,5.8626,0,36.5778,50.1116,44.249]
["E9026","Bomba para injeção de nata de cimento com capacidade de 2 MPa - 2,20 kW",29605.8325,2.3685,0.548,0,2.0724,0,0,4.9889,2.9165]
["E9028","Bomba de alta pressão para hidrojateamento com capacidade de 18 MPa - 5,20 kW",4932.5974,0.3946,0.0913,0,0.4439,8.5274,25.1582,34.6154,25.6441]
["E9029","Conjunto bomba e macaco hidráulico para protensão com capacidade de 8.000 kN - 20 kW",130429.4823,7.4531,2.2993,0,7.4531,0,36.5778,53.7833,46.3302]
["E9030","Bomba de protensão com leitura digital para tensionamento de estais - 3 kW",13714.5672,0.7837,0.2418,0,0.7837,0,0,1.8092,1.0255]
["E9031","Elevador de cremalheira com cabine simples, com capacidade de 1.500 kg e altura de até 100 m - 15 kW",265982.6132,21.2786,4.9233,0,18.6188,0,25.1582,69.9789,51.3601]
["E9032","Equipamento para regulagem final de estais com até 37 cordoalhas - D = 15,7 mm - 20 kW",86805.0766,4.9603,1.5302,0,4.9603,0,36.5778,48.0286,43.0683]
["E9033","Equipamento para regulagem final de estais de 38 a 55 cordoalhas - D = 15,7 mm - 30 kW",124007.2523,7.0861,2.1861,0,7.0861,0,36.5778,52.9361,45.85]
["E9034","Equipamento para regulagem final de estais de 56 a 73 cordoalhas - D = 15,7 mm - 40 kW",186010.8784,10.6292,3.2791,0,10.6292,0,36.5778,61.1153,50.4861]
["E9035","Equipamento para regulagem final de estais de 74 a 91 cordoalhas - D = 15,7 mm - 50 kW",248014.5046,14.1723,4.3721,0,14.1723,0,36.5778,69.2945,55.1222]
["E9036","Grua fixa para alturas de 60 a 102 m, com alcance de 60 m com capacidade de 1.500 kg na ponta da lança - 37 kW",3381707.3558,169.0854,59.6147,0,193.2404,0,36.5778,458.5183,265.2779]
["E9038","Macaco hidráulico monocordoalha para tensionamento de estais - 3 kW",17748.388,1.0142,0.3129,0,1.0142,0,36.5778,38.9191,37.9049]
["E9039","Máquina de solda por termofusão para tubos PEAD com gerador de 4 kW",116604.9556,6.6631,2.0556,0,6.6631,3.8707,36.5778,55.8303,45.2965]
["E9040","Serra mármore - 1,45 kW",466.1998,0.042,0.0086,0,0.0233,0,0,0.0739,0.0506]
["E9042","Trator sobre esteiras com lâmina - 97 kW",1053401.4603,40.9656,18.0541,0,58.5223,69.1629,31.136,217.8409,90.1557]
["E9043","Embarcação de alumínio com comprimento de 6 m e motor de popa - 18,60 kW",23182.853,0.3622,0.1366,0,0.4025,34.8594,37.3478,73.1085,37.8466]
["E9044","Central de concreto com capacidade de 150 m³/h - dosadora e misturadora",3407217.9573,194.6982,60.0644,0,170.3609,0,36.5778,461.7013,291.3404]
["E9045","Conjunto bomba e macaco hidráulico para elevação com capacidade de 496 kN",64318.8299,5.1455,1.1905,0,5.1455,5.3976,36.5778,53.4569,42.9138]
["E9046","Conjunto bomba e macaco hidráulico para elevação com capacidade de 929 kN",78102.1102,6.2482,1.4457,0,6.2482,5.3976,36.5778,55.9175,44.2717]
["E9047","Conjunto bomba e macaco hidráulico para elevação com capacidade de 1.390 kN",113464.9889,9.0772,2.1002,0,9.0772,5.3976,36.5778,62.23,47.7552]
["E9048","Conjunto bomba e macaco hidráulico para elevação com capacidade de 1.859 kN",131718.3067,10.5375,2.4381,0,10.5375,5.3976,36.5778,65.4885,49.5534]
["E9049","Bomba de alta pressão para hidrojateamento com capacidade de 250 MPa - 72 kW",486563.198,38.9251,9.0063,0,43.7907,55.0044,25.1582,171.8847,73.0896]
["E9050","Guindaste móvel sobre pneus com 2 eixos com capacidade de 18 t - 97 kW",2824660.1817,141.233,49.7947,0,181.5853,24.7011,30.9603,428.2744,221.988]
["E9051","Máquina levantadora e posicionadora de via - 7,40 kW",779365.9315,62.3493,14.4261,0,54.5556,9.7081,25.1582,166.1973,101.9336]
["E9052","Empilhadeira a diesel com capacidade de 10 t - 82 kW",847041.7328,67.7633,15.6787,0,59.2929,62.6439,25.1582,230.537,108.6002]
["E9053","Perfuratriz hidráulica montada em flutuante - 32 kW",370236.276,11.5699,2.3795,0,10.2843,16.2976,30.7302,71.2615,44.6796]
["E9054","Equipamento sobre forma-trilho para execução e acabamento de pavimento de concreto - 13,40 kW",1403006.4025,112.2405,25.9696,0,70.1503,17.5796,25.1582,251.0982,163.3683]
["E9055","Guincho pneumático com capacidade de 2,5 t",526016.694,47.3415,9.7366,0,26.3008,0,0,83.3789,57.0781]
["E9056","Plataforma autoelevatória de 12 x 24 m com capacidade de 150 t",914407.4415,7.1438,5.1424,0,15.8751,0,94.0507,122.212,106.3369]
["E9057","Batelão sem propulsão com capacidade de 66 m³",244526.3983,1.9104,1.3751,0,3.1839,0,24.4689,30.9383,27.7544]
["E9058","Plataforma flutuante de 12 x 24 x 1,8 m com capacidade de 150 t",731336.8559,5.7136,4.1128,0,9.5226,0,24.4689,43.8179,34.2953]
["E9059","Plataforma autoelevatória de 12 x 24 m montada na obra com capacidade de 150 t",914407.4415,7.1438,5.1424,0,15.8751,0,94.0507,122.212,106.3369]
["E9060","Perfuratriz pneumática rotopercussiva montada em flutuante com pressão de 0,70 MPa e capacidade de 2.500 gpm",21929.1209,0.6853,0.1409,0,0.6091,0,61.4604,62.8957,62.2866]
["E9061","Lixadeira elétrica manual angular - 2 kW",1386.9997,0.111,0.0257,0,0.0693,0,0,0.206,0.1367]
["E9062","Soprador de ar quente manual - 1,60 kW",4765.0018,0.6353,0.098,0,0.3971,0,0,1.1304,0.7333]
["E9063","Equipamento de estabilização dinâmica da via - 300 kW",25180535.7241,1007.2214,427.2507,0,1007.2214,183.348,36.5778,2661.6193,1471.0499]
["E9064","Transportador manual gerica com capacidade de 180 l",1091.8873,1.0919,0.0674,0,0.5459,0,0,1.7052,1.1593]
["E9065","Carro controle ferroviário - 186 kW",30351234.9626,1214.0494,514.9846,0,1062.2932,113.6758,36.5778,2941.5808,1765.6118]
["E9066","Grupo gerador - 14 kVA",69455.9772,3.4728,1.2244,0,2.4806,10.6444,0,17.8222,4.6972]
["E9067","Veículo ferroviário para capina química com capacidade de 12.000 l - 115 kW",1693050.933,67.722,28.7268,0,42.3263,70.2834,25.1582,234.2167,121.607]
["E9068","Perfuratriz hidráulica rotopercussiva para CCPH - 123 kW",2704337.1599,180.2891,48.6668,0,180.2891,93.9659,31.136,534.3469,260.0919]
["E9069","Vibrador de imersão para concreto - 4,10 kW",3884.457,0.6215,0.1438,0,0.3884,6.7235,0,7.8772,0.7653]
["E9070","Ponte rolante com capacidade de 5 t e vão de até 15 m - 10 kW",362915.4997,14.5166,6.1578,0,9.0729,0,25.1582,54.9055,45.8326]
["E9071","Transportador manual carrinho de mão com capacidade de 80 l",515.4865,0.5155,0.0318,0,0.2577,0,0,0.805,0.5473]
["E9072","Martelo hidráulico vibratório com unidade hidráulica - 486 kW",2969164.2181,197.9443,53.4326,0,173.2012,371.2797,36.5778,832.4356,287.9547]
["E9073","Bomba de concreto rebocável com capacidade de 30 m³/h - 74 kW",480184.4528,38.4148,8.8882,0,38.4148,71.6076,25.1582,182.4836,72.4612]
["E9074","Tanque de estocagem de asfalto com agitadores de 60.000 l",818448.5816,34.102,11.8355,0,21.3138,0,0,67.2513,45.9375]
["E9075","Trado cavadeira de 12\"",140.285,0.0701,0.0065,0,0.0351,0,0,0.1117,0.0766]
["E9076","Equipamento para pintura eletrostática com cabine dupla de 7,00 kW e estufa de 80.000 kCal",163889.3324,10.5357,2.8891,0,5.8532,0,25.1582,44.4362,38.583]
["E9077","Perfuratriz de circulação reversa tipo Wirth ou similar com unidade hidráulica (Power Pack) - 273 kW",4923076.1094,328.2051,88.5949,0,328.2051,139.0389,31.136,915.18,447.936]
["E9078","Treliça lançadeira com capacidade de carga de 100 a 120 t e vão máximo de 45 m - 110 kW",3539353.1166,94.3827,58.2342,0,58.9892,0,36.5778,248.1839,189.1947]
["E9079","Bomba submersível com capacidade de 360 m³/h - 23 kW",179754.2734,14.3803,3.3273,0,12.5828,0,0,30.2904,17.7076]
["E9080","Carrelone com capacidade máxima de 70 t",1765067.9988,79.4281,29.9488,0,44.1267,0,25.1582,178.6618,134.5351]
["E9081","Fischietti simples com capacidade de 70 t",104902.7055,4.7206,1.7799,0,2.6226,0,25.1582,34.2813,31.6587]
["E9083","Vagão fechado FLT com capacidade de 99 t",800000,12.6667,12.7513,0,6.6667,0,0,32.0847,25.418]
["E9084","Vagão tanque convencional TCT com capacidade de 97 t e 103.000 l",1195000,18.9208,19.0473,0,9.9583,0,0,47.9264,37.9681]
["E9085","Vagão gôndola GDE com capacidade de 93,5 t / 29 m³",620000,9.8167,9.8823,0,5.1667,0,0,24.8657,19.699]
["E9086","Bomba de concreto rebocável com capacidade de 41 m³/h - 74 kW",530334.4528,42.4268,9.8165,0,42.4268,71.6076,25.1582,191.4359,77.4015]
["E9089","Roçadeira costal - 1,40 kW",2656.6326,0.3985,0.0546,0,0.3099,7.2155,0,7.9785,0.4531]
["E9091","Embarcação empurradora fluvial - 372 kW",1103879.4609,14.3734,6.405,0,31.941,359.9732,139.0418,551.7344,159.8202]
["E9093","Veículo leve - 53 kW (sem motorista)",74357.9159,4.4615,1.3764,0.5577,4.4615,22.3494,0,33.2065,6.3956]
["E9094","Guindaste móvel sobre pneus com 6 eixos com capacidade máxima de 350 t - 450 kW",16956771.7475,847.8386,298.9237,121.1198,1090.0782,114.5925,30.9603,2503.5131,1298.8424]
["E9095","Guindaste móvel sobre pneus com 8 eixos com capacidade máxima de 500 t - 500 kW",29742665.0987,1487.1333,524.3207,212.4476,1912.0285,127.325,30.9603,4294.2154,2254.8619]
["E9096","Minicarregadeira de pneus - 45,50 kW",366467.1597,25.6527,6.7833,0,25.6527,57.9329,31.136,147.1576,63.572]
["E9101","Removedora de faixas de sinalização viária - 9,69 kW",50693.0773,4.0554,0.9383,0,3.5485,15.8905,0,24.4327,4.9937]
["E9102","Extrusora para sarjeta de concreto - 10,44 kW",66675.9874,5.3341,1.2342,0,4.6673,7.9756,25.1582,44.3694,31.7265]
["E9103","Extrusora para meio-fio de concreto - 10,44 kW",55956.0575,4.4765,1.0357,0,3.9169,7.9756,25.1582,42.5629,30.6704]
["E9105","Embarcação empurradora multipropósito - 2 x 186 kW",5302261.7896,69.0399,30.7649,0,153.4219,359.9732,139.0418,752.2417,238.8466]
["E9106","Balsa de convés com capacidade de 200 t",2093591.2275,16.3562,11.7737,0,27.2603,0,24.4689,79.8591,52.5988]
["E9107","Compactador manual com soquete vibratório - 2,24 kW",9499.5336,0.6333,0.171,0,0.6333,3.6734,0,5.111,0.8043]
["E9108","Soldadora de trilho por caldeamento na via - 400 kW",8954977.6234,143.2796,143.6558,0,179.0996,244.464,73.1556,783.6546,360.091]
["E9110","Escavadeira hidráulica sobre esteiras para rocha com caçamba com capacidade de 1,56 m³ - 118 kW",1364490.9173,136.4491,27.0608,0,136.4491,114.1851,31.136,445.2801,194.6459]
["E9111","Jateador abrasivo úmido com capacidade de 350 kg de abrasivo",210803.7035,18.9723,3.902,0,18.9723,0,25.1582,67.0048,48.0325]
["E9112","Sinalizador direcional móvel com sistema fotovoltaico de energia e montado em chassi sobre pneus",22664.914,2.0398,0.4195,0,1.1332,0,0,3.5925,2.4593]
["E9113","Painel de Mensagem Variável - PMV móvel, com sistema fotovoltaico de energia e montado em chassi sobre pneus",169254.4528,15.2329,3.1329,0,8.4627,0,0,26.8285,18.3658]
["E9116","Semáforo móvel com 3 lentes e bateria - D = 200 mm",7684.9818,0.6916,0.1422,0,0.3842,0,0,1.218,0.8338]
["E9117","Carregadeira de pneus para rocha com capacidade de 2,50 m³ - 105 kW",712765.1981,71.2765,14.1357,0,71.2765,101.6054,31.136,289.4301,116.5482]
["E9118","Cortadora de pavimento com disco diamantado de 450 a 1.500 mm - 55,40 kW",488319.26,39.0655,9.0388,0,39.0655,42.3228,25.1582,154.6508,73.2625]
["E9119","Minicarregadeira sobre pneus com valetadeira - 55,40 kW",496959.9412,34.7872,9.1987,0,34.7872,70.5381,31.136,180.4472,75.1219]
["E9120","Equipamento de cravação sobre esteira para geodreno com haste para profundidade de até 20 m - 258 kW",3919033.3062,274.3323,72.5413,0,274.3323,170.8192,25.1582,817.1833,372.0318]
["E9122","Perfuratriz tipo Bottom Feed para coluna de brita - 194 kW",4460578.8856,297.3719,80.2718,0,297.3719,98.8042,31.136,804.9558,408.7797]
["E9125","Veículo tipo van furgão com capacidade de 1,54 t - 93 kW",211016.3199,10.5508,3.7974,1.5387,10.5508,23.6825,27.8191,77.9393,43.706]
["E9126","Draga backhoe com capacidade de 7 m³ - 1.000 kW",86279801.5854,970.6478,698.7046,0,2156.995,967.67,64.8848,4858.9022,1734.2372]
["E9127","Escavadeira hidráulica com martelo hidráulico de 520 kg - 75 kW",1508852.7934,172.4403,29.9238,0,215.5504,49.6568,31.136,498.7073,233.5001]
["E9134","Miniônibus com capacidade para 30 passageiros - 111 kW",601355.8272,25.7724,10.601,4.2954,38.6586,107.4114,30.9429,217.6817,71.6117]
["E9141","Rebarbador hidráulico com bomba manual com capacidade de força de 9.000 kgf",89830.0075,7.1864,1.6628,0,4.4915,0,0,13.3407,8.8492]
["E9144","Pórtico metálico rolante com talha com capacidade de 5 t - 10 kW",291130.3348,11.6452,4.9398,0,7.2783,0,25.1582,49.0215,41.7432]
["E9148","Macaco de protensão de fios com bomba - 3,72 kW",95274.1576,5.4442,1.6795,0,5.4442,0,36.5778,49.1457,43.7015]
["E9149","Máquina de aplicação e extração de grampo elástico tipo Pandrol - 6,70 kW",265295.9024,21.2237,4.9106,0,21.2237,8.7898,0,56.1478,26.1343]
["E9151","Britador de mandíbulas móvel sobre esteiras, sem peneira, com capacidade de 140 m³/h - 170 kW",3286947.3021,187.8256,57.9442,0,187.8256,155.8458,36.5778,626.019,282.3476]
["E9152","Ferramenta de fixação à pólvora de ação direta",1092.3095,0.0928,0.0202,0,0.0874,0,0,0.2004,0.113]
["E9153","Ferramenta de fixação à pólvora e sistema à pistão",1016.9006,0.0864,0.0188,0,0.0814,0,0,0.1866,0.1052]
["E9154","Equipamento para selagem com material asfáltico rebocável com capacidade de 370 l - 35 kW",431176.5616,27.7185,7.601,0,9.2395,26.7383,25.1582,96.4555,60.4777]
["E9155","Caldeira de asfalto rebocável com capacidade de 600 l - 5,20 kW",120179.8472,7.7258,2.1186,0,2.5753,3.7077,0,16.1274,9.8444]
["E9156","Soprador de ar costal - 2,6 kW",2323.7928,0.3718,0.086,0,0.3253,4.2637,0,5.0468,0.4578]
["E9157","Locomotiva diesel-elétrica CC - bitola métrica - 2.237 kW",8250000,132,132.3465,0,165,1367.1649,33.0622,1829.5736,297.4087]
["E9158","Locomotiva diesel-elétrica CC - bitola larga - 2.237 kW",8250000,132,132.3465,0,165,1367.1649,33.0622,1829.5736,297.4087]
["E9159","Vagão plataforma PNE com capacidade de 82 t - bitola métrica",667000,10.5608,10.6314,0,5.5583,0,0,26.7505,21.1922]
["E9160","Vagão plataforma PNT com capacidade de 98 t - bitola larga",746000,11.8117,11.8906,0,6.2167,0,0,29.919,23.7023]
["E9161","Vagão fechado com porta para carga e descarga de paletes FLD com capacidade de 64 t - bitola métrica",730000,11.5583,11.6356,0,6.0833,0,0,29.2772,23.1939]
["E9162","Vagão fechado com porta para carga e descarga de paletes FLT com capacidade de 99 t - bitola larga",800000,12.6667,12.7513,0,6.6667,0,0,32.0847,25.418]
["E9163","Vagão hopper aberto com descarga automática HNE com capacidade de 45 m³ - bitola métrica",880000,13.9333,14.0265,0,7.3333,0,0,35.2931,27.9598]
["E9164","Vagão hopper aberto com descarga automática HNT com capacidade de 63 m³ - bitola larga",915000,14.4875,14.5843,0,7.625,0,0,36.6968,29.0718]
["E9167","Equipamento para carga e descarga de TLS de até 250 m - 90 kW",2633902.5792,42.1424,42.2531,0,52.6781,55.0044,36.5778,228.6558,120.9733]
["E9168","Carregadeira de pneus com implemento de garfo - 195 kW",1875079.584,131.2556,34.7077,0,131.2556,79.4508,31.136,407.8057,197.0993]
["E9200","Carregadeira de pneus para rocha com capacidade de 2,50 m³ - 105 kW com periculosidade",712765.1981,71.2765,14.1357,0,71.2765,101.6054,38.5026,296.7967,123.9148]
["E9203","Escavadeira hidráulica com martelo hidráulico de 1.700 kg - 103 kW com periculosidade",2275311.2752,260.0356,45.1243,0,325.0445,68.1953,38.5026,736.9023,343.6625]
["E9204","Perfuratriz sobre esteiras - 145 kW com periculosidade",1965011.146,131.0007,35.362,0,131.0007,110.7728,38.5026,446.6388,204.8653]
["E9205","Equipamento de corte a plasma CNC - 12.000 x 5.500 mm - 19,5 kW",1075636.6302,86.0509,19.91,0,64.5382,0,0,170.4991,105.9609]
["E9206","Equipamento de solda MIG automática com acessórios - 14,6 kVA",87345.0097,6.9876,1.6168,0,6.9876,0,0,15.592,8.6044]
["E9207","Máquina de solda elétrica retificadora 425 A - 18,70 kW",4538.5098,0.3631,0.084,0,0.3631,0,0,0.8102,0.4471]
["E9209","Martelete perfurador/rompedor a ar comprimido de 25 kg para rocha, com insalubridade, com capacidade de 2.040 gpm",20175.7396,1.6141,0.3735,0,1.6141,0,32.024,35.6257,34.0116]
["E9213","Jumbo eletro-hidráulico com 3 braços - 155 kW/237 kW com periculosidade",12062164.7309,804.1443,217.0687,0,1005.1804,165.7772,45.6386,2237.8092,1066.8516]
["E9242","Estação transmissora de superfície para televisionamento",11361.6811,0.7304,0.2003,0,0.4058,0,0,1.3365,0.9307]
["E9243","Câmara hiperbárica com filtro, serpentina e reservatório de ar para mergulho raso - D = 1,80 m e H = 2,22 m.",298078.6132,5.2164,4.8278,0,7.452,0,49.3512,66.8474,59.3954]
["E9244","Estação transmissora de superfície para comunicação sem fio",37767.8948,2.4279,0.6658,0,1.3489,0,0,4.4426,3.0937]
["E9245","Estação transmissora de superfície para comunicação com fio",6330.0794,0.4069,0.1116,0,0.2261,0,0,0.7446,0.5185]
["E9246","Painel de controle de ar com manômetros e pneufatômetros",12147.5394,0.7809,0.2141,0,0.4338,0,0,1.4288,0.995]
["E9247","Sistema de Sino aberto (sinete) para mergulho até 50 m  - 33,50 kW",550469.5855,14.6792,9.0571,0,14.6792,0,49.3512,87.7667,73.0875]
["E9248","Sistema de ar comprimido para mergulho até 30 m com pressão de trabalho de 1,4 MPa - 7,46 kW",50363.0422,3.3575,0.9063,0,3.3575,6.4589,0,14.0802,4.2638]
["E9249","Sistema de ar comprimido para mergulho até 50 m com pressão de trabalho de 1,7 MPa - 16,18 kW",77065.7419,5.1377,1.3869,0,5.1377,14.0088,0,25.6711,6.5246]
["E9251","Fonte de plasma para corte manual - 65A - 15 kW",32634.4672,2.6108,0.6041,0,2.6108,0,0,5.8257,3.2149]
["E9252","Serra de esquadria com braço telescópico - D = 250 mm (10\") - 1,80 kW",5248.7453,0.4724,0.0972,0,0.2624,0,0,0.832,0.5696]
["E9253","Rebordeadeira diâmetro máximo 3,00 m - 4,85 kW",76420.0224,3.0568,1.2967,0,2.6747,0,0,7.0282,4.3535]
["E9254","Dobradeira viradeira manual comprimento máximo de dobra de até 2.000 mm",18667.3606,0.7467,0.3167,0,0.6534,0,0,1.7168,1.0634]
["E9255","Fonte de plasma para corte manual - 45A - 10 kW",21888.2844,1.7511,0.4052,0,1.7511,0,0,3.9074,2.1563]
["E9256","Equipamento para pintura com cal rebocável com dois bicos aplicadores e capacidade de 2.200 l",66604.0039,3.8059,1.1741,0,3.8059,0,25.1582,33.9441,30.1382]
["E9501","Ventilador axial para ventilação forçada com velocidade de saída de 32,8 m/s - D = 1.000 mm - 30 kW",441324.527,39.7192,8.1689,0,26.4795,0,0,74.3676,47.8881]
["E9502","Bate-estaca de gravidade para 6 t - 119 kW",965788.6198,55.1879,17.0255,0,41.3909,78.7887,31.136,223.529,103.3494]
["E9503","Guilhotina hidráulica 16 x 6.100 mm - 30 kW",1328764.0551,53.1506,22.5458,0,46.5067,0,25.1582,147.3613,100.8546]
["E9505","Prensa dobradeira capacidade 320 t - comprimento até 3.100 mm - 30 kW",839972.17,33.5989,14.2522,0,29.399,0,25.1582,102.4083,73.0093]
["E9507","Plotadora de recorte com computador e programa computacional",87469.2044,13.1204,1.7989,0,8.7469,0,0,23.6662,14.9193]
["E9510","Ventilador centrífugo baixa pressão com capacidade de 58 m³/min - 3,68 kW",12912.1674,1.1621,0.239,0,0.7747,0,0,2.1758,1.4011]
["E9511","Carregadeira de pneus com capacidade de 3,40 m³ - 195 kW",1868409.6083,130.7887,34.5843,0,130.7887,79.4508,31.136,406.7485,196.509]
["E9512","Veículo leve - 53 kW",74357.9159,4.4615,1.3764,0.5577,4.4615,22.3494,27.8191,61.0256,34.2147]
["E9513","Compressor de ar portátil de 160,46 l/s (340 PCM) - 81 kW",289287.1716,19.2858,5.206,0,19.2858,70.1306,0,113.9082,24.4918]
["E9514","Distribuidor de agregados sobre pneus autopropelido - 130 kW",909322.0148,51.9613,16.03,0,45.4661,125.7971,31.136,270.3905,99.1273]
["E9515","Escavadeira hidráulica sobre esteiras com caçamba com capacidade de 1,56 m³ - 118 kW",1364490.9173,95.5144,25.2567,0,95.5144,78.1266,31.136,325.5481,151.9071]
["E9516","Perfuratriz hidráulica sobre esteiras - 283 kW",4921526.1388,328.1017,88.567,0,328.1017,144.1319,31.136,920.0383,447.8047]
["E9518","Grade de 24 discos rebocável de D = 60 cm (24\")",41617.3205,2.6754,0.7337,0,1.4863,0,0,4.8954,3.4091]
["E9519","Betoneira com motor a gasolina com capacidade de 600 l - 10 kW",38183.1111,3.0546,0.7068,0,2.291,16.3989,25.1582,47.6095,28.9196]
["E9521","Grupo gerador - 3,2 kVA",4011.1622,0.2006,0.0707,0,0.1433,3.8983,0,4.3129,0.2713]
["E9522","Caldeira de asfalto rebocável com capacidade de 1.500 l - 6,5 kW",194329.4528,12.4926,3.4258,0,4.1642,4.6346,0,24.7172,15.9184]
["E9523","Motoscraper - 304 kW",5799758.2375,272.9298,99.9861,0,307.046,247.7235,31.136,958.8214,404.0519]
["E9524","Motoniveladora - 93 kW",1383512.1732,69.1756,24.3893,0,88.9401,71.0474,31.136,284.6884,124.7009]
["E9525","Ponte rolante com capacidade de 15 t e vão de até 15 m - 20 kW",3187571.2513,127.5029,54.0851,0,79.6893,0,50.3164,311.5937,231.9044]
["E9526","Retroescavadeira de pneus - capacidade da caçamba da pá-carregadeira de 0,76 m³ e da retroescavadeira de 0,29 m³ - 58 kW ",520929.906,36.4651,9.6424,0,36.4651,38.4012,31.136,152.1098,77.2435]
["E9527","Martelete perfurador/rompedor a ar comprimido de 25 kg para rocha com capacidade de 2.040 gpm",20175.7396,1.6141,0.3735,0,1.6141,0,25.1582,28.7599,27.1458]
["E9528","Empilhadeira a diesel com capacidade de 4 t - 60 kW",504431.6813,40.3545,9.337,0,35.3102,45.837,25.1582,155.9969,74.8497]
["E9529","Jateador para estruturas metálicas com transportador a roletes - 22 kW",4045819.8443,269.7213,72.8079,0,202.291,0,25.1582,569.9784,367.6874]
["E9530","Rolo compactador liso vibratório autopropelido por pneus de 11 t - 97 kW",700734.7036,46.7156,12.6103,0,46.7156,79.0434,31.136,216.2209,90.4619]
["E9532","Equipamento de solda MIG com acessórios - 14,6 kVA",72529.2108,5.8023,1.3425,0,5.8023,0,0,12.9471,7.1448]
["E9535","Serra circular com bancada - D = 30 cm - 4 kW",7156.8871,0.6441,0.1325,0,0.3578,0,25.1582,26.2926,25.9348]
["E9536","Embarcação de transporte de pessoal e apoio logístico - 30 kW",115409.0406,1.8033,0.6799,0,2.0036,56.2248,37.3478,98.0594,39.831]
["E9538","Conjunto vibratório para meio tubo de concreto com encaixe PB e 3 jogos de fôrmas - D = 0,30 m - 2,20 kW",17034.6896,2.2713,0.5255,0,1.7035,0,0,4.5003,2.7968]
["E9539","Equipamento de batimetria monofeixe",98110.0734,6.3071,1.7295,0,3.5039,0,30.5299,42.0704,38.5665]
["E9540","Trator sobre esteiras com lâmina - 127 kW",1057549.3678,41.1269,18.1252,0,58.7527,90.5535,31.136,239.6943,90.3881]
["E9541","Trator sobre esteiras com lâmina - 259 kW",4837699.4928,188.1328,82.9128,0,268.7611,184.6722,31.136,755.6149,302.1816]
["E9543","Compressor de ar respirável para recarga de cilindros de mergulho com capacidade de até 35 MPa e 3,58 l/s - 5,52 kW",50770.9942,3.3847,0.9137,0,3.3847,0,0,7.6831,4.2984]
["E9544","Vassoura mecânica rebocável com largura de 2,44 m",74244.0148,6.682,1.3743,0,4.4546,0,0,12.5109,8.0563]
["E9545","Vibroacabadora de asfalto sobre esteiras - 82 kW",1979998.4687,98.9999,34.9045,0,127.2856,79.3489,36.5778,377.1167,170.4822]
["E9547","Máquina de solda elétrica transformadora 250 A - 9,20 kW",929.6119,0.0744,0.0172,0,0.0744,0,0,0.166,0.0916]
["E9548","Bomba centrífuga com capacidade de 7,1 a 22 m³/h - 1,50 kW",2447.7607,0.1958,0.0453,0,0.1713,0,0,0.4124,0.2411]
["E9551","Obturador mecânico simples com extensão de 12 m",5074.1888,0.4567,0.0939,0,0.2537,0,0,0.8043,0.5506]
["E9552","Nível ótico com capacidade de aumento de 32x",14214.2324,1.1371,0.2631,0,0.7107,0,0,2.1109,1.4002]
["E9553","Estação total eletrônica com alcance máximo de 3.000 m",32005.9395,2.8805,0.5924,0,1.6003,0,0,5.0732,3.4729]
["E9556","Compactador manual de placa vibratória - 3,00 kW",10363.5668,0.6909,0.1865,0,0.6909,4.9197,0,6.488,0.8774]
["E9558","Tanque de estocagem de asfalto com capacidade de 30.000 l",701373.701,29.2239,10.1425,0,18.2649,0,0,57.6313,39.3664]
["E9559","Aquecedor de fluido térmico - 12 kW",687055.0522,30.9175,9.538,0,20.6117,9.1674,0,70.2346,40.4555]
["E9560","Ônibus com capacidade para 80 passageiros - 175 kW",1008889.5379,43.2381,17.7853,7.2064,64.8572,169.3423,30.9429,333.3722,99.1727]
["E9561","GPS geodésico de simples frequência (L1)",27839.7829,2.2272,0.5153,0,1.392,0,0,4.1345,2.7425]
["E9562","GPS geodésico de dupla frequência (L1/L2)",60182.7519,4.8146,1.114,0,3.0091,0,0,8.9377,5.9286]
["E9563","Perfuratriz hidráulica sobre esteiras com clamshell - 220 kW",2873451.5586,191.5634,51.7102,0,191.5634,112.046,31.136,578.019,274.4096]
["E9565","Trator sobre esteiras com lâmina e escarificador - 259 kW",4848486.0568,188.5522,83.0977,0,269.3603,184.6722,31.136,756.8184,302.7859]
["E9566","Guindaste móvel sobre esteiras com clamshell de 1,9 m³ - 220 kW",4071010.7233,142.4854,69.0749,0,203.5505,56.023,36.5778,507.7116,248.1381]
["E9567","Fresadora de piso de concreto - 6,7 kW",18875.8828,1.5101,0.3494,0,1.5101,10.9873,0,14.3569,1.8595]
["E9568","Furadeira de impacto de 12,5 mm - 0,80 kW",1384.3011,0.1107,0.0256,0,0.0692,0,0,0.2055,0.1363]
["E9569","Guindaste móvel sobre esteiras com clamshell de 4,6 m³ - 403 kW",6071578.9234,73.7865,35.7707,0,105.4094,102.624,73.1556,390.7462,182.7128]
["E9570","Furadeira com base magnética - 1,20 kW",6707.1386,0.3833,0.1182,0,0.2874,0,0,0.7889,0.5015]
["E9574","Perfuratriz sobre esteiras - 145 kW",1965011.146,131.0007,35.362,0,131.0007,110.7728,31.136,439.2722,197.4987]
["E9576","Escavadeira hidráulica de longo alcance sobre esteiras - 103 kW",1307451.6959,91.5216,24.2009,0,91.5216,68.1953,31.136,306.5754,146.8585]
["E9577","Trator agrícola sobre pneus - 77 kW",208629.9538,13.9087,3.7545,0,12.1701,70.589,25.1582,125.5805,42.8214]
["E9578","Conjunto vibratório para meio tubo de concreto com encaixe PB e 3 jogos de fôrmas - D = 0,40 m - 2,20 kW",18215.4097,2.4287,0.5619,0,1.8215,0,0,4.8121,2.9906]
["E9580","Fresadora e distribuidora com controle de greide - 287 kW",2752958.4841,160.5892,49.5418,0,229.4132,263.1044,36.5778,739.2264,246.7088]
["E9581","Carregadeira de pneus para rocha com capacidade de 1,72 m³ - 113 kW",733563.8028,73.3564,14.5481,0,73.3564,109.3467,31.136,301.7436,119.0405]
["E9583","Distribuidor de agregados rebocável com capacidade de 1,9 m³",83002.0024,7.4702,1.5364,0,4.9801,0,0,13.9867,9.0066]
["E9584","Carregadeira de pneus com capacidade de 1,72 m³ - 113 kW",733563.8028,51.3495,13.5783,0,51.3495,46.0407,31.136,193.454,96.0638]
["E9585","Motosserra com motor a gasolina - 2,30 kW",1842.8511,1.3821,0.1895,0,1.3821,3.7717,25.1582,31.8836,26.7298]
["E9586","Régua vibratória dupla com 4 m - 4,10 kW",4815.5349,0.4334,0.0891,0,0.3371,6.7235,0,7.5831,0.5225]
["E9587","Serra para corte de concreto - 4 kW",11800.1507,0.944,0.2184,0,0.826,6.5596,0,8.548,1.1624]
["E9588","Vibroacabadora de concreto sobre esteiras com fôrmas deslizantes - 205 kW",4425193.0377,221.2597,78.0098,0,284.4767,198.3724,36.5778,818.6964,335.8473]
["E9589","Máquina texturizadora e aplicadora de cura química em pavimento de concreto - 44,80 kW",1134666.9807,56.7333,20.0026,0,56.7333,34.225,31.136,198.8302,107.8719]
["E9590","Central de concreto com capacidade de 40 m³/h - dosadora fixa",427477.845,24.4273,7.5358,0,21.3739,0,36.5778,89.9148,68.5409]
["E9591","Serra para corte de concreto e asfalto - 10 kW",18335.5853,1.4668,0.3394,0,1.2835,16.3989,0,19.4886,1.8062]
["E9593","Draga hopper com capacidade de 750 m³",118589703.7891,926.4821,666.9127,0,2058.849,611.16,169.6605,4433.0643,1763.0553]
["E9594","Draga hopper com capacidade de 1.000 m³",130762798.697,1021.5844,735.3705,0,2270.1875,733.392,194.1294,4954.6638,1951.0843]
["E9595","Draga hopper com capacidade de 2.000 m³",179455178.3287,1401.9936,1009.2017,0,3115.5413,1283.436,194.1294,7004.302,2605.3247]
["E9596","Draga hopper com capacidade de 3.000 m³",228147557.9604,1782.4028,1283.0329,0,3960.8951,1833.48,347.7137,9207.5245,3413.1494]
["E9597","Draga hopper com capacidade de 4.000 m³",276839937.592,2162.812,1556.8642,0,4806.2489,2383.524,398.6958,11308.1449,4118.372]
["E9598","Draga hopper com capacidade de 5.000 m³",325532317.2235,2543.2212,1830.6954,0,5651.6027,2933.568,398.6958,13357.7831,4772.6124]
["E9599","Central de concreto com capacidade de 30 m³/h - dosadora RS",282737.3255,16.1564,4.9843,0,14.1369,0,36.5778,71.8554,57.7185]
["E9601","Embarcação de transporte de pessoal e apoio logístico - 130 kW",525075.0102,8.2043,3.0935,0,9.1159,243.6408,37.3478,301.4023,48.6456]
["E9603","Embarcação empurradora multipropósito com guindaste hidráulico de 74 kN.m - 165 kW",2163220.2791,28.1669,12.5515,0,62.5932,159.6656,139.0418,402.019,179.7602]
["E9606","Embarcação rebocadora - 2 x 268 kW",1141489.9457,14.8632,6.6232,0,33.0292,519.6388,139.0418,713.1962,160.5282]
["E9607","Conjunto de britagem para rachão com capacidade de 80 m³/h - 224 kW",2541449.7528,145.2257,44.8021,0,108.9193,0,36.5778,335.5249,226.6056]
["E9609","Draga de sucção para extração de areia com tubo de descarga de 150 mm - 100 kW",651136.5691,5.087,3.6618,0,11.3045,76.395,40.4159,136.8642,49.1647]
["E9610","Compressor de ar portátil de 42,48 l/s (90 PCM) - 18,50 kW",114901.1986,7.6601,2.0677,0,7.6601,16.0175,0,33.4054,9.7278]
["E9611","Conjunto de britagem com capacidade de 80 m³/h - 313 kW",9044099.3528,516.8057,159.4346,0,387.6043,0,36.5778,1100.4224,712.8181]
["E9612","Plataforma flutuante montada na obra de 12 x 24 x 1,8 m com capacidade de 150 t",731336.8559,5.7136,4.1128,0,9.5226,0,48.9378,68.2868,58.7642]
["E9613","Guindaste móvel sobre esteiras com pinça com capacidade de 40 t - 186 kW",7209598.9168,252.336,122.3289,0,360.4799,47.3649,36.5778,819.0875,411.2427]
["E9614","Bomba com capacidade de 136 m³/h e câmara de vácuo - 5,60 kW",9789.1934,0.7831,0.1812,0,0.6852,0,0,1.6495,0.9643]
["E9615","Usina misturadora de solos com capacidade de 300 t/h - 44 kW",1484850.9373,84.8486,26.1758,0,74.2425,0,31.136,216.4029,142.1604]
["E9617","Usina misturadora de pré-misturado a frio com capacidade de 60 t/h - 23,50 kW",233071.1732,13.3184,4.1087,0,11.6536,0,31.136,60.2167,48.5631]
["E9618","Batelão autopropelido com capacidade de 300 m³ - 224 kW",21928803.1019,171.3188,123.321,0,380.7084,68.4499,112.5286,856.3267,407.1684]
["E9619","Batelão autopropelido com capacidade de 500 m³ - 373 kW",26901506.6002,210.168,151.2859,0,467.04,113.9813,112.5286,1055.0038,473.9825]
["E9620","Pontão flutuante de 15 x 30 x 1,8 m com capacidade de 500 t",3609501.5442,28.1992,20.2987,0,46.9987,0,24.4689,119.9655,72.9668]
["E9621","Bomba de injeção de argamassa e nata com capacidade de 1,08 m³/h (18 l/min) e misturador com tambor de 0,100 m³ - 6,20 kW",45243.7066,3.6195,0.8375,0,3.6195,0,25.1582,33.2347,29.6152]
["E9622","Máquina de bancada universal para corte de chapa - 1,50 kW",95229.6102,5.4417,1.6788,0,4.0813,0,0,11.2018,7.1205]
["E9623","Máquina de bancada guilhotina - 4,00 kW",127976.3066,7.3129,2.256,0,5.4847,0,0,15.0536,9.5689]
["E9624","Draga hopper com capacidade de 10.000 m³",568994215.3817,4445.2673,3199.8516,0,9878.3718,5011.512,535.6933,23070.696,8180.8122]
["E9625","Draga hopper com capacidade de 15.000 m³",812456113.5398,6347.3134,4569.0078,0,14105.1409,7211.688,560.8094,32793.9595,11477.1306]
["E9626","Draga hopper com capacidade de 20.000 m³",1055918011.6978,8249.3595,5938.1639,0,18331.9099,9472.98,585.2783,42577.6916,14772.8017]
["E9627","Embarcação hotel com capacidade para 15 pessoas - 199 kW",2371026.6026,24.6982,11.0058,0,54.8849,192.5663,50.9821,334.1373,86.6861]
["E9628","Fábrica de pré-moldado de concreto para balizador - 2,20 kW",14599.1457,1.9466,0.4504,0,1.4599,0,0,3.8569,2.397]
["E9629","Compressor de ar portátil de 185,95 l/s (394 PCM) - 81,50 kW",303549.7751,20.2367,5.4626,0,20.2367,70.5635,0,116.4995,25.6993]
["E9630","Bomba submersível com capacidade de 75 m³/h - 3,6 kW",4481.9683,0.3586,0.083,0,0.3137,0,0,0.7553,0.4416]
["E9631","Bomba para concreto projetado via seca com capacidade de 6 m³/h - 7,5 kW",231172.126,18.4938,4.279,0,16.182,0,36.5778,75.5326,59.3506]
["E9632","Conjunto vibratório para tubos de concreto com encaixe PB e 3 jogos de fôrmas - D = 0,20 m - 2,20 kW",51587.2518,6.8783,1.5915,0,5.1587,0,0,13.6285,8.4698]
["E9633","Conjunto vibratório para tubos de concreto com encaixe PB e 3 jogos de fôrmas - D = 0,30 m - 2,20 kW",59160.1467,7.888,1.8251,0,5.916,0,0,15.6291,9.7131]
["E9634","Conjunto vibratório para tubos de concreto com encaixe PB e 3 jogos de fôrmas - D = 0,40 m - 2,20 kW",65063.7475,8.6752,2.0072,0,6.5064,0,0,17.1888,10.6824]
["E9635","Draga de sucção e recalque com potência da bomba de 294 kW e cortador de 30 kW",4412897.8016,34.4758,24.8168,0,76.6128,224.6013,64.8848,425.3915,124.1774]
["E9636","Draga de sucção e recalque com potência da bomba de 483 kW e cortador de 55 kW",7433577.9988,58.0748,41.8042,0,129.0552,368.9879,64.8848,662.8069,164.7638]
["E9637","Draga de sucção e recalque com potência da bomba de 746 kW e cortador de 110 kW",13983419.3641,109.2455,78.6385,0,242.7677,569.9067,89.3537,1089.9121,277.2377]
["E9638","Draga de sucção e recalque com potência da bomba de 1.350 kW e cortador de 170 kW",21371219.2141,166.9627,120.1853,0,371.0281,1031.3325,89.3537,1778.8623,376.5017]
["E9639","Embarcação hotel com capacidade para 30 pessoas - 2 x 112 kW",3784124.216,39.418,17.5651,0,87.5955,216.7581,139.0418,500.3785,196.0249]
["E9640","Compressor de ar portátil de 33,51 l/s (71 PCM) - 14 kW",92360.1524,6.1573,1.6621,0,6.1573,12.1213,0,26.098,7.8194]
["E9641","Compressor de ar portátil de 75,04 l/s (159 PCM) - 33 kW",138718.4116,9.2479,2.4964,0,9.2479,28.5717,0,49.5639,11.7443]
["E9642","Perfuratriz hidráulica sobre esteiras para estaca raiz - 56 kW",1480225.8424,98.6817,26.6379,0,98.6817,28.5208,31.136,283.6581,156.4556]
["E9643","Equipamento para pintura a ar comprimido de pistola com caneca com capacidade de 1.000 ml e compressor de 1,50 kW",3056.2625,0.2751,0.0566,0,0.1528,0,0,0.4845,0.3317]
["E9646","Compressor de ar portátil de 58,52 l/s (124 PCM) - 27 kW",134727.2081,8.9818,2.4245,0,8.9818,23.3769,0,43.765,11.4063]
["E9647","Compactador manual com soquete vibratório - 4,10 kW",13528.2972,0.9019,0.2435,0,0.9019,6.7235,0,8.7708,1.1454]
["E9648","Compressor de ar portátil de 422,86 l/s (896 PCM) - 213 kW",660319.425,44.0213,11.883,0,44.0213,184.4175,0,284.3431,55.9043]
["E9649","Compressor de ar portátil de 94,39 l/s (200 PCM) - 36 kW",164254.3934,10.9503,2.9559,0,10.9503,31.1692,0,56.0257,13.9062]
["E9651","Guindaste móvel sobre esteiras com Hammer Grab - 186 kW",4099592.4155,143.4857,69.5598,0,204.9796,47.3649,36.5778,501.9678,249.6233]
["E9652","Compressor de ar portátil de 540,85 l/s (1.146 PCM) - 331,10 kW",916038.1028,61.0692,16.4849,0,61.0692,286.6697,0,425.293,77.5541]
["E9653","Guindaste móvel sobre esteiras com trado para escavação em solos - 186 kW",5513118.6776,192.9592,93.5438,0,275.6559,47.3649,36.5778,646.1016,323.0808]
["E9654","Guindaste móvel sobre esteiras com trado com bits escavação em rocha - 186 kW",5513118.6776,192.9592,93.5438,0,275.6559,47.3649,36.5778,646.1016,323.0808]
["E9656","Guindaste móvel sobre esteiras com caçamba para escavação em solos - 186 kW",5496087.0034,192.363,93.2549,0,274.8044,47.3649,36.5778,644.365,322.1957]
["E9657","Guindaste móvel sobre esteiras com caçamba para escavação em rocha - 186 kW",5496087.0034,192.363,93.2549,0,274.8044,47.3649,36.5778,644.365,322.1957]
["E9660","Guindaste móvel sobre esteiras com capacidade de 40 t - 186 kW",3572918.9048,125.0522,60.6235,0,178.6459,47.3649,36.5778,448.2643,222.2535]
["E9661","Compressor de ar portátil de 89,67 l/s (190 PCM) - 36 kW",146566.1461,9.7711,2.6376,0,9.7711,31.1692,0,53.349,12.4087]
["E9662","Equipamento para solda e corte com oxiacetileno",5961.1546,0.4769,0.1103,0,0.4769,0,0,1.0641,0.5872]
["E9664","Guindaste móvel sobre esteiras com capacidade de 80 t - 212 kW",6114714.7772,214.015,103.7514,0,305.7357,53.9858,36.5778,714.0657,354.3442]
["E9668","Mesa vibratória - 2,20 kW",13709.0348,1.8279,0.4229,0,1.3709,0,0,3.6217,2.2508]
["E9671","Compressor de ar portátil de 363,87 l/s (771 PCM) - 158,13 kW",562851.7128,37.5234,10.129,0,37.5234,136.9105,0,222.0863,47.6524]
["E9673","Equipamento de batimetria multifeixe",1906418.7734,61.2777,16.8037,0,68.0864,0,61.0598,207.2276,139.1412]
["E9674","Equipamento de medição de descarga líquida com ADCP",391888.7734,12.5964,3.4542,0,13.996,0,61.0598,91.1064,77.1104]
["E9675","Martelete perfurador/rompedor elétrico - 1,50 kW",5212.1089,0.417,0.0965,0,0.417,0,0,0.9305,0.5135]
["E9676","Embarcação de transporte de pessoal e apoio logístico - 90 kW",495942.5858,7.7491,2.9218,0,8.6101,168.6744,37.3478,225.3032,48.0187]
["E9677","Martelete perfurador/rompedor a ar comprimido de 10 kg com capacidade de 1.800 gpm",13024.1935,1.0419,0.2411,0,1.0419,0,25.1582,27.4831,26.4412]
["E9678","Fresadora a frio - 410 kW",5752177.8257,335.5437,103.5152,0,479.3482,375.8634,36.5778,1330.8483,475.6367]
["E9681","Rolo compactador liso tandem vibratório autopropelido de 10,4 t - 82 kW",781059.0813,52.0706,14.0558,0,52.0706,112.759,31.136,262.092,97.2624]
["E9682","Rolo compactador liso tandem vibratório autopropelido de 1,6 t - 18 kW",264253.5715,17.6169,4.7555,0,17.6169,24.752,31.136,95.8773,53.5084]
["E9683","Martelete perfurador/rompedor elétrico - 0,90 kW",4980.6388,0.3985,0.0922,0,0.3985,0,0,0.8892,0.4907]
["E9684","Veículo leve picape 4 x 4 com capacidade de 1,10 t - 147 kW",327743.2543,19.6646,6.0665,2.4581,19.6646,37.4336,27.8191,113.1065,56.0083]
["E9685","Rolo compactador pé de carneiro vibratório autopropelido por pneus de 11,6 t - 82 kW",640866.1188,42.7244,11.5329,0,42.7244,66.8202,31.136,194.9379,85.3933]
["E9689","Usina de asfalto a quente gravimétrica com capacidade de 100/140 t/h - 260 kW",8100921.7255,405.0461,142.8077,0,520.7735,0,36.5778,1105.2051,584.4316]
["E9691","Guincho tracionador de cordoalhas - 7,50 kW",391512.823,31.321,7.2469,0,19.5756,0,25.1582,83.3017,63.7261]
["E9692","Caldeira para aquecimento e injeção de cera - 1 kW",108546.4678,6.978,1.9135,0,2.326,0,25.1582,36.3757,34.0497]
["E9694","Misturador de argamassa de alta turbulência com capacidade de 220 l - 13 kW",25221.9205,2.0178,0.4669,0,1.7655,0,25.1582,29.4084,27.6429]
["E9697","Minicarregadeira de pneus com vassoura de 1,8 m - 45,50 kW",380387.2217,26.6271,7.041,0,26.6271,57.9329,31.136,149.3641,64.8041]
["E9699","Trituradora de galhos e troncos rebocável com capacidade de até 350 mm de diâmetro com guincho - 96,94 kW",391508.0766,44.0447,13.5878,0,48.9385,74.0573,25.1582,205.7865,82.7907]
["E9700","Fresadora a frio - 155 kW",2924668.7639,170.6057,52.6319,0,243.7224,142.0947,36.5778,645.6325,259.8154]
["E9701","Jateador pressurizado multiabrasivo com capacidade de 280 l",24511.1874,2.206,0.4537,0,2.206,0,25.1582,30.0239,27.8179]
["E9703","Fábrica de pré-moldado de concreto para mourão - 2,20 kW",14599.1457,1.9466,0.4504,0,1.4599,0,0,3.8569,2.397]
["E9704","Batelão sem propulsão montado na obra com capacidade de 66 m³",244526.3983,1.9104,1.3751,0,3.1839,0,24.4689,30.9383,27.7544]
["E9705","Misturador de lama bentonítica - 4 kW",15823.8105,1.2659,0.2929,0,1.1077,0,25.1582,27.8247,26.717]
["E9706","Martelete perfurador/rompedor a ar comprimido de 28 kg para concreto com capacidade de 1.230 gpm",17977.1016,1.4382,0.3328,0,1.4382,0,25.1582,28.3674,26.9292]
["E9707","Desarenador - 15 kW",14678.0172,1.1742,0.2717,0,1.1742,0,25.1582,27.7783,26.6041]
["E9708","Microtrator com roçadeira - 10 kW",51199.5827,3.4133,0.9214,0,2.9866,7.6395,25.1582,40.119,29.4929]
["E9710","Socadora automática de linha - 253 kW",31916152.824,1276.6461,541.5373,0,1276.6461,154.6235,73.1556,3322.6086,1891.339]
["E9712","Reguladora e distribuidora de lastro - 300 kW",15969252.6728,638.7701,270.9583,0,638.7701,183.348,73.1556,1805.0021,982.884]
["E9714","Bate-estaca com martelo hidráulico - 450 kW",3264176.8918,186.5244,57.5428,0,139.8933,297.9405,31.136,713.037,275.2032]
["E9716","Conjunto bomba e macaco hidráulico para protensão com capacidade de 590 kN - 3,70 kW",15418.3658,0.881,0.2718,0,0.881,0,36.5778,38.6116,37.7306]
["E9717","Máquina policorte - 2,20 kW",963.4465,0.0867,0.0178,0,0.0482,0,0,0.1527,0.1045]
["E9718","Pórtico duplo de descarga e posicionamento de dormente - 89 kW",9748621.6121,389.9449,165.4097,0,292.4586,54.3932,73.1556,975.362,628.5102]
["E9719","Talha manual com capacidade de 3 t",6641.9869,0.2657,0.1127,0,0.166,0,0,0.5444,0.3784]
["E9720","Conjunto bomba e macaco hidráulico para protensão com capacidade de 250 kN - 3,70 kW",12188.8993,0.6965,0.2149,0,0.6965,0,36.5778,38.1857,37.4892]
["E9721","Conjunto bomba e macaco hidráulico para protensão com capacidade de 1.150 kN - 5 kW",25323.201,1.447,0.4464,0,1.447,0,36.5778,39.9182,38.4712]
["E9722","Conjunto bomba e macaco hidráulico para protensão com capacidade de 2.000 kN - 5 kW",40402.2551,2.3087,0.7122,0,2.3087,0,36.5778,41.9074,39.5987]
["E9723","Conjunto bomba e macaco hidráulico para protensão com capacidade de 2.500 kN - 7 kW",47785.3367,2.7306,0.8424,0,2.7306,0,36.5778,42.8814,40.1508]
["E9724","Conjunto bomba e macaco hidráulico para protensão com capacidade de 4.000 kN - 10 kW",51093.0557,2.9196,0.9007,0,2.9196,0,36.5778,43.3177,40.3981]
["E9725","Conjunto bomba e macaco hidráulico para protensão com capacidade de 5.400 kN - 10 kW",54845.726,3.134,0.9669,0,3.134,0,36.5778,43.8127,40.6787]
["E9726","Bate-estaca Strauss - 15 kW",143153.7335,8.1802,2.5236,0,6.1352,9.9314,31.136,57.9064,41.8398]
["E9727","Posicionadora de trilhos - 7,40 kW",557463.7113,31.8551,9.8273,0,27.8732,4.5226,0,74.0782,41.6824]
["E9728","Tirefonadora/parafusadora portátil - 3,10 kW",51336.1743,4.1069,0.9502,0,4.1069,4.0669,0,13.2309,5.0571]
["E9729","Equipamento para pintura eletrostática com cabine simples de 5,50 kW e estufa de 2x120.000 kCal",152715.0649,11.6354,3.1408,0,11.6354,0,0,26.4116,14.7762]
["E9730","Grupo vibrador com gerador - 2,80 kW",70232.7553,3.5116,1.2381,0,2.5083,3.6734,0,10.9314,4.7497]
["E9731","Máquina de furar dormente portátil - 1,50 kW",67896.317,5.4317,1.2568,0,5.4317,1.9679,0,14.0881,6.6885]
["E9732","Máquina para furar dormente - 6,70 kW",77990.2179,6.2392,1.4436,0,6.2392,8.7898,0,22.7118,7.6828]
["E9733","Máquina tirefonadora e parafusadora - 6,70 kW",81039.1638,6.4831,1.5,0,6.4831,8.7898,0,23.256,7.9831]
["E9734","Bomba projetora de argamassa com capacidade de 2 m³/h - 5,50 kW",176592.9426,14.1274,3.2687,0,12.3615,0,25.1582,54.9158,42.5543]
["E9735","Máquina para serrar trilho - 5,00 kW",25402.3012,2.0322,0.4702,0,2.0322,6.5596,0,11.0942,2.5024]
["E9736","Máquina para furar trilho - 1,20 kW",42887.9568,3.431,0.7939,0,3.431,1.5743,0,9.2302,4.2249]
["E9737","Conjunto para pré-aquecimento de trilho em solda aluminotérmica",3730.5824,0.2984,0.0691,0,0.2984,0,0,0.6659,0.3675]
["E9738","Máquina de esmerilhar topo e lateral de boleto - 5,20 kW",83710.8181,6.6969,1.5495,0,6.6969,6.8219,0,21.7652,8.2464]
["E9742","Trator agrícola sobre pneus com roçadeira articulada e capacidade de 1,12 m - 77 kW",471439.4067,31.4293,8.4839,0,27.5006,70.589,25.1582,163.161,65.0714]
["E9745","Trator agrícola sobre pneus com roçadeira de arraste e capacidade de 1,50 m - 77 kW",230664.1807,15.3776,4.151,0,13.4554,70.589,25.1582,128.7312,44.6868]
["E9746","Conjunto bomba e prensa para luva de emenda de 25 mm",25557.0131,2.0446,0.4731,0,1.2779,0,25.1582,28.9538,27.6759]
["E9747","Conjunto bomba e prensa para luva de emenda de 32 mm",26834.8547,2.1468,0.4967,0,1.3417,0,25.1582,29.1434,27.8017]
["E9748","Rosqueadeira para rosca cônica - 0,75 kW",6237.8847,0.3565,0.11,0,0.3565,0,25.1582,25.9812,25.6247]
["E9749","Jateador portátil multiabrasivo com capacidade de 300 kg",7661.9159,0.6896,0.1418,0,0.6896,0,25.1582,26.6792,25.9896]
["E9750","Bomba de injeção de argamassa com capacidade de 50 l/min",38083.7515,3.0467,0.7049,0,2.6659,0,0,6.4175,3.7516]
["E9753","Grupo gerador - 23 kVA",80810.5722,4.0405,1.4246,0,2.8861,17.4181,0,25.7693,5.4651]
["E9754","Grupo gerador - 68 kVA",111700,5.585,1.9691,0,3.9893,52.2542,0,63.7976,7.5541]
["E9755","Bomba de alta pressão para jet grouting de até 45 MPa - 150 kW",1534514.73,122.7612,28.4039,0,122.7612,145.1505,25.1582,444.235,176.3233]
["E9756","Calandra para chapas de aço até 25 mm - 22 kW",825265.1533,33.0106,14.0027,0,28.8843,0,25.1582,101.0558,72.1715]
["E9758","Vibroacabadora de asfalto sobre pneus - 82 kW",1544213.6917,88.2408,27.2223,0,99.2709,79.3489,36.5778,330.6607,152.0409]
["E9760","Perfuratriz manual para coroa diamantada - 1,60 kW",16233.9679,1.2987,0.3005,0,1.2987,0,0,2.8979,1.5992]
["E9761","Guincho de coluna com capacidade de 200 kg - 0,92 kW",3902.3643,0.3122,0.0722,0,0.2341,0,0,0.6185,0.3844]
["E9762","Rolo compactador de pneus autopropelido de 27 t - 85 kW",1040120.9367,69.3414,18.7178,0,69.3414,56.2777,31.136,244.8143,119.1952]
["E9763","Grupo gerador - 40 kVA",106516.4355,5.3258,1.8777,0,3.8042,30.9654,0,41.9731,7.2035]
["E9764","Grupo gerador - 7,2 kVA",7613.1403,0.3807,0.1342,0,0.2719,8.7711,0,9.5579,0.5149]
["E9765","Grupo gerador - 569 kVA",456714.2528,22.8357,8.0512,0,16.3112,440.2899,0,487.488,30.8869]
["E9766","Prensa hidráulica para fabricação de blocos pré-moldados - 20 kW",382489.5867,25.9547,6.7427,0,21.8565,0,25.1582,79.7121,57.8556]
["E9767","Compressor de ar portátil de 9,44 l/s (20 PCM) a gasolina - 5,22 kW",9483.9342,0.6323,0.1707,0,0.6323,8.5602,0,9.9955,0.803]
["E9768","Compressor de ar portátil de 373,78 l/s (792 PCM) - 213,30 kW",564265.0298,37.6177,10.1544,0,37.6177,184.6773,0,270.0671,47.7721]
["E9769","Cunha hidráulica com três cilindros e acessórios com capacidade de 3.000 kN - 5,60 kW",252008.3192,20.1607,4.6647,0,20.1607,5.419,25.1582,75.5633,49.9836]
["E9770","Retroescavadeira de pneus com caçamba de escavação trapezoidal ou triangular com seção de corte inferior a 0,10 m² - 58 kW",520929.906,36.4651,9.6424,0,36.4651,38.4012,31.136,152.1098,77.2435]
["E9771","Retroescavadeira de pneus com caçamba de escavação trapezoidal ou triangular com seção de corte de 0,10 a 0,15 m² - 58 kW",520929.906,36.4651,9.6424,0,36.4651,38.4012,31.136,152.1098,77.2435]
["E9772","Retroescavadeira de pneus com caçamba de escavação trapezoidal ou triangular com seção de corte de 0,15 a 0,20 m² - 58 kW",520929.906,36.4651,9.6424,0,36.4651,38.4012,31.136,152.1098,77.2435]
["E9773","Retroescavadeira de pneus com caçamba de escavação trapezoidal ou triangular com seção de corte de 0,20 a 0,30 m² - 58 kW",520929.906,36.4651,9.6424,0,36.4651,38.4012,31.136,152.1098,77.2435]
["E9774","Retroescavadeira de pneus com caçamba de escavação trapezoidal ou triangular com seção de corte de 0,30 a 0,50 m² - 58 kW",520929.906,36.4651,9.6424,0,36.4651,38.4012,31.136,152.1098,77.2435]
["E9775","Escavadeira hidráulica com martelo hidráulico de 1.700 kg - 103 kW",2275311.2752,260.0356,45.1243,0,325.0445,68.1953,31.136,729.5357,336.2959]
["E9776","Grupo gerador - 174 kVA",189460.2066,9.473,3.3399,0,6.7664,134.5061,0,154.0854,12.8129]
["E9777","Extrusora de barreira de concreto - 74 kW",4608131.2528,322.5692,85.2965,0,414.7318,56.5323,31.136,910.2658,439.0017]
["E9778","Grupo gerador - 338 kVA",260165.2132,13.0083,4.5863,0,9.2916,261.2709,0,288.1571,17.5946]
["E9779","Grupo gerador - 113 kVA",125963.8132,6.2982,2.2206,0,4.4987,87.0903,0,100.1078,8.5188]
["E9780","Misturador automático para grauteamento com capacidade de 20 m³/h - 7 kW",247193.4664,19.7755,4.5756,0,19.7755,6.7737,25.1582,76.0585,49.5093]
["E9781","Misturador com bomba para grauteamento tipo Flex E ou similar - 25 kW",462957.6633,37.0366,8.5693,0,37.0366,0,25.1582,107.8007,70.7641]
["E9782","Perfuratriz pneumática com avanço de coluna de 33,5 kg com capacidade de 2.280 gpm",37988.6628,3.0391,0.7032,0,3.0391,0,25.1582,31.9396,28.9005]
["E9784","Plataforma autopropelida com alcance de 12 m com capacidade de 700 kg - 24 kW",581294.6762,38.753,10.4609,0,38.753,18.3348,25.1582,131.4599,74.3721]
["E9785","Guindaste móvel sobre pneus com 2 eixos com capacidade máxima de 55 t - 186 kW",2269946.6798,113.4973,40.0159,16.2139,145.9251,47.3649,30.9603,393.9774,200.6874]
["E9788","Misturador de argamassa com capacidade de 0,250 m³ - 3,70 kW",17368.7133,1.3895,0.3215,0,1.3895,3.5804,25.1582,31.8391,26.8692]
["E9789","Carro manual modelo plataforma de 150 x 80 cm com capacidade de 800 kg",2202.6909,0.3965,0.0815,0,0.2203,0,0,0.6983,0.478]
["E9790","Bomba para concreto projetado via úmida com capacidade de 10 m³/h - 14,70 kW",280967.9086,22.4774,5.2007,0,22.4774,14.2247,36.5778,100.958,64.2559]
["E9791","Bomba pneumática para injeção de resina com capacidade de 0,18 m³/h",47678.8532,3.8143,0.8825,0,3.3375,0,0,8.0343,4.6968]
["E9793","Robot para concreto projetado com capacidade de 30 m³/h - 70 kW - com compressor diesel",7250434.4528,580.0348,134.2055,0,580.0348,67.7369,36.5778,1398.5898,750.8181]
["E9795","Perfuratriz de superfície sobre pneus com martelo de topo e controle remoto via rádio - 60 kW",1433068.5393,95.5379,25.7893,0,95.5379,45.837,31.136,293.8381,152.4632]
["E9797","Jumbo eletro-hidráulico com 3 braços - 155 kW/237 kW",12062164.7309,804.1443,217.0687,0,1005.1804,165.7772,36.5778,2228.7484,1057.7908]
["E9798","Perfuratriz hidráulica rotopercussiva - 123 kW",1541021.6444,102.7348,27.732,0,102.7348,93.9659,31.136,358.3035,161.6028]
["E9013","Caminhão tanque de asfalto com capacidade de 31.000 l - 265 kW",{"$nulls":7},432.005,106.6963]
["A9335","Cavalo mecânico estradeiro 6 x 2, PBT 23.000 kg - 265 kW - condição de trabalho severa - motorista de caminhão",897654.5608,38.4709,15.8244,6.4118,57.7064,256.4326,30.9429,405.789,91.65]
["A9364","Tanque isotérmico de asfalto com capacidade de 31.000 l",279242.221,11.1697,3.8766,0,11.1697,0,0,26.216,15.0463]
["E9018","Cavalo mecânico com dolly intermediário e semirreboque de 4 eixos com capacidade de 53 t - 323 kW",{"$nulls":7},521.0857,170.5741]
["A9324","Cavalo mecânico estradeiro 6 x 4, PBT 23.000 kg - 323 kW - motorista de veículo especial",1145399.2339,49.0885,20.1918,8.1814,73.6328,230.3055,30.9603,412.3603,108.422]
["A9355","Semirreboque com 4 eixos",516545,34.4363,17.2634,0,38.7409,0,0,90.4406,51.6997]
["A9382","Dolly intermediário com 2 eixos para semirreboque",104432.36,6.9622,3.4902,0,7.8324,0,0,18.2848,10.4524]
["E9027","Caminhão distribuidor de cimento e cal com capacidade de 17 m³ - 210 kW",{"$nulls":7},432.1361,133.5202]
["A9333","Caminhão plataforma 8 x 2, PBTC 36.000 kg e distância entre eixos 4,8 m - 210 kW - motorista de caminhão",833152.3348,35.7065,14.6873,5.9511,53.5598,203.2107,30.9429,344.0583,87.2878]
["A9365","Distribuidor de cimento montado sobre chassi com capacidade de 17 m³",492846.116,37.1959,9.0365,0,41.8454,0,0,88.0778,46.2324]
["E9037","Plataforma de inspeção sob pontes montada em caminhão com capacidade de 500 kg e alcance de 15 m - 188 kW",{"$nulls":7},648.1702,273.973]
["A9334","Caminhão plataforma 8 x 2, PBT 29.000 kg e distância entre eixos 4,8 m - 188 kW - condição de trabalho severa - motorista de veículo especial",809627.9348,34.6983,14.2726,5.7831,52.0475,181.922,30.9603,319.6838,85.7143]
["A9378","Plataforma telescópica para inspeção de pontes montada sobre chassi com capacidade de 500 kg",2181320.388,124.6469,38.4536,0,140.2277,0,25.1582,328.4864,188.2587]
["E9041","Caminhão carroceria com guindauto com capacidade de 45 t.m - 188 kW",{"$nulls":7},390.6908,137.0425]
["A9313","Caminhão plataforma 6 x 2, PBT 23.000 kg e distância entre eixos 5,4 m - 188 kW - motorista de veículo especial",711138.1587,30.4773,12.5363,5.0796,45.716,181.922,30.9603,306.6915,79.0535]
["A9351","Carroceria de madeira com capacidade de 11 t",40141.7851,2.7684,0.7259,0,2.7684,0,0,6.2627,3.4943]
["A9373","Guindaste articulado montado sobre chassi com capacidade de 45 t.m",337008,23.2419,6.0946,0,23.2419,0,25.1582,77.7366,54.4947]
["E9082","Bate-estaca hidráulico para defensas montado em caminhão guindauto com capacidade de 20 t.m e carroceria de 4 t - 136 kW",{"$nulls":7},347.9977,154.4719]
["A9323","Caminhão plataforma 4 x 2, PBT 14.300 kg e distância entre eixos 4,8 m - 136 kW - condição de trabalho severa - motorista de caminhão",548252.2249,23.4965,9.6649,3.9161,35.2448,131.6031,30.9429,234.8683,68.0204]
["A9347","Carroceria de madeira com capacidade de 4 t",17692.92,1.2202,0.32,0,1.2202,0,0,2.7604,1.5402]
["A9372","Guindaste articulado montado sobre chassi com capacidade de 20 t.m",210128.5,14.4916,3.8001,0,14.4916,0,25.1582,57.9415,43.4499]
["A9379","Bate-estaca hidráulico para defensas metálicas montada sobre chassi",205615,11.6515,4.6517,0,10.9661,0,25.1582,52.4275,41.4614]
["E9097","Caminhão de resgate de veículos leves com plataforma com capacidade de 4 t - 115 kW",{"$nulls":7},210.4623,66.1965]
["A9326","Caminhão plataforma 4 x 2 PBT 9.600 kg e distância entre eixos 3,7 m - 115 kW - motorista de veículo especial",437854.5481,18.7652,7.7188,3.1275,28.1478,111.2821,30.9603,200.0017,60.5718]
["A9374","Plataforma hidráulica para resgate de veículos montada sobre chassi com capacidade de 4 t",75225,4.2986,1.3261,0,4.8359,0,0,10.4606,5.6247]
["E9098","Caminhão de resgate de veículos de porte médio com capacidade do guincho de 20 t - 136 kW",{"$nulls":7},285.0017,106.5323]
["A9306","Caminhão plataforma 4 x 2, PBT 16.000 kg e distância entre eixos 3,6 m - 136 kW - motorista de veículo especial",573566.7632,24.5814,10.1112,4.0969,36.8721,131.6031,30.9603,238.225,69.7498]
["A9375","Guincho rebocador para resgate de veículos montada sobre chassi com capacidade de 20 t",155465,8.8837,2.7406,0,9.9942,0,25.1582,46.7767,36.7825]
["E9099","Caminhão de resgate de veículos pesados com dois guinchos com capacidade de 35 t - 240 kW",{"$nulls":7},491.0623,162.1157]
["A9320","Caminhão plataforma 6 x 2, PBT 23.000 kg e distância entre eixos 4,8 m - 240 kW - motorista de veículo especial",907526.2323,38.894,15.9984,6.4823,58.341,232.2408,30.9603,382.9168,92.335]
["A9376","Guincho rebocador para resgate de veículos montada sobre chassi com capacidade de 35 t",596785,34.102,10.5205,0,38.3648,0,25.1582,108.1455,69.7807]
["E9100","Cavalo mecânico sem reboque - 210 kW",{"$nulls":7},264.3548,73.842]
["A9310","Cavalo mecânico 4 x 2, PBT 16.000 kg - 210 kW - motorista de caminhão",634334.1205,27.1857,11.1824,4.531,40.7786,149.7342,30.9429,264.3548,73.842]
["E9114","Painel com seta luminosa para montagem em caminhão",{"$nulls":7},5.5307,3.7861]
["A9380","Painel com seta luminosa montado sobre chassi",34891.7726,3.1403,0.6458,0,1.7446,0,0,5.5307,3.7861]
["E9115","Amortecedor retrátil (AMC) para montagem em caminhão",{"$nulls":7},77.1438,42.1685]
["A9381","Amortecedor retrátil montado em caminhão",388614.172,34.9753,7.1932,0,34.9753,0,0,77.1438,42.1685]
["E9145","Caminhão basculante para concreto com capacidade de 7 m³ - 188 kW",{"$nulls":7},280.6946,90.3698]
["A9316","Caminhão plataforma 8 x 2, PBT 29.000 kg e distância entre eixos 4,8 m - 188 kW - motorista de caminhão",809627.9348,34.6983,14.2726,5.7831,52.0475,134.0478,30.9429,271.7922,85.6969]
["A9340","Caçamba basculante para concreto com capacidade de 7 m³",49813.995,3.7595,0.9134,0,4.2295,0,0,8.9024,4.6729]
["E9146","Caminhão silo com capacidade de 30 m³ - 265 kW",{"$nulls":7},448.822,115.6606]
["A9335","Cavalo mecânico estradeiro 6 x 2, PBT 23.000 kg - 265 kW - condição de trabalho severa - motorista de caminhão",897654.5608,38.4709,15.8244,6.4118,57.7064,256.4326,30.9429,405.789,91.65]
["A9357","Semirreboque silo para cimento com capacidade de 30 m³",275825,19.0224,4.9882,0,19.0224,0,0,43.033,24.0106]
["E9169","Cavalo mecânico com dolly pneumático de 4 eixos e mesas de giro com capacidade de 57 t - 323 kW",{"$nulls":7},566.3043,196.423]
["A9324","Cavalo mecânico estradeiro 6 x 4, PBT 23.000 kg - 323 kW - motorista de veículo especial",1145399.2339,49.0885,20.1918,8.1814,73.6328,230.3055,30.9603,412.3603,108.422]
["A9385","Conjunto de duas mesas de giro para quinta roda ou reboque com capacidade de 100 t cada",325520.1194,21.7013,10.8792,0,24.414,0,0,56.9945,32.5805]
["A9389","Dolly pneumático com capacidade de 48 t e 4 eixos",553719.7908,36.9147,18.5058,0,41.529,0,0,96.9495,55.4205]
["E9170","Cavalo mecânico com dois dollys pneumáticos de 3 e 4 eixos e mesas de giro com capacidade de 77 t - 323 kW",{"$nulls":7},665.9915,251.9188]
["A9385","Conjunto de duas mesas de giro para quinta roda ou reboque com capacidade de 100 t cada",325520.1194,21.7013,10.8792,0,24.414,0,0,56.9945,32.5805]
["A9386","Cavalo mecânico estradeiro 6 x 4, CMT 123.000 kg - 323 kW - motorista de veículo especial",1336898.0637,57.2956,23.5676,9.5493,85.9434,230.3055,30.9603,437.6217,121.3728]
["A9387","Dolly pneumático com capacidade de 28,5 t e 3 eixos",425077.8192,28.3385,14.2065,0,31.8808,0,0,74.4258,42.545]
["A9389","Dolly pneumático com capacidade de 48 t e 4 eixos",553719.7908,36.9147,18.5058,0,41.529,0,0,96.9495,55.4205]
["E9171","Cavalo mecânico com dois dollys pneumáticos de 4 e 5 eixos e mesas de giro com capacidade de 111 t - 440 kW",{"$nulls":7},1315.7245,544.9056]
["A9325","Cavalo mecânico 8 x 8, PBT 26.000 kg - 440 kW -  motorista de veículo especial",5288422.2856,226.6467,93.2273,37.7744,339.97,313.7288,30.9603,1042.3075,388.6087]
["A9385","Conjunto de duas mesas de giro para quinta roda ou reboque com capacidade de 100 t cada",325520.1194,21.7013,10.8792,0,24.414,0,0,56.9945,32.5805]
["A9388","Dolly pneumático com capacidade de 60 t e 5 eixos",682361.7624,45.4908,22.8051,0,51.1771,0,0,119.473,68.2959]
["A9389","Dolly pneumático com capacidade de 48 t e 4 eixos",553719.7908,36.9147,18.5058,0,41.529,0,0,96.9495,55.4205]
["E9199","Caminhão com sistema de hidrojateamento de alta pressão e vácuo para limpeza e desobstrução de bueiros com capacidade total de 15.600 l - 188 kW",{"$nulls":7},345.5949,101.9089]
["A9299","Equipamento com sistema de hidrojateamento de alta pressão e vácuo para limpeza e desobstrução de bueiros com diâmetro de até 1.500 mm com capacidade total de 15.600 l",401200,16.048,6.8074,0,16.048,0,0,38.9034,22.8554]
["A9313","Caminhão plataforma 6 x 2, PBT 23.000 kg e distância entre eixos 5,4 m - 188 kW - motorista de veículo especial",711138.1587,30.4773,12.5363,5.0796,45.716,181.922,30.9603,306.6915,79.0535]
["E9201","Caminhão basculante para rocha com capacidade de 12 m³ - 188 kW com periculosidade",{"$nulls":7},311.8689,110.2449]
["A9327","Caminhão plataforma 8 x 2 PBT 29.000 kg e distância entre eixos 4,8 m - 188 kW - motorista de veículo especial com periculosidade",809627.9348,34.6983,14.2726,5.7831,52.0475,134.0478,38.3342,279.1835,93.0882]
["A9343","Caçamba basculante para rocha com capacidade de 12 m³",182894.041,13.8033,3.3534,0,15.5287,0,0,32.6854,17.1567]
["E9202","Plataforma pantográfica montada em caminhão - 115 kW com periculosidade",{"$nulls":7},310.1232,139.1044]
["A9300","Caminhão plataforma 4 x 2, PBT 8.300 kg e distância entre eixos 3,7 m - 115 kW - motorista de veículo especial com periculosidade",415550.087,17.8093,7.3256,2.9682,26.7139,111.2821,38.3342,204.4333,66.4373]
["A9383","Plataforma pantográfica hidráulica montada sobre chassi com capacidade de 600 kg - com periculosidade",495341.58,33.0228,8.9141,0,33.0228,0,30.7302,105.6899,72.6671]
["E9506","Caminhão basculante com capacidade de 6 m³ - 136 kW",{"$nulls":7},188.4167,76.3186]
["A9307","Caminhão plataforma 4 x 2, PBT 16.000 kg e distância entre eixos 3,6 m - 136 kW - motorista de caminhão",573566.7632,24.5814,10.1112,4.0969,36.8721,69.2648,30.9429,175.8693,69.7324]
["A9338","Caçamba basculante com capacidade de 6 m³",70210,5.2989,1.2873,0,5.9612,0,0,12.5474,6.5862]
["E9508","Caminhão carroceria com capacidade de 9 t - 136 kW",{"$nulls":7},182.8067,73.5515]
["A9309","Caminhão plataforma 4 x 2, PBT 16.000 kg e distância entre eixos 4,8 m - 136 kW - motorista de caminhão",582207.9163,24.9518,10.2635,4.1586,37.4277,69.2648,30.9429,177.0093,70.3168]
["A9350","Carroceria de madeira com capacidade de 9 t",37159.816,2.5627,0.672,0,2.5627,0,0,5.7974,3.2347]
["E9509","Caminhão tanque distribuidor de asfalto com capacidade de 6.000 l - 7 kW/136 kW",{"$nulls":7},259.8897,78.2888]
["A9323","Caminhão plataforma 4 x 2, PBT 14.300 kg e distância entre eixos 4,8 m - 136 kW - condição de trabalho severa - motorista de caminhão",548252.2249,23.4965,9.6649,3.9161,35.2448,131.6031,30.9429,234.8683,68.0204]
["A9363","Tanque espargidor de asfalto com capacidade de 6.000 l - 7 kW",190570,7.6228,2.6456,0,7.6228,7.1302,0,25.0214,10.2684]
["E9520","Caminhão com caçamba térmica com capacidade de 6 m³ - 188 kW",{"$nulls":7},273.2497,86.9363]
["A9311","Caminhão plataforma 6 x 2, PBT 23.000 kg e distância entre eixos 4,8 m - 188 kW - motorista de caminhão",704953.8536,30.2123,12.4273,5.0354,45.3185,134.0478,30.9429,257.9842,78.6179]
["A9339","Caçamba térmica com capacidade de 6 m³",123503.9767,6.1752,2.1432,0,6.9471,0,0,15.2655,8.3184]
["E9571","Caminhão tanque com capacidade de 10.000 l - 188 kW",{"$nulls":7},322.602,87.9601]
["A9332","Caminhão plataforma 6 x 2, PBT 23.000 kg e distância entre eixos 4,8 m - 188 kW - condição de trabalho severa - motorista de caminhão",704953.8536,30.2123,12.4273,5.0354,45.3185,181.922,30.9429,305.8584,78.6179]
["A9360","Tanque para transporte de água com capacidade de 10.000 l",107321,7.4014,1.9408,0,7.4014,0,0,16.7436,9.3422]
["E9575","Caminhão basculante com caçamba estanque com capacidade de 14 m³ - 188 kW",{"$nulls":7},290.2722,95.4054]
["A9317","Caminhão plataforma 8 x 2, PBT 29.000 kg e distância entre eixos 4,8 m - 188 kW - motorista de veículo especial",809627.9348,34.6983,14.2726,5.7831,52.0475,134.0478,30.9603,271.8096,85.7143]
["A9345","Caçamba basculante estanque com capacidade de 14 m³",103309,7.7969,1.8942,0,8.7715,0,0,18.4626,9.6911]
["E9579","Caminhão basculante com capacidade de 10 m³ - 188 kW",{"$nulls":7},288.1436,94.2798]
["A9316","Caminhão plataforma 8 x 2, PBT 29.000 kg e distância entre eixos 4,8 m - 188 kW - motorista de caminhão",809627.9348,34.6983,14.2726,5.7831,52.0475,134.0478,30.9429,271.7922,85.6969]
["A9342","Caçamba basculante com capacidade de 10 m³",91495.3939,6.9053,1.6776,0,7.7685,0,0,16.3514,8.5829]
["E9592","Caminhão carroceria com capacidade de 15 t - 188 kW",{"$nulls":7},265.2158,82.6159]
["A9314","Caminhão plataforma 6 x 2, PBT 23.000 kg e distância entre eixos 5,4 m - 188 kW - motorista de caminhão",711138.1587,30.4773,12.5363,5.0796,45.716,134.0478,30.9429,258.7999,79.0361]
["A9352","Carroceria de madeira com capacidade de 15 t",41123,2.8361,0.7437,0,2.8361,0,0,6.4159,3.5798]
["E9600","Caminhão betoneira com capacidade de 8 m³ - 188 kW",{"$nulls":7},302.282,101.7094]
["A9317","Caminhão plataforma 8 x 2, PBT 29.000 kg e distância entre eixos 4,8 m - 188 kW - motorista de veículo especial",809627.9348,34.6983,14.2726,5.7831,52.0475,134.0478,30.9603,271.8096,85.7143]
["A9346","Misturador de concreto para montagem em chassi de caminhão com capacidade de 8 m³",170510,12.8687,3.1264,0,14.4773,0,0,30.4724,15.9951]
["E9604","Caminhão basculante para rocha com capacidade de 8 m³ - 210 kW",{"$nulls":7},303.3545,93.9816]
["A9315","Caminhão basculante 6 x 4, PBT 23.000 kg e distância entre eixos 3,6 m - 210 kW -  motorista de caminhão",839773.0008,35.9903,14.804,5.9984,53.9854,149.7342,30.9429,291.4552,87.7356]
["A9341","Caçamba basculante para rocha com capacidade de 8 m³",66583.6527,5.0252,1.2208,0,5.6533,0,0,11.8993,6.246]
["E9605","Caminhão tanque com capacidade de 6.000 l - 136 kW",{"$nulls":7},249.5777,76.2276]
["A9323","Caminhão plataforma 4 x 2, PBT 14.300 kg e distância entre eixos 4,8 m - 136 kW - condição de trabalho severa - motorista de caminhão",548252.2249,23.4965,9.6649,3.9161,35.2448,131.6031,30.9429,234.8683,68.0204]
["A9358","Tanque para transporte de água com capacidade de 6.000 l",94282,6.5022,1.705,0,6.5022,0,0,14.7094,8.2072]
["E9644","Caminhão demarcador de faixas com sistema de pintura a frio - 28 kW/115 kW",{"$nulls":7},367.9946,156.0978]
["A9302","Caminhão plataforma 4 x 2, PBT 8.300 kg e distância entre eixos 4,4 m - 115 kW - motorista de veículo especial",416911.8102,17.8676,7.3496,2.9779,26.8015,111.2821,30.9603,197.239,59.1554]
["A9368","Equipamento demarcador de faixas a frio montado sobre chassi com capacidade de 800 l - 28 kW",697085,52.6686,19.1156,0,49.5705,24.2427,25.1582,170.7556,96.9424]
["E9645","Caminhão demarcador de faixas com sistema de pintura a quente - 5 kW/30,10 kW/136 kW",{"$nulls":7},510.4432,222.381]
["A9305","Caminhão plataforma 4 x 2, PBT 14.300 kg e distância entre eixos 4,8 m - 136 kW - motorista de veículo especial",548252.2249,23.4965,9.6649,3.9161,35.2448,131.6031,30.9603,234.8857,68.0378]
["A9328","Compressor de ar portátil de 70,79 l/s (150 PCM) sem reboque - 30,10 kW",134887.4014,8.9925,2.4274,0,8.9925,26.0609,0,46.4733,11.4199]
["A9369","Equipamento demarcador de faixas a quente montado sobre chassi com capacidade de 500 l - 5,0 kW",1143597.431,86.4051,31.36,0,81.3225,4.8384,25.1582,229.0842,142.9233]
["E9663","Caminhão basculante com capacidade de 4 m³ - 136 kW",{"$nulls":7},182.568,73.2894]
["A9304","Caminhão plataforma 4 x 2, PBT 14.300 kg e distância entre eixos 4,8 m - 136 kW - motorista de caminhão",548252.2249,23.4965,9.6649,3.9161,35.2448,69.2648,30.9429,172.53,68.0204]
["A9336","Caçamba basculante com capacidade de 4 m³",56168,4.2391,1.0299,0,4.769,0,0,10.038,5.269]
["E9665","Cavalo mecânico com semirreboque com capacidade de 22 t - 240 kW",{"$nulls":7},378.1618,125.0097]
["A9318","Cavalo mecânico 4 x 2, PBT 16.000 kg - 240 kW - motorista de veículo especial",848869.3273,36.3801,14.9644,6.0634,54.5702,171.1248,30.9603,314.0632,88.3682]
["A9353","Semirreboque com 2 eixos",366095,24.4063,12.2352,0,27.4571,0,0,64.0986,36.6415]
["E9666","Cavalo mecânico com semirreboque com capacidade de 30 t - 265 kW",{"$nulls":7},410.3079,132.8089]
["A9321","Cavalo mecânico estradeiro 6 x 2, PBT 23.000 kg - 265 kW - motorista de caminhão",897654.5608,38.4709,15.8244,6.4118,57.7064,188.9503,30.9429,338.3067,91.65]
["A9354","Semirreboque com 3 eixos",411230,27.4153,13.7436,0,30.8423,0,0,72.0012,41.1589]
["E9667","Caminhão basculante com capacidade de 14 m³ - 188 kW",{"$nulls":7},290.2722,95.4054]
["A9317","Caminhão plataforma 8 x 2, PBT 29.000 kg e distância entre eixos 4,8 m - 188 kW - motorista de veículo especial",809627.9348,34.6983,14.2726,5.7831,52.0475,134.0478,30.9603,271.8096,85.7143]
["A9344","Caçamba basculante com capacidade de 14 m³",103309,7.7969,1.8942,0,8.7715,0,0,18.4626,9.6911]
["E9669","Caminhão tanque com capacidade de 8.000 l - 136 kW",{"$nulls":7},255.0608,79.0841]
["A9331","Caminhão plataforma 4 x 2, PBT 16.000 kg e distância entre eixos 4,8 m - 136 kW - condição de trabalho severa - motorista de caminhão",582207.9163,24.9518,10.2635,4.1586,37.4277,131.6031,30.9429,239.3476,70.3168]
["A9359","Tanque para transporte de água com capacidade de 8.000 l",100715.9733,6.9459,1.8214,0,6.9459,0,0,15.7132,8.7673]
["E9670","Usina móvel de lama asfáltica ou microrrevestimento com cavalo mecânico com capacidade de 12 m³ - 95,6 kW/240 kW",{"$nulls":7},716.6451,242.5664]
["A9319","Cavalo mecânico 4 x 2, PBT 16.000 kg - 240 kW - condição de trabalho severa - motorista de veículo especial",848869.3273,36.3801,14.9644,6.0634,54.5702,232.2408,30.9603,375.1792,88.3682]
["A9367","Usina de lama asfáltica ou microrrevestimento asfáltico rebocável com capacidade de 12 m³ - 95,6 kW",1398281.297,89.8895,27.7309,0,89.8895,97.3782,36.5778,341.4659,154.1982]
["E9672","Caminhão basculante para rocha com capacidade de 12 m³ - 188 kW",{"$nulls":7},304.495,102.871]
["A9317","Caminhão plataforma 8 x 2, PBT 29.000 kg e distância entre eixos 4,8 m - 188 kW - motorista de veículo especial",809627.9348,34.6983,14.2726,5.7831,52.0475,134.0478,30.9603,271.8096,85.7143]
["A9343","Caçamba basculante para rocha com capacidade de 12 m³",182894.041,13.8033,3.3534,0,15.5287,0,0,32.6854,17.1567]
["E9679","Cavalo mecânico com dois reboques hidropneumáticos de 5 e 4 eixos e mesas de giro com capacidade de 130 t - 440 kW",{"$nulls":7},1487.5893,643.1508]
["A9325","Cavalo mecânico 8 x 8, PBT 26.000 kg - 440 kW -  motorista de veículo especial",5288422.2856,226.6467,93.2273,37.7744,339.97,313.7288,30.9603,1042.3075,388.6087]
["A9384","Reboque hidropneumático com capacidade de 166 t e 4 eixos",1012356.3852,67.4904,33.8338,0,75.9267,0,0,177.2509,101.3242]
["A9385","Conjunto de duas mesas de giro para quinta roda ou reboque com capacidade de 100 t cada",325520.1194,21.7013,10.8792,0,24.414,0,0,56.9945,32.5805]
["A9390","Reboque hidropneumático com capacidade de 117 t e 5 eixos",1205319.3426,80.3546,40.2828,0,90.399,0,0,211.0364,120.6374]
["E9680","Caminhão tanque com capacidade de 13.000 l - 188 kW",{"$nulls":7},325.1059,89.3572]
["A9332","Caminhão plataforma 6 x 2, PBT 23.000 kg e distância entre eixos 4,8 m - 188 kW - condição de trabalho severa - motorista de caminhão",704953.8536,30.2123,12.4273,5.0354,45.3185,181.922,30.9429,305.8584,78.6179]
["A9361","Tanque para transporte de água com capacidade de 13.000 l",123369,8.5082,2.2311,0,8.5082,0,0,19.2475,10.7393]
["E9686","Caminhão carroceria com guindauto com capacidade de 20 t.m - 136 kW",{"$nulls":7},302.8632,116.7997]
["A9308","Caminhão plataforma 4 x 2, PBT 16.000 kg e distância entre eixos 4,8 m - 136 kW - motorista de veículo especial",596403.4833,25.5601,10.5137,4.26,38.3402,131.6031,30.9603,241.2374,71.2941]
["A9349","Carroceria de madeira com capacidade de 7 t",23614.5975,1.6286,0.4271,0,1.6286,0,0,3.6843,2.0557]
["A9372","Guindaste articulado montado sobre chassi com capacidade de 20 t.m",210128.5,14.4916,3.8001,0,14.4916,0,25.1582,57.9415,43.4499]
["E9687","Caminhão carroceria com capacidade de 5 t - 115 kW",{"$nulls":7},150.4341,62.3189]
["A9303","Caminhão plataforma 4 x 2, PBT 9.600 kg e distância entre eixos 3,7 m - 115 kW - motorista de caminhão",437854.5481,18.7652,7.7188,3.1275,28.1478,58.5695,30.9429,147.2717,60.5544]
["A9348","Carroceria de madeira com capacidade de 5 t",20270.2288,1.3979,0.3666,0,1.3979,0,0,3.1624,1.7645]
["E9690","Caminhão carroceria com guindauto e cesto aéreo com capacidade de 10 t.m - 136 kW",{"$nulls":7},327.749,141.8059]
["A9308","Caminhão plataforma 4 x 2, PBT 16.000 kg e distância entre eixos 4,8 m - 136 kW - motorista de veículo especial",596403.4833,25.5601,10.5137,4.26,38.3402,131.6031,30.9603,241.2374,71.2941]
["A9329","Cesto aéreo simples isolado com capacidade para 135 kg",24327.765,1.6778,0.44,0,1.6778,0,0,3.7956,2.1178]
["A9330","Guindaste articulado montado sobre chassi com capacidade de 10 t.m",170510,11.7593,3.0836,0,11.7593,0,50.3164,76.9186,65.1593]
["A9350","Carroceria de madeira com capacidade de 9 t",37159.816,2.5627,0.672,0,2.5627,0,0,5.7974,3.2347]
["E9693","Caminhão demarcador de faixas com sistema de pintura Spray - 115 kW",{"$nulls":7},786.7356,417.9085]
["A9322","Caminhão plataforma 4 x 2, PBT 9.600 kg e distância entre eixos 3,7 m - 115 kW - condição de trabalho severa - motorista de caminhão",437854.5481,18.7652,7.7188,3.1275,28.1478,111.2821,30.9429,199.9843,60.5544]
["A9370","Equipamento demarcador de faixas sistema spray montado sobre chassi com capacidade 1.080 l",3225898.75,243.7346,88.4613,0,229.3972,0,25.1582,586.7513,357.3541]
["E9783","Plataforma pantográfica montada em caminhão - 115 kW",{"$nulls":7},297.1773,126.1585]
["A9301","Caminhão plataforma 4 x 2, PBT 8.300 kg e distância entre eixos 3,7 m - 115 kW - motorista de veículo especial",415550.087,17.8093,7.3256,2.9682,26.7139,111.2821,30.9603,197.0594,59.0634]
["A9377","Plataforma pantográfica hidráulica montada sobre chassi com capacidade de 600 kg",495341.58,33.0228,8.9141,0,33.0228,0,25.1582,100.1179,67.0951]
["E9787","Bomba para concreto com lança montada sobre chassi com capacidade de 50 m³/h - 136 kW",{"$nulls":7},582.468,275.9933]
["A9308","Caminhão plataforma 4 x 2, PBT 16.000 kg e distância entre eixos 4,8 m - 136 kW - motorista de veículo especial",596403.4833,25.5601,10.5137,4.26,38.3402,131.6031,30.9603,241.2374,71.2941]
["A9371","Bomba para concreto com lança montada sobre chassi com capacidade de 50 m³/h",1706642.66,136.5314,31.59,0,136.5314,0,36.5778,341.2306,204.6992]
["E9792","Caminhão para hidrossemeadura com capacidade de 7.500 l - 136 kW",{"$nulls":7},331.2469,130.5625]
["A9323","Caminhão plataforma 4 x 2, PBT 14.300 kg e distância entre eixos 4,8 m - 136 kW - condição de trabalho severa - motorista de caminhão",548252.2249,23.4965,9.6649,3.9161,35.2448,131.6031,30.9429,234.8683,68.0204]
["A9362","Tanque para hidrossemeadura com capacidade de 7.500 l",398519.0829,30.0769,7.307,0,33.8365,0,25.1582,96.3786,62.5421]

{"sheet":"DNIT EQUIP","index":13,"n_rows":24,"n_cols":7,"rows_kept":24,"cut":false,"hidden":false,"merged":[[3,4,3,5],[12,2,12,3],[13,2,13,3],[14,2,14,3],[15,2,15,3],[16,2,16,3],[17,2,17,3],[18,2,18,3],[19,2,19,3],[20,2,20,3],[21,2,21,3],[22,2,22,3],[3,0,4,0],[5,0,7,0],[13,0,14,0],[15,0,16,0],[17,0,20,0],[21,0,22,0],[3,1,4,1],[3,2,4,2],[3,3,4,3]]}
["2023-04-01"]
["Tabela 1 - Custos de veículos "]
[{"$f":"\"Tabela de Preços de Consultoria - mês de referência: \"&TEXT(A1,\"MMMM\")&\" de \"&TEXT(A1,\"AAAA\")","v":"Tabela de Preços de Consultoria - mês de referência: abril de 2023"}]
["Item","Código","Tipo","Unidade","Custo unitário (R$ / un)",null,"S"]
[{"$nulls":4},"Produtivo","Improdutivo"]
["Veículos","E8889","Veículo leve - 53 kW (sem motorista)","hora",31.83,6.31]
[null,"E8891","Veículo leve picape 4x4 - 147 kW (sem motorista)","hora",86.6,28.02]
[null,"E8887","Van furgão - 93 kW (com motorista)","hora",76.72,41.55]
["Fonte: FGV IBRE"]
[]
["Tabela 2 - Custos de imóveis, mobiliário, cestas de instalações e custos diversos"]
[{"$f":"\"Tabela de Preços de Consultoria - mês de referência: \"&TEXT(A1,\"MMMM\")&\" de \"&TEXT(A1,\"AAAA\")","v":"Tabela de Preços de Consultoria - mês de referência: abril de 2023"}]
["Item","Código","Tipo",null,"Unidade","Custo unitário \n(R$ / un)"]
["Imóveis","B8951","Comercial (2,60% do CMCC - SINAPI)",null,"m² x mês",46.78]
[null,"B8952","Residencial (1,70% do CMCC - SINAPI)",null,"m² x mês",30.59]
["Mobiliário","B8953","Escritório",null,"ocupante x mês",510.96]
[null,"B8954","Residência",null,"ocupante x mês",44.3]
["Cesta das Instalações","B8955","Laboratório de asfalto",null,"mês",5400.53]
[null,"B8956","Laboratório de concreto",null,"mês",4270.25]
[null,"B8957","Laboratório de solos",null,"mês",4311.34]
[null,"B8958","Topografia",null,"mês",3134.16]
["Custos Diversos","B8959","Escritório",null,"ocupante x mês",131.32]
[null,"B8960","Residência",null,"ocupante x mês",208.36]
["Fonte: FGV IBRE"]