{"text_format":"2","workbook":"xlsx","n_sheets":20,"sheets":["RESUMO","PO1","MEMÓRIA","CFF","BDI DNIT D","BDI + ES","CFF2","ABC Serviços","CPUs","PROJ.EXEC","DES.MOB.","EAI","CAP (2)","EAI (2)","RR-1C (2)","Comparação ARAPIRACA-MACEIO","Encargos SD","EQUIP D","MO D","Encargos D"],"not_rendered":{"charts":0,"images":7,"macros":0,"external_links":39,"defined_names":713,"comments":1,"pivot_tables":0},"unopened":[],"bounds":{"document_bytes":16777216,"sheet_cells":100000,"run_cost":"one","rows_first":2000,"rows_last":500,"rows_between":2000,"halvings":0,"cell_chars":16384,"cell_head_chars":4096},"cells_cut":0,"cells_raw":0,"read":"whole","date_system":"1900"}

{"sheet":"RESUMO","index":0,"n_rows":13,"n_cols":6,"rows_kept":13,"cut":false,"hidden":false,"merged":[[12,1,12,2],[9,1,9,5],[6,2,6,5],[7,2,7,3],[0,2,0,5],[1,2,1,5],[2,2,2,5],[3,2,3,5],[4,2,4,5]]}
[null,null,"Ministério do Desenvolvimento Regional - MDR"]
[null,null,"Companhia de Desenvolvimento dos Vales do São Francisco e do Parnaíba"]
[null,null,"5ª Superintendência Regional"]
[null,null,"Gerência Regional de Infraestrutura"]
[null,null,"Unidade Regional de Estudos e Projetos"]
[]
[null,"Objeto:","CONTRATAÇÃO DE SERVIÇOS DE EXECUÇÃO DE PAVIMENTAÇÃO EM PARALELEPÍPEDO GRANÍTICO, EM VIAS DE DIVERSOS MUNICÍPIOS INSERIDOS NA ÁREA DE ATUAÇÃO DA 5ª SUPERINTENDÊNCIA REGIONAL DA CODEVASF, NO ESTADO DE ALAGOAS"]
[null,"Bancos:","SINAPI - 10/2023 - Alagoas; SICRO3 - 07/2023 - Alagoas; ORSE - 09/2023 - Sergipe - Sem Desoneração",null,"BDI:",0.2135]
[{"$nulls":4},"LS:","114,90% (hora)\n70,23% (mês)"]
[null,"Quadro Resumo"]
[null,"Código","Itens","Área (m²)","Valor ","Valor por m²"]
[null,1,"Pavimentação em paralelepípedo granítico",{"$f":"MEMÓRIA!M10","v":156000},{"$f":"'PO1'!K39","v":19981485.190000001},{"$f":"E12/D12","v":128.08644352564104}]
[null,"Total",null,{"$f":"SUM(D12:D12)","v":156000},{"$f":"SUM(E12:E12)","v":19981485.190000001}]

{"sheet":"PO1","index":1,"n_rows":39,"n_cols":19,"rows_kept":39,"cut":false,"hidden":false,"merged":[[36,8,36,9],[37,8,37,9],[38,8,38,9],[5,10,6,10],[0,5,0,6],[0,8,0,9],[1,5,1,6],[1,8,1,9],[2,1,3,10],[4,1,6,1],[4,2,6,2],[4,3,6,3],[4,4,6,4],[5,9,6,9]]}
[{"$nulls":5},"Bancos",null,null,"B.D.I.",null,"Encargos Sociais"]
[{"$nulls":5},"SINAPI - 10/2023 - Alagoas\nSICRO3 - 07/2023 - Alagoas\nORSE - 09/2023 - Sergipe\nSem desoneração\n",null,null,{"$f":"RESUMO!F8","v":0.2135},null,"Não Desonerado: \nHorista: 113,41%\nMensalista: 69,73%"]
[null,{"$f":"RESUMO!C12","v":"Pavimentação em paralelepípedo granítico"}]
[]
[null,"ITEM","ORIGEM COMPOSIÇÃO","CÓDIGO COMPOSIÇÃO","DISCRIMINAÇÃO DOS SERVIÇOS","BDI: ",{"$f":"RESUMO!F8","v":0.2135},"BDI Diferenciado: ",{"$f":"'BDI + ES'!H61","v":0.15279999999999999},"R$/m² = ",{"$f":"RESUMO!F12","v":128.08644352564104}]
[{"$nulls":5},"Total de m²: ",{"$f":"MEMÓRIA!M10","v":156000},"Encargos Sociais: Horista: 114,90%","Encargos Sociais: Mensalista: 70,23% ","VALOR UNIT. COM BDI","PREÇO TOTAL"]
[{"$nulls":5},"UND","QUANT.","BDI","VALOR UNIT.",null,null,"Peso (%)",null,null,null,"N1","TERRAPLENAGEM",{"$f":"ROUND((SUMIF(O:O,\"TERRAPLENAGEM\",K:K))/$K$39,5)","v":6.5369999999999998E-2},{"$f":"(SUMIF(O:O,\"TERRAPLENAGEM\",K:K))","v":1306258.2}]
[null,1,null,null,"SERVIÇOS PRELIMINARES",{"$nulls":5},{"$f":"SUM(K9:K13)","v":266136.03000000003},{"$f":"K8/$K$39","v":1.3319131559509466E-2},{"$f":"SUM(M9:M13)","v":220658.88},null,null,"N2","EDIFICAÇÕES",{"$f":"ROUND((SUMIF(O:O,\"EDIFICAÇÕES\",K:K))/$K$39,6)","v":7.3047000000000001E-2},{"$f":"(SUMIF(O:O,\"EDIFICAÇÕES\",K:K))","v":1459586.99}]
[1,"1.1","Codevasf","CPU-01",{"$f":"VLOOKUP(D9,CPUs!$B$5:$J$161,3,0)","v":"ADMINISTRAÇÃO LOCAL"},"m²",{"$f":"ROUND(VLOOKUP(B9,MEMÓRIA!$A$1:$O$139,15,0),2)","v":156000},{"$f":"$G$5","v":0.2135},{"$f":"VLOOKUP(D9,CPUs!$B$6:$K$161,10,0)","v":0.72},{"$f":"TRUNC(I9*(1+$G$5),2)","v":0.87},{"$f":"TRUNC(G9*J9,2)","v":135720},6.7922878959929796E-3,{"$f":"TRUNC(G9*I9,2)","v":112320},null,"ADMINISTRAÇÃO LOCAL","N3","MOBILIZAÇÃO E DESMOBILIZAÇÃO",{"$f":"ROUND((SUMIF(O:O,\"MOBILIZAÇÃO E DESMOBILIZAÇÃO\",K:K))/$K$39,5)","v":4.5300000000000002E-3},{"$f":"(SUMIF(O:O,\"MOBILIZAÇÃO E DESMOBILIZAÇÃO\",K:K))","v":90480}]
[2,"1.2","SINAPI","CPU-02",{"$f":"VLOOKUP(D10,CPUs!$B$5:$J$161,3,0)","v":"MOBILIZAÇÃO E DESMOBILIZAÇÃO"},"m²",{"$f":"ROUND(VLOOKUP(B10,MEMÓRIA!$A$1:$O$139,15,0),2)","v":156000},0.2135,{"$f":"VLOOKUP(D10,CPUs!$B$6:$K$161,10,0)","v":0.48},{"$f":"TRUNC(I10*(1+$G$5),2)","v":0.57999999999999996},90480,4.5281919306619867E-3,{"$f":"TRUNC(G10*I10,2)","v":74880},null,"MOBILIZAÇÃO E DESMOBILIZAÇÃO","N4","DRENAGEM",{"$f":"ROUND((SUMIF(O:O,\"DRENAGEM\",K:K))/$K$39,5)","v":0.16891999999999999},{"$f":"(SUMIF(O:O,\"DRENAGEM\",K:K))","v":3375320}]
[3,"1.3","SINAPI",103689,{"$f":"VLOOKUP(D11,CPUs!$B$5:$J$161,3,0)","v":"FORNECIMENTO E INSTALAÇÃO DE PLACA DE OBRA COM CHAPA GALVANIZADA E ESTRUTURA DE MADEIRA. AF_03/2022_PS"},{"$f":"VLOOKUP(D11,CPUs!$B$6:$J$161,6,0)","v":"m²"},{"$f":"ROUND(VLOOKUP(B11,MEMÓRIA!$A$1:$O$139,15,0),2)","v":84.24},0.2135,{"$f":"VLOOKUP(D11,CPUs!$B$6:$J$161,8,0)","v":312},{"$f":"TRUNC(I11*(1+$G$5),2)","v":378.61},{"$f":"TRUNC(G11*J11,2)","v":31894.1},1.5961826509253588E-3,26282.880000000001,null,"EDIFICAÇÕES","N5","PAVIMENTAÇÃO",{"$f":"ROUND((SUMIF(O:O,\"PAVIMENTAÇÃO\",K:K))/$K$39,5)","v":0.67571999999999999},{"$f":"(SUMIF(O:O,\"PAVIMENTAÇÃO\",K:K))","v":13501800}]
[4,"1.4","SINAPI",103689,{"$f":"VLOOKUP(D12,CPUs!$B$5:$J$161,3,0)","v":"FORNECIMENTO E INSTALAÇÃO DE PLACA DE OBRA COM CHAPA GALVANIZADA E ESTRUTURA DE MADEIRA. AF_03/2022_PS"},"m²",{"$f":"ROUND(VLOOKUP(B12,MEMÓRIA!$A$1:$O$139,15,0),2)","v":13},0.2135,{"$f":"VLOOKUP(D12,CPUs!$B$6:$J$161,8,0)","v":312},{"$f":"TRUNC(I12*(1+$G$5),2)","v":378.61},4921.93,2.4632453259596768E-4,4056,null,"EDIFICAÇÕES","N6","MO ESPECIALIZADA",{"$f":"ROUND((SUMIF(O:O,\"MO ESPECIALIZADA\",K:K))/$K$39,6)","v":5.6210000000000001E-3},{"$f":"(SUMIF(O:O,\"MO ESPECIALIZADA\",K:K))","v":112320}]
[5,"1.5","Codevasf","CPU-03",{"$f":"VLOOKUP(D13,CPUs!$B$5:$J$161,3,0)","v":"CANTEIRO DE OBRAS E ALMOXARIFADO"},"m²",{"$f":"ROUND(VLOOKUP(B13,MEMÓRIA!$A$1:$O$139,15,0),2)","v":156000},0.2135,{"$f":"VLOOKUP(D13,CPUs!$B$6:$K$161,10,0)","v":0.02},0.02,3120,1.5614454933317196E-4,3120,null,"EDIFICAÇÕES","N7","ADMINISTRAÇÃO LOCAL",{"$f":"ROUND((SUMIF(O:O,\"ADMINISTRAÇÃO LOCAL\",K:K))/$K$39,5)","v":6.79E-3},{"$f":"(SUMIF(O:O,\"ADMINISTRAÇÃO LOCAL\",K:K))","v":135720}]
[null,2,null,null,"TERRAPLENAGEM",{"$nulls":5},{"$f":"SUM(K15:K18)","v":1198579.2},5.9984490071831334E-2,{"$f":"SUM(M15:M16)","v":568401.6},null,null,null,"SOMA =",{"$f":"SUM(R7:R13)","v":0.99999799999999994},{"$f":"SUM(S7:S13)","v":19981485.189999998}]
[6,"2.1","Codevasf","CPU-04",{"$f":"VLOOKUP(D15,CPUs!$B$5:$J$161,3,0)","v":"SERVIÇOS TOPOGRÁFICOS PARA PAVIMENTAÇÃO, INCLUSIVE NOTAS DE SERVIÇOS, ACOMPANHAMENTO E GREIDE"},{"$f":"VLOOKUP(D15,CPUs!$B$6:$J$161,6,0)","v":"m²"},{"$f":"ROUND(VLOOKUP(B15,MEMÓRIA!$A$1:$O$139,15,0),2)","v":156000},{"$f":"$G$5","v":0.2135},{"$f":"VLOOKUP(D15,CPUs!$B$6:$J$161,8,0)","v":0.48},{"$f":"TRUNC(I15*(1+$G$5),2)","v":0.57999999999999996},{"$f":"TRUNC(G15*J15,2)","v":90480},4.5281919306619867E-3,{"$f":"TRUNC(G15*I15,2)","v":74880},null,"TERRAPLENAGEM"]
[7,"2.2","SINAPI",101124,{"$f":"VLOOKUP(D16,CPUs!$B$5:$J$161,3,0)","v":"ESCAVAÇÃO HORIZONTAL, INCLUINDO CARGA E DESCARGA EM SOLO DE 1A CATEGORIA COM TRATOR DE ESTEIRAS (100HP/LÂMINA: 2,19M3). AF_07/2020"},{"$f":"VLOOKUP(D16,CPUs!$B$6:$J$161,6,0)","v":"m³"},{"$f":"ROUND(VLOOKUP(B16,MEMÓRIA!$A$1:$O$139,15,0),2)","v":34320},{"$f":"$G$5","v":0.2135},{"$f":"VLOOKUP(D16,CPUs!$B$6:$J$161,8,0)","v":14.38},{"$f":"TRUNC(I16*(1+$G$5),2)","v":17.45},{"$f":"TRUNC(G16*J16,2)","v":598884},2.9971946244502355E-2,493521.6,null,"TERRAPLENAGEM"]
[8,"2.3","SINAPI",100574,{"$f":"VLOOKUP(D17,CPUs!$B$5:$J$161,3,0)","v":"ESPALHAMENTO DE MATERIAL COM TRATOR DE ESTEIRAS. AF_11/2019"},{"$f":"VLOOKUP(D17,CPUs!$B$6:$J$161,6,0)","v":"m³"},{"$f":"ROUND(VLOOKUP(B17,MEMÓRIA!$A$1:$O$139,15,0),2)","v":34320},{"$f":"$G$5","v":0.2135},{"$f":"VLOOKUP(D17,CPUs!$B$6:$J$161,8,0)","v":1.33},{"$f":"TRUNC(I17*(1+$G$5),2)","v":1.61},{"$f":"TRUNC(G17*J17,2)","v":55255.199999999997},2.7653199686904751E-3,{"$f":"TRUNC(G17*I17,2)","v":45645.599999999999},null,"TERRAPLENAGEM"]
[9,"2.4","SINAPI",100576,{"$f":"VLOOKUP(D18,CPUs!$B$5:$J$161,3,0)","v":"REGULARIZAÇÃO E COMPACTAÇÃO DE SUBLEITO DE SOLO  PREDOMINANTEMENTE ARGILOSO. AF_11/2019"},{"$f":"VLOOKUP(D18,CPUs!$B$6:$J$161,6,0)","v":"m²"},{"$f":"ROUND(VLOOKUP(B18,MEMÓRIA!$A$1:$O$139,15,0),2)","v":156000},{"$f":"$G$5","v":0.2135},{"$f":"VLOOKUP(D18,CPUs!$B$6:$J$161,8,0)","v":2.4},{"$f":"TRUNC(I18*(1+$G$5),2)","v":2.91},{"$f":"TRUNC(G18*J18,2)","v":453960},2.2719031927976519E-2,{"$f":"TRUNC(G18*I18,2)","v":374400},null,"TERRAPLENAGEM"]
[null,3,null,null,"PAVIMENTAÇÃO",{"$nulls":5},{"$f":"SUM(K20:K20)","v":13501800},0.67571553723930167,{"$f":"SUM(M20:M20)","v":11127480}]
[10,"3.1","SINAPI",101169,{"$f":"VLOOKUP(D20,CPUs!$B$6:$J$161,3,0)","v":"EXECUÇÃO DE PAVIMENTO EM PARALELEPÍPEDOS, REJUNTAMENTO COM ARGAMASSA TRAÇO 1:3 (CIMENTO E AREIA). AF_05/2020"},{"$f":"VLOOKUP(D20,CPUs!$B$6:$J$161,6,0)","v":"m²"},{"$f":"ROUND(VLOOKUP(B20,MEMÓRIA!$A$1:$O$139,15,0),2)","v":156000},{"$f":"$G$5","v":0.2135},{"$f":"VLOOKUP(D20,CPUs!$B$6:$J$161,8,0)","v":71.33},{"$f":"TRUNC(I20*(1+$G$5),2)","v":86.55},{"$f":"TRUNC(G20*J20,2)","v":13501800},0.67571553723930167,{"$f":"TRUNC(G20*I20,2)","v":11127480},null,"PAVIMENTAÇÃO"]
[null,4,null,null,"DRENAGEM",{"$nulls":5},{"$f":"SUM(K22:K22)","v":3375320},0.16892237828693651,{"$f":"SUM(M22:M22)","v":2781480}]
[11,"4.1","SINAPI",94273,{"$f":"VLOOKUP(D22,CPUs!$B$6:$J$161,3,0)","v":"ASSENTAMENTO DE GUIA (MEIO-FIO) EM TRECHO RETO, CONFECCIONADA EM CONCRETO PRÉ-FABRICADO, DIMENSÕES 100X15X13X30 CM (COMPRIMENTO X BASE INFERIOR X BASE SUPERIOR X ALTURA), PARA VIAS URBANAS (USO VIÁRIO). AF_06/2016"},{"$f":"VLOOKUP(D22,CPUs!$B$6:$J$161,6,0)","v":"M"},{"$f":"ROUND(VLOOKUP(B22,MEMÓRIA!$A$1:$O$139,15,0),2)","v":52000},{"$f":"$G$5","v":0.2135},{"$f":"VLOOKUP(D22,CPUs!$B$6:$J$161,8,0)","v":53.49},{"$f":"TRUNC(I22*(1+$G$5),2)","v":64.91},{"$f":"TRUNC(G22*J22,2)","v":3375320},0.16892237828693651,{"$f":"TRUNC(G22*I22,2)","v":2781480},null,"DRENAGEM"]
[null,5,null,null,"SERVIÇOS COMPLEMENTARES",{"$nulls":5},{"$f":"SUM(K24:K26)","v":203857.16},1.0202302684788568E-2,{"$f":"SUM(M24:M26)","v":168160.72}]
[12,"5.1","SINAPI",83693,{"$f":"VLOOKUP(D24,CPUs!$B$6:$J$161,3,0)","v":"CAIACAO EM MEIO FIO"},{"$f":"VLOOKUP(D24,CPUs!$B$6:$J$161,6,0)","v":"m²"},{"$f":"ROUND(VLOOKUP(B24,MEMÓRIA!$A$1:$O$139,15,0),2)","v":12480},{"$f":"$G$5","v":0.2135},{"$f":"VLOOKUP(D24,CPUs!$B$6:$J$161,8,0)","v":4.49},{"$f":"TRUNC(I24*(1+$G$5),2)","v":5.44},{"$f":"TRUNC(G24*J24,2)","v":67891.199999999997},3.3977053934898215E-3,{"$f":"TRUNC(G24*I24,2)","v":56035.199999999997},null,"EDIFICAÇÕES"]
[13,"5.2","Codevasf","CPU-05",{"$f":"VLOOKUP(D25,CPUs!$B$6:$J$161,3,0)","v":"CONSERTO DE QUEBRA NO RAMAL NA RUA SEM PAVIMENTO COM FORNECIMENTO DE MATERIAL HIDRÁULICO"},{"$f":"VLOOKUP(D25,CPUs!$B$6:$J$161,6,0)","v":"UND"},{"$f":"ROUND(VLOOKUP(B25,MEMÓRIA!$A$1:$O$139,15,0),2)","v":52},0.2135,{"$f":"VLOOKUP(D25,CPUs!$B$6:$J$161,8,0)","v":16.260000000000002},{"$f":"TRUNC(I25*(1+$G$5),2)","v":19.73},{"$f":"TRUNC(G25*J25,2)","v":1025.96},5.1345532639058047E-5,{"$f":"TRUNC(G25*I25,2)","v":845.52},null,"EDIFICAÇÕES"]
[14,"5.3","Codevasf","CPU-06",{"$f":"VLOOKUP(D26,CPUs!$B$6:$J$161,3,0)","v":"ESCORAMENTO DE MEIO FIO COM MATERIAL LOCAL COMPACTADO MANUALMENTE, EM FAIXA DE 0,50M"},{"$f":"VLOOKUP(D26,CPUs!$B$6:$J$161,6,0)","v":"M"},{"$f":"ROUND(VLOOKUP(B26,MEMÓRIA!$A$1:$O$139,15,0),2)","v":26000},0.2135,{"$f":"VLOOKUP(D26,CPUs!$B$6:$J$161,8,0)","v":4.28},5.19,{"$f":"TRUNC(G26*J26,2)","v":134940},6.7532517586596872E-3,111280,null,"EDIFICAÇÕES"]
[null,6,null,null,"PROJETO EXECUTIVO",{"$nulls":5},{"$f":"K28","v":112320},5.6212037759941907E-3,{"$f":"M28","v":93600}]
[15,"6.1","Codevasf","CPU-07",{"$f":"VLOOKUP(D28,CPUs!$B$6:$J$161,3,0)","v":"DETALHAMENTO PROJETO EXECUTIVO DE PAVIMENTAÇÃO"},{"$f":"VLOOKUP(D28,CPUs!$B$6:$J$161,6,0)","v":"m²"},{"$f":"ROUND(VLOOKUP(B28,MEMÓRIA!$A$1:$O$139,15,0),2)","v":156000},{"$f":"$G$5","v":0.2135},{"$f":"VLOOKUP(D28,CPUs!$B$6:$J$161,8,0)","v":0.6},0.72,{"$f":"TRUNC(G28*J28,2)","v":112320},5.6212037759941907E-3,{"$f":"TRUNC(G28*I28,2)","v":93600},null,"MO ESPECIALIZADA"]
[null,7,null,null,"MOMENTO DE TRANSPORTE",{"$nulls":5},{"$f":"SUM(K30:K36)","v":1323472.8},6.6234956381638219E-2,{"$f":"SUM(M30:M32)","v":1002666.6}]
[16,"7.1","SINAPI",95876,"TRANSPORTE COM CAMINHÃO BASCULANTE DE 14 M³, EM VIA URBANA PAVIMENTADA, DMT ATÉ 30 KM (UNIDADE: M3XKM). AF_07/2020 (PEDRA)",{"$f":"VLOOKUP(D30,CPUs!$B$6:$J$161,6,0)","v":"M3XKM"},{"$f":"ROUND(VLOOKUP(B30,MEMÓRIA!$A$1:$O$150,15,0),2)","v":262080},{"$f":"$G$5","v":0.2135},{"$f":"VLOOKUP(D30,CPUs!$B$6:$J$161,8,0)","v":2.0699999999999998},2.5099999999999998,{"$f":"TRUNC(G30*J30,2)","v":657820.80000000005},3.2921516781405979E-2,{"$f":"TRUNC(G30*I30,2)","v":542505.6},null,"EDIFICAÇÕES"]
[17,"7.2","SINAPI",93593,"TRANSPORTE COM CAMINHÃO BASCULANTE DE 14 M³, EM VIA URBANA PAVIMENTADA, ADICIONAL PARA DMT EXCEDENTE A 30 KM (UNIDADE: M3XKM). AF_07/2020 (PEDRA)",{"$f":"VLOOKUP(D31,CPUs!$B$6:$J$161,6,0)","v":"M3XKM"},{"$f":"ROUND(VLOOKUP(B31,MEMÓRIA!$A$1:$O$150,15,0),2)","v":0},0.2135,{"$f":"VLOOKUP(D31,CPUs!$B$6:$J$161,8,0)","v":0.83},1,{"$f":"TRUNC(G31*J31,2)","v":0},0,0,null,"EDIFICAÇÕES"]
[18,"7.3","SINAPI",95876,"TRANSPORTE COM CAMINHÃO BASCULANTE DE 14 M³, EM VIA URBANA PAVIMENTADA, DMT ATÉ 30 KM (UNIDADE: M3XKM). AF_07/2020 (AREIA) ",{"$f":"VLOOKUP(D32,CPUs!$B$6:$J$161,6,0)","v":"M3XKM"},{"$f":"ROUND(VLOOKUP(B32,MEMÓRIA!$A$1:$O$150,15,0),2)","v":222300},0.2135,{"$f":"VLOOKUP(D32,CPUs!$B$6:$J$161,8,0)","v":2.0699999999999998},2.5099999999999998,557973,2.7924500841371141E-2,460161,null,"EDIFICAÇÕES"]
[19,"7.4","SINAPI",93593,"TRANSPORTE COM CAMINHÃO BASCULANTE DE 14 M³, EM VIA URBANA PAVIMENTADA, ADICIONAL PARA DMT EXCEDENTE A 30 KM (UNIDADE: M3XKM). AF_07/2020 (AREIA)",{"$f":"VLOOKUP(D33,CPUs!$B$6:$J$161,6,0)","v":"M3XKM"},{"$f":"ROUND(VLOOKUP(B33,MEMÓRIA!$A$1:$O$150,15,0),2)","v":0},0.2135,{"$f":"VLOOKUP(D33,CPUs!$B$6:$J$161,8,0)","v":0.83},1,{"$f":"TRUNC(G33*J33,2)","v":0},0,{"$f":"TRUNC(G33*I33,2)","v":0},null,"EDIFICAÇÕES"]
[20,"7.5","SINAPI",95876,"TRANSPORTE COM CAMINHÃO BASCULANTE DE 14 M³, EM VIA URBANA PAVIMENTADA, DMT ATÉ 30 KM (UNIDADE: M3XKM). AF_07/2020  (BOTA-FORA)",{"$f":"VLOOKUP(D34,CPUs!$B$6:$J$161,6,0)","v":"M3XKM"},{"$f":"ROUND(VLOOKUP(B34,MEMÓRIA!$A$1:$O$150,15,0),2)","v":42900},0.2135,{"$f":"VLOOKUP(D34,CPUs!$B$6:$J$161,8,0)","v":2.0699999999999998},2.5099999999999998,{"$f":"TRUNC(G34*J34,2)","v":107679},5.3889387588610975E-3,88803,null,"TERRAPLENAGEM"]
[21,"7.6","SINAPI",93593,"TRANSPORTE COM CAMINHÃO BASCULANTE DE 14 M³, EM VIA URBANA PAVIMENTADA, ADICIONAL PARA DMT EXCEDENTE A 30 KM (UNIDADE: M3XKM). AF_07/2020 (BOTA-FORA)",{"$f":"VLOOKUP(D35,CPUs!$B$6:$J$161,6,0)","v":"M3XKM"},{"$f":"ROUND(VLOOKUP(B35,MEMÓRIA!$A$1:$O$150,15,0),2)","v":0},0.2135,{"$f":"VLOOKUP(D35,CPUs!$B$6:$J$161,8,0)","v":0.83},1,0,0,0,null,"TERRAPLENAGEM"]
[22,"7.7","SINAPI",93592,{"$f":"VLOOKUP(D36,CPUs!$B$6:$J$161,3,0)","v":"TRANSPORTE COM CAMINHÃO BASCULANTE DE 14 M³, EM VIA URBANA EM REVESTIMENTO PRIMÁRIO (UNIDADE: M3XKM). AF_07/2020 (BOTA-FORA)"},{"$f":"VLOOKUP(D36,CPUs!$B$6:$J$161,6,0)","v":"M3XKM"},{"$f":"ROUND(VLOOKUP(B36,MEMÓRIA!$A$1:$O$150,15,0),2)","v":0},0.2135,{"$f":"VLOOKUP(D36,CPUs!$B$6:$J$161,8,0)","v":2.2799999999999998},2.76,{"$f":"TRUNC(G36*J36,2)","v":0},0,{"$f":"TRUNC(G36*I36,2)","v":0},null,"TERRAPLENAGEM"]
[{"$nulls":8},"TOTAL SEM BDI (R$)",null,{"$f":"SUM(M29,M23,M21,M19,M14,M8,M27)","v":15962447.800000001}]
[{"$nulls":8},"TOTAL DO BDI (R$)",null,{"$f":"K39-K37","v":4019037.3900000006}]
[{"$nulls":8},"TOTAL GERAL COM BDI (R$)",null,{"$f":"SUM(K29,K23,K21,K19,K14,K8,K27)","v":19981485.190000001},{"$f":"SUM(L29,L23,L21,L19,L14,L8,L27)","v":1}]

{"sheet":"MEMÓRIA","index":2,"n_rows":139,"n_cols":16,"rows_kept":139,"cut":false,"hidden":false,"merged":[[4,1,4,13],[5,10,5,13],[11,0,11,13]]}
[]
[]
[]
[]
["Obra:",{"$f":"RESUMO!C12","v":"Pavimentação em paralelepípedo granítico"}]
[{"$nulls":10},"Parâmetros"]
[{"$nulls":11},"Qtde de módulo mínimo:",13,"und"]
[{"$nulls":11},"Extensão do módulo mínimo:",2000,"m"]
[{"$nulls":11},"Área do módulo mínimo:",{"$f":"M8*M11","v":12000},"m2"]
[{"$nulls":11},"Área total:",{"$f":"M9*M7","v":156000},"m2"]
[{"$nulls":11},"Largura da via:",6,"m"]
["MEMÓRIA DE CÁLCULO"]
["Item","Descrição","%","Comp. (m)","Largura (m)","Espessura (m)","Altura (m)","Área (m2)","Volume (m3)","Peso (t)","Quantidade","Coef.","Total","Unidade"]
[1,{"$f":"VLOOKUP(A14,'PO1'!$B$8:$K$22,4,0)","v":"SERVIÇOS PRELIMINARES"}]
[]
["1.1",{"$f":"VLOOKUP(A16,'PO1'!$B$8:$K$22,4,0)","v":"ADMINISTRAÇÃO LOCAL"},{"$nulls":12},{"$f":"M19","v":156000}]
[]
[null,"Valor global (medição conforme execução)",{"$nulls":5},{"$f":"M10","v":156000},null,null,{"$f":"M7","v":13}]
[null,"TOTAL",{"$f":"A16","v":"1.1"},{"$nulls":9},{"$f":"H18","v":156000},{"$f":"VLOOKUP(C19,'PO1'!$B$8:$K$22,5,0)","v":"m²"}]
[]
["1.2",{"$f":"VLOOKUP(A21,'PO1'!$B$8:$K$22,4,0)","v":"MOBILIZAÇÃO E DESMOBILIZAÇÃO"},{"$nulls":12},{"$f":"SUM(E24:M24)","v":156000}]
[]
[null,"1 und de mobilização + desmobilização/módulo",null,{"$f":"$M$8","v":2000},{"$f":"$M$11","v":6},null,null,{"$f":"E23*D23*K23","v":156000},null,null,{"$f":"$M$7","v":13}]
[null,"TOTAL",{"$f":"A21","v":"1.2"},{"$nulls":9},{"$f":"SUM(H22:H23)","v":156000},{"$f":"VLOOKUP(C24,'PO1'!$B$8:$K$22,5,0)","v":"m²"}]
[]
["1.3",{"$f":"VLOOKUP(A26,'PO1'!$B$8:$K$22,4,0)","v":"FORNECIMENTO E INSTALAÇÃO DE PLACA DE OBRA COM CHAPA GALVANIZADA E ESTRUTURA DE MADEIRA. AF_03/2022_PS"},{"$nulls":12},{"$f":"SUM(E29:M29)","v":84.240000000000009}]
[]
[null,"Placas de 6m²  - 1 und a cada 14.000 m²",null,3.6,null,null,1.8,{"$f":"D28*G28*K28","v":84.240000000000009},null,null,{"$f":"M7","v":13}]
[null,"TOTAL",{"$f":"A26","v":"1.3"},{"$nulls":9},{"$f":"H28","v":84.240000000000009},{"$f":"VLOOKUP(C29,'PO1'!$B$8:$K$22,5,0)","v":"m²"}]
[]
["1.4",{"$f":"VLOOKUP(A31,'PO1'!$B$8:$K$22,4,0)","v":"FORNECIMENTO E INSTALAÇÃO DE PLACA DE OBRA COM CHAPA GALVANIZADA E ESTRUTURA DE MADEIRA. AF_03/2022_PS"},{"$nulls":12},{"$f":"SUM(E34:M34)","v":13}]
[]
[null,"Placas de 1m²- 1 und a cada 14.000 m²",null,1,null,null,1,{"$f":"D33*G33*K33","v":13},null,null,{"$f":"M7","v":13}]
[null,"TOTAL",{"$f":"A31","v":"1.4"},{"$nulls":9},{"$f":"H33","v":13},{"$f":"VLOOKUP(C34,'PO1'!$B$8:$K$22,5,0)","v":"m²"}]
[]
["1.5",{"$f":"VLOOKUP(A36,'PO1'!$B$8:$K$22,4,0)","v":"CANTEIRO DE OBRAS E ALMOXARIFADO"},{"$nulls":12},{"$f":"SUM(E39:M39)","v":156000}]
[]
[null,"1 und a cada módulo",null,{"$f":"$M$8","v":2000},{"$f":"$M$11","v":6},null,null,{"$f":"E38*D38*K38","v":156000},null,null,{"$f":"$M$7","v":13}]
[null,"TOTAL",{"$f":"A36","v":"1.5"},{"$nulls":9},{"$f":"H38","v":156000},{"$f":"VLOOKUP(C39,'PO1'!$B$8:$K$22,5,0)","v":"m²"}]
[]
[2,{"$f":"VLOOKUP(A41,'PO1'!$B$8:$K$22,4,0)","v":"TERRAPLENAGEM"}]
[]
["2.1",{"$f":"VLOOKUP(A43,'PO1'!$B$8:$K$22,4,0)","v":"SERVIÇOS TOPOGRÁFICOS PARA PAVIMENTAÇÃO, INCLUSIVE NOTAS DE SERVIÇOS, ACOMPANHAMENTO E GREIDE"},{"$nulls":12},{"$f":"SUM(E46:M46)","v":156000}]
[]
[null,"Área do módulo ",null,{"$f":"$M$8","v":2000},{"$f":"$M$11","v":6},null,null,{"$f":"$D$45*$E$45","v":12000},null,null,{"$f":"$M$7","v":13},null,{"$f":"K45*H45","v":156000}]
[null,"TOTAL",{"$f":"A43","v":"2.1"},{"$nulls":9},{"$f":"M45","v":156000},{"$f":"VLOOKUP(C46,'PO1'!$B$8:$K$22,5,0)","v":"m²"}]
[]
["2.2",{"$f":"VLOOKUP(A48,'PO1'!$B$8:$K$22,4,0)","v":"ESCAVAÇÃO HORIZONTAL, INCLUINDO CARGA E DESCARGA EM SOLO DE 1A CATEGORIA COM TRATOR DE ESTEIRAS (100HP/LÂMINA: 2,19M3). AF_07/2020"},{"$nulls":12},{"$f":"SUM(E51:M51)","v":34320}]
[]
[null,"Volume de corte - 22cm de altura (12cm da pedra + 10cm areia)",null,{"$f":"$M$8","v":2000},{"$f":"$M$11","v":6},null,0.22,{"$f":"D50*E50","v":12000},{"$f":"G50*H50*K50","v":34320},null,{"$f":"$M$7","v":13},{"$nulls":4},"Considerando volume de areia da composição SINAPI 101169"]
[null,"TOTAL",{"$f":"A48","v":"2.2"},{"$nulls":9},{"$f":"I50","v":34320},{"$f":"VLOOKUP(C51,'PO1'!$B$8:$K$22,5,0)","v":"m³"}]
[]
["2.3",{"$f":"VLOOKUP(A53,'PO1'!$B$8:$K$22,4,0)","v":"ESPALHAMENTO DE MATERIAL COM TRATOR DE ESTEIRAS. AF_11/2019"},{"$nulls":12},{"$f":"SUM(E56:M56)","v":34320}]
[]
[null,"Volume de corte - 22cm de altura (12cm da pedra + 10cm areia)",null,{"$f":"$M$8","v":2000},{"$f":"$M$11","v":6},null,0.22,{"$f":"D55*E55","v":12000},{"$f":"G55*H55*K55","v":34320},null,{"$f":"$M$7","v":13}]
[null,"TOTAL",{"$f":"A53","v":"2.3"},{"$nulls":9},{"$f":"I55","v":34320},{"$f":"VLOOKUP(C56,'PO1'!$B$8:$K$22,5,0)","v":"m³"}]
[]
["2.4",{"$f":"VLOOKUP(A58,'PO1'!$B$8:$K$22,4,0)","v":"REGULARIZAÇÃO E COMPACTAÇÃO DE SUBLEITO DE SOLO  PREDOMINANTEMENTE ARGILOSO. AF_11/2019"},{"$nulls":12},{"$f":"SUM(E61:M61)","v":156000}]
[]
[null,"Área projetada do pavimento",null,{"$f":"$M$8","v":2000},{"$f":"$M$11","v":6},null,null,{"$f":"D60*E60*K60","v":156000},null,null,{"$f":"$M$7","v":13}]
[null,"TOTAL",{"$f":"A58","v":"2.4"},{"$nulls":9},{"$f":"H60","v":156000},{"$f":"VLOOKUP(C61,'PO1'!$B$8:$K$22,5,0)","v":"m²"}]
[]
[3,{"$f":"VLOOKUP(A63,'PO1'!$B$8:$K$22,4,0)","v":"PAVIMENTAÇÃO"}]
[]
["3.1",{"$f":"VLOOKUP(A65,'PO1'!$B$8:$K$22,4,0)","v":"EXECUÇÃO DE PAVIMENTO EM PARALELEPÍPEDOS, REJUNTAMENTO COM ARGAMASSA TRAÇO 1:3 (CIMENTO E AREIA). AF_05/2020"},{"$nulls":12},{"$f":"SUM(E68:M68)","v":156000}]
[]
[null,"Área do módulo ",null,{"$f":"$M$8","v":2000},{"$f":"$M$11","v":6},null,null,{"$f":"D67*E67*K67","v":156000},null,null,{"$f":"$M$7","v":13}]
[null,"TOTAL",{"$f":"A65","v":"3.1"},{"$nulls":9},{"$f":"H67","v":156000},{"$f":"VLOOKUP(C68,'PO1'!$B$8:$K$22,5,0)","v":"m²"}]
[]
[4,{"$f":"VLOOKUP(A70,'PO1'!$B$8:$K$22,4,0)","v":"DRENAGEM"}]
[]
["4.1",{"$f":"VLOOKUP(A72,'PO1'!$B$8:$K$22,4,0)","v":"ASSENTAMENTO DE GUIA (MEIO-FIO) EM TRECHO RETO, CONFECCIONADA EM CONCRETO PRÉ-FABRICADO, DIMENSÕES 100X15X13X30 CM (COMPRIMENTO X BASE INFERIOR X BASE SUPERIOR X ALTURA), PARA VIAS URBANAS (USO VIÁRIO). AF_06/2016"},{"$nulls":12},{"$f":"SUM(E75:M75)","v":52000}]
[]
[null,"Dois lados x (nº de módulos) ",null,{"$f":"$M$8*2","v":4000},{"$nulls":6},{"$f":"$M$7","v":13},null,{"$f":"D74*K74","v":52000}]
[null,"TOTAL",{"$f":"A72","v":"4.1"},{"$nulls":9},{"$f":"M74","v":52000},{"$f":"VLOOKUP(C75,'PO1'!$B$8:$K$22,5,0)","v":"M"}]
[]
[5,{"$f":"VLOOKUP(A77,'PO1'!$B$8:$K$71,4,0)","v":"SERVIÇOS COMPLEMENTARES"}]
[]
["5.1",{"$f":"VLOOKUP(A79,'PO1'!$B$8:$K$32,4,0)","v":"CAIACAO EM MEIO FIO"},{"$nulls":12},{"$f":"M82","v":12480}]
[]
[null,"Dois lados x (nº de módulos) ",null,{"$f":"$M$8*2","v":4000},null,null,0.24,{"$f":"G81*D81","v":960},null,null,{"$f":"$M$7","v":13},null,{"$f":"H81*K81","v":12480}]
[null,"TOTAL",{"$f":"A79","v":"5.1"},{"$f":"D81","v":4000},{"$nulls":8},{"$f":"M81","v":12480},{"$f":"VLOOKUP(C82,'PO1'!$B$8:$K$71,5,0)","v":"m²"}]
[]
["5.2",{"$f":"VLOOKUP(A84,'PO1'!$B$8:$K$32,4,0)","v":"CONSERTO DE QUEBRA NO RAMAL NA RUA SEM PAVIMENTO COM FORNECIMENTO DE MATERIAL HIDRÁULICO"},{"$nulls":12},{"$f":"M87","v":52}]
[]
[null,"4 por módulo",{"$nulls":8},{"$f":"$M$7","v":13},4,{"$f":"L86*K86","v":52}]
[null,"TOTAL",{"$f":"A84","v":"5.2"},{"$f":"D86","v":0},{"$nulls":8},{"$f":"M86","v":52},{"$f":"VLOOKUP(C87,'PO1'!$B$8:$K$71,5,0)","v":"UND"}]
[]
["5.3",{"$f":"VLOOKUP(A89,'PO1'!$B$8:$K$32,4,0)","v":"ESCORAMENTO DE MEIO FIO COM MATERIAL LOCAL COMPACTADO MANUALMENTE, EM FAIXA DE 0,50M"},{"$nulls":12},{"$f":"M92","v":26000}]
[]
[null,"Dois lados x (nº de módulos) - 50%",0.5,{"$f":"$M$8*2","v":4000},{"$nulls":6},{"$f":"$M$7","v":13},null,{"$f":"D91*K91*C91","v":26000}]
[null,"TOTAL",{"$f":"A89","v":"5.3"},{"$f":"D91","v":4000},{"$nulls":8},{"$f":"M91","v":26000},{"$f":"VLOOKUP(C92,'PO1'!$B$8:$K$71,5,0)","v":"M"}]
[]
[6,{"$f":"VLOOKUP(A94,'PO1'!$B$8:$K$71,4,0)","v":"PROJETO EXECUTIVO"}]
[]
["6.1",{"$f":"VLOOKUP(A96,'PO1'!$B$8:$K$71,4,0)","v":"DETALHAMENTO PROJETO EXECUTIVO DE PAVIMENTAÇÃO"},{"$nulls":12},{"$f":"M99","v":156000}]
[]
[null,"Área do módulo ",null,{"$f":"$M$8","v":2000},{"$f":"$M$11","v":6},null,null,{"$f":"D98*E98*K98","v":156000},null,null,{"$f":"$M$7","v":13}]
[null,"TOTAL",{"$f":"A96","v":"6.1"},{"$nulls":9},{"$f":"H98","v":156000},{"$f":"VLOOKUP(C99,'PO1'!$B$8:$K$71,5,0)","v":"m²"}]
[]
[7,{"$f":"VLOOKUP(A101,'PO1'!$B$8:$K$71,4,0)","v":"MOMENTO DE TRANSPORTE"}]
[]
["7.1",{"$f":"VLOOKUP(A103,'PO1'!$B$8:$K$71,4,0)","v":"TRANSPORTE COM CAMINHÃO BASCULANTE DE 14 M³, EM VIA URBANA PAVIMENTADA, DMT ATÉ 30 KM (UNIDADE: M3XKM). AF_07/2020 (PEDRA)"},{"$nulls":12},{"$f":"M106","v":262080}]
[null,"Pedra"]
[null,"Área do paralelo x Esp. X Empolamento (40%) x DMT (10km)",null,{"$f":"$M$8","v":2000},{"$f":"$M$11","v":6},0.12,null,{"$f":"D105*E105*K105","v":156000},{"$f":"H105*L105*F105","v":26208},null,{"$f":"$M$7","v":13},1.4,{"$f":"I105*10","v":262080},null,null,"DMT de 10km"]
[null,"TOTAL",{"$f":"A103","v":"7.1"},{"$nulls":9},{"$f":"M105","v":262080},{"$f":"VLOOKUP(C106,'PO1'!$B$8:$K$71,5,0)","v":"M3XKM"}]
[]
["7.2",{"$f":"VLOOKUP(A108,'PO1'!$B$8:$K$71,4,0)","v":"TRANSPORTE COM CAMINHÃO BASCULANTE DE 14 M³, EM VIA URBANA PAVIMENTADA, ADICIONAL PARA DMT EXCEDENTE A 30 KM (UNIDADE: M3XKM). AF_07/2020 (PEDRA)"},{"$nulls":12},{"$f":"M111","v":0}]
[]
[]
[null,"TOTAL",{"$f":"A108","v":"7.2"},{"$nulls":9},0,{"$f":"VLOOKUP(C111,'PO1'!$B$8:$K$71,5,0)","v":"M3XKM"}]
[]
["7.3",{"$f":"VLOOKUP(A113,'PO1'!$B$8:$K$71,4,0)","v":"TRANSPORTE COM CAMINHÃO BASCULANTE DE 14 M³, EM VIA URBANA PAVIMENTADA, DMT ATÉ 30 KM (UNIDADE: M3XKM). AF_07/2020 (AREIA) "},{"$nulls":12},{"$f":"M116","v":222300}]
[null,"Areia"]
[null,"Área do paralelo x Coef X Empolamento (25%) x DMT (10km)",null,{"$f":"$M$8","v":2000},{"$f":"$M$11","v":6},0.114,null,{"$f":"D115*E115*K115","v":156000},{"$f":"H115*L115*F115","v":22230},null,{"$f":"$M$7","v":13},1.25,{"$f":"I115*10","v":222300}]
[null,"TOTAL",{"$f":"A113","v":"7.3"},{"$nulls":9},{"$f":"M115","v":222300},{"$f":"VLOOKUP(C116,'PO1'!$B$8:$K$71,5,0)","v":"M3XKM"}]
[]
["7.4",{"$f":"VLOOKUP(A118,'PO1'!$B$8:$K$71,4,0)","v":"TRANSPORTE COM CAMINHÃO BASCULANTE DE 14 M³, EM VIA URBANA PAVIMENTADA, ADICIONAL PARA DMT EXCEDENTE A 30 KM (UNIDADE: M3XKM). AF_07/2020 (AREIA)"},{"$nulls":12},{"$f":"M122","v":0}]
[]
[]
[]
[null,"TOTAL",{"$f":"A118","v":"7.4"},{"$nulls":9},{"$f":"SUM(M120:M121)","v":0},{"$f":"VLOOKUP(C122,'PO1'!$B$8:$K$71,5,0)","v":"M3XKM"}]
[]
["7.5",{"$f":"VLOOKUP(A124,'PO1'!$B$8:$K$71,4,0)","v":"TRANSPORTE COM CAMINHÃO BASCULANTE DE 14 M³, EM VIA URBANA PAVIMENTADA, DMT ATÉ 30 KM (UNIDADE: M3XKM). AF_07/2020  (BOTA-FORA)"},{"$nulls":12},{"$f":"M127","v":42900}]
[]
[null,"Volume de corte - Empolamento 25% (DMT 1km)",{"$nulls":6},{"$f":"$M$51","v":34320},null,null,1.25,{"$f":"I126*L126","v":42900}]
[null,"TOTAL",{"$f":"A124","v":"7.5"},{"$nulls":9},{"$f":"M126","v":42900},{"$f":"VLOOKUP(C127,'PO1'!$B$8:$K$71,5,0)","v":"M3XKM"}]
[]
["7.6",{"$f":"VLOOKUP(A129,'PO1'!$B$8:$K$71,4,0)","v":"TRANSPORTE COM CAMINHÃO BASCULANTE DE 14 M³, EM VIA URBANA PAVIMENTADA, ADICIONAL PARA DMT EXCEDENTE A 30 KM (UNIDADE: M3XKM). AF_07/2020 (BOTA-FORA)"},{"$nulls":12},{"$f":"M132","v":0}]
[]
[]
[null,"TOTAL",{"$f":"A129","v":"7.6"},{"$nulls":9},{"$f":"M130","v":0},{"$f":"VLOOKUP(C132,'PO1'!$B$8:$K$71,5,0)","v":"M3XKM"}]
[]
["7.7",{"$f":"VLOOKUP(A134,'PO1'!$B$8:$K$71,4,0)","v":"TRANSPORTE COM CAMINHÃO BASCULANTE DE 14 M³, EM VIA URBANA EM REVESTIMENTO PRIMÁRIO (UNIDADE: M3XKM). AF_07/2020 (BOTA-FORA)"},{"$nulls":12},{"$f":"M139","v":0}]
[]
[]
[]
[]
[null,"TOTAL",{"$f":"A134","v":"7.7"},{"$nulls":9},{"$f":"SUM(M137)","v":0},{"$f":"VLOOKUP(C139,'PO1'!$B$8:$K$71,5,0)","v":"M3XKM"}]

{"sheet":"CFF","index":3,"n_rows":29,"n_cols":16,"rows_kept":29,"cut":false,"hidden":false,"merged":[[7,0,8,0],[7,1,8,1],[0,2,0,8],[1,2,1,8],[2,2,2,8],[3,2,3,8],[4,2,4,8],[9,0,10,0],[9,1,10,1],[11,0,12,0],[11,1,12,1],[13,0,14,0],[13,1,14,1],[23,0,23,1],[24,0,24,1],[21,0,21,1],[22,0,22,1],[15,0,16,0],[15,1,16,1],[17,0,18,0],[17,1,18,1],[19,0,20,0],[19,1,20,1]]}
[null,null,"Ministério do Desenvolvimento Regional - MDR"]
[null,null,"Companhia de Desenvolvimento dos Vales do São Francisco e do Parnaíba"]
[null,null,"5ª Superintendência Regional"]
[null,null,"Gerência Regional de Infraestrutura"]
[null,null,"Unidade Regional de Estudos e Projetos"]
[]
["Item","Descrição","Total Por Etapa","MÊS 1","MÊS 2","MÊS 3","MÊS 4","MÊS 5","MÊS 6","MÊS 7","MÊS 8","MÊS 9","MÊS 10","MÊS 11","MÊS 12"]
[1,{"$f":"VLOOKUP(A8,'PO1'!B8:K32,4,0)","v":"SERVIÇOS PRELIMINARES"},{"$f":"SUM(D8:O8)","v":1},{"$f":"D27","v":2.8999999999999998E-3},{"$f":"E27","v":2.8999999999999998E-3},8.8599999999999998E-2,8.8599999999999998E-2,0.1082,0.1082,0.1082,0.1082,0.1082,8.8599999999999998E-2,9.3700000000000006E-2,9.3700000000000006E-2]
[null,null,{"$f":"VLOOKUP(A8,'PO1'!B8:K32,10,0)","v":266136.03000000003},{"$f":"D8*$C$9","v":771.794487},{"$f":"E8*$C$9","v":771.794487},{"$f":"F8*$C$9","v":23579.652258000002},{"$f":"G8*$C$9","v":23579.652258000002},28795.918446000003,28795.918446000003,28795.918446000003,{"$f":"K8*$C$9","v":28795.918446000003},28795.918446000003,23579.652258000002,24936.946011000004,24936.946011000004,{"$f":"TRUNC(SUM(D9:O9),2)","v":266136.03000000003}]
[2,{"$f":"VLOOKUP(A10,'PO1'!B10:K32,4,0)","v":"TERRAPLENAGEM"},{"$f":"SUM(D10:O10)","v":0.99999999999999989},null,null,0.09,0.09,0.11,0.11,0.11,0.11,0.11,0.09,0.09,0.09]
[null,null,{"$f":"VLOOKUP(A10,'PO1'!B10:K32,10,0)","v":1198579.2},null,null,{"$f":"$C$11*F10","v":107872.128},{"$f":"$C$11*G10","v":107872.128},131843.712,131843.712,131843.712,131843.712,131843.712,107872.128,107872.128,107872.128,{"$f":"TRUNC(SUM(D11:O11),2)","v":1198579.2}]
[3,{"$f":"VLOOKUP(A12,'PO1'!B12:K32,4,0)","v":"PAVIMENTAÇÃO"},{"$f":"SUM(D12:O12)","v":0.99999999999999989},null,null,0.09,0.09,0.11,0.11,0.11,0.11,0.11,0.09,0.09,0.09]
[null,null,{"$f":"VLOOKUP(A12,'PO1'!B12:K32,10,0)","v":13501800},null,null,{"$f":"$C$13*F12","v":1215162},{"$f":"$C$13*G12","v":1215162},1485198,1485198,1485198,1485198,1485198,1215162,1215162,1215162,{"$f":"TRUNC(SUM(D13:O13),2)","v":13501800}]
[4,{"$f":"VLOOKUP(A14,'PO1'!B14:K32,4,0)","v":"DRENAGEM"},{"$f":"SUM(D14:O14)","v":0.99999999999999989},null,null,0.09,0.09,0.11,0.11,0.11,0.11,0.11,0.09,0.09,0.09]
[null,null,{"$f":"VLOOKUP(A14,'PO1'!B14:K32,10,0)","v":3375320},null,null,{"$f":"$C$15*F14","v":303778.8},{"$f":"$C$15*G14","v":303778.8},371285.2,371285.2,371285.2,371285.2,371285.2,303778.8,303778.8,303778.8,{"$f":"TRUNC(SUM(D15:O15),2)","v":3375320}]
[5,{"$f":"VLOOKUP(A16,'PO1'!B19:K38,4,0)","v":"SERVIÇOS COMPLEMENTARES"},{"$f":"SUM(D16:O16)","v":1},{"$nulls":10},0.5,0.5]
[null,null,{"$f":"VLOOKUP(A16,'PO1'!B19:K38,10,0)","v":203857.16},{"$nulls":10},{"$f":"$C$17*N16","v":101928.58},101928.58,{"$f":"TRUNC(SUM(D17:O17),2)","v":203857.16}]
[6,{"$f":"VLOOKUP(A18,'PO1'!B19:K40,4,0)","v":"PROJETO EXECUTIVO"},{"$f":"SUM(D18:O18)","v":1},0.5,0.5]
[null,null,{"$f":"VLOOKUP(A18,'PO1'!B19:K40,10,0)","v":112320},{"$f":"$C$19*D18","v":56160},{"$f":"$C$19*E18","v":56160},{"$nulls":10},{"$f":"TRUNC(SUM(D19:O19),2)","v":112320}]
[7,{"$f":"VLOOKUP(A20,'PO1'!B20:K42,4,0)","v":"MOMENTO DE TRANSPORTE"},{"$f":"SUM(D20:O20)","v":0.99999999999999989},null,null,0.09,0.09,0.11,0.11,0.11,0.11,0.11,0.09,0.09,0.09]
[null,null,{"$f":"VLOOKUP(A20,'PO1'!B20:K42,10,0)","v":1323472.8},null,null,{"$f":"$C$21*F20","v":119112.552},{"$f":"$C$21*G20","v":119112.552},145582.008,145582.008,145582.008,145582.008,145582.008,119112.552,119112.552,119112.552,{"$f":"TRUNC(SUM(D21:O21),2)","v":1323472.8}]
["Porcentagem",null,null,{"$f":"(D23)/$P$22","v":2.8492273695196724E-3},{"$f":"(E23)/$P$22","v":2.8492273695196724E-3},{"$f":"(F23)/$P$22","v":8.8557237634346225E-2},8.8557237634346225E-2,0.10823543985250678,0.10823543985250678,0.10823543985250678,0.10823543985250678,0.10823543985250678,8.8557237634346225E-2,9.3726316547694005E-2,9.3726316547694005E-2,{"$f":"SUM(P8:P21)","v":19981485.190000001}]
["Custo",null,null,{"$f":"(SUM(D9,D11,D13,D15,D17,D19,D21))","v":56931.794486999999},{"$f":"(SUM(E9,E11,E13,E15,E17,E19,E21))","v":56931.794486999999},{"$f":"(SUM(F9,F11,F13,F15,F17,F19,F21))","v":1769505.1322579999},{"$f":"(SUM(G9,G11,G13,G15,G17,G19,G21))","v":1769505.1322579999},2162704.8384460001,2162704.8384460001,2162704.8384460001,2162704.8384460001,2162704.8384460001,1769505.1322579999,1872791.0060109999,1872791.0060109999]
["Porcentagem Acumulado",null,null,{"$f":"D22","v":2.8492273695196724E-3},{"$f":"D24+E22","v":5.6984547390393448E-3},{"$f":"E24+F22","v":9.4255692373385574E-2},{"$f":"F24+G22","v":0.1828129300077318},{"$f":"G24+H22","v":0.29104836986023858},{"$f":"H24+I22","v":0.39928380971274535},{"$f":"I24+J22","v":0.50751924956525207},0.61575468941775879,0.72399012927026551,0.81254736690461171,0.90627368345230574,{"$f":"N24+O22","v":0.99999999999999978}]
["Custo Acumulado",null,null,{"$f":"D23","v":56931.794486999999},{"$f":"D25+E23","v":113863.588974},{"$f":"E25+F23","v":1883368.7212319998},3652873.8534899997,5815578.6919359993,7978283.5303819999,10140988.368828001,12303693.207274001,14466398.045720002,16235903.177978002,18108694.183989003,{"$f":"N25+O23","v":19981485.190000005}]
[]
[null,null,null,2.8999999999999998E-3,2.8999999999999998E-3,8.8599999999999998E-2,8.8599999999999998E-2,0.1082,0.1082,0.1082,0.1082,0.1082,8.8599999999999998E-2,9.3700000000000006E-2,9.3700000000000006E-2]
["1.1",{"$f":"VLOOKUP(A28,'PO1'!B8:K32,4,0)","v":"ADMINISTRAÇÃO LOCAL"},{"$f":"VLOOKUP(A28,'PO1'!B8:K32,10,0)","v":135720},{"$f":"($C$28*D27)","v":393.58799999999997},{"$f":"($C$28*E27)","v":393.58799999999997},12024.791999999999,12024.791999999999,14684.904,14684.904,14684.904,14684.904,14684.904,12024.791999999999,12716.964,12716.964]
[null,null,{"$f":"$P$22-$C$28","v":19845765.190000001},{"$f":"(D23-D28)/$C$29","v":2.8488801487729378E-3},{"$f":"(E23-E28)/$C$29","v":2.8488801487729378E-3},8.8556945193706577E-2,8.8556945193706577E-2,0.10823568221639328,0.10823568221639328,0.10823568221639328,0.10823568221639328,0.10823568221639328,8.8556945193706577E-2,9.3726496519683955E-2,9.3726496519683955E-2]

{"sheet":"BDI DNIT D","index":4,"n_rows":69,"n_cols":15,"rows_kept":69,"cut":false,"hidden":true,"merged":[[66,1,66,2],[66,3,66,5],[67,1,67,7],[62,2,62,5],[63,1,63,2],[63,3,63,5],[64,1,64,2],[64,3,64,5],[65,1,65,2],[65,3,65,5],[61,2,61,5],[23,1,23,2],[23,3,23,5],[24,1,24,7],[25,1,25,8],[54,1,54,8],[55,1,55,8],[56,2,56,5],[57,2,57,5],[58,2,58,5],[59,2,59,5],[60,2,60,5],[11,1,11,8],[12,1,12,8],[22,1,22,2],[22,3,22,5],[1,3,1,8],[2,3,2,8],[3,3,3,8],[4,3,4,8],[5,3,5,8],[7,1,7,8]]}
[]
[null,null,null,"Ministério do Desenvolvimento Regional - MDR"]
[null,null,null,"Companhia de Desenvolvimento dos Vales do São Francisco e do Parnaíba"]
[null,null,null,"5ª Superintendência Regional"]
[null,null,null,"Gerência Regional de Infraestrutura"]
[null,null,null,"Unidade Regional de Estudos e Projetos"]
[]
[null,"ANEXO 3 - ENCARGOS SOCIAIS e COMPOSIÇÃO DO BDI"]
[]
[null,"Considerações:",null,"Fonte da composição, valores de referência e fórmula do BDI:  Instrução Normativa N° 62/DNIT SEDE."]
[null,null,null,"Ofício-Circular nº 4120/2023 (SEI DNIT nº 15308794)"]
[null,"BDI COM DESONERAÇÃO"]
[null,"DETALHAMENTO BDI - SERVIÇOS"]
[null,"ITEM","DESCRIÇÃO",null,null,null,"ITEM FORM","PREÇO DE VENDA (%)","CUSTO DIRETO (%)","Pequeno porte",null,"Médio Porte",null,"Grande Porte"]
[null,1,"ADMINISTRAÇÃO CENTRAL RATEIO",null,null,null,"AC",null,0.06,4.5100000000000001E-2,0.06,4.5699999999999998E-2,0.06,4.6300000000000001E-2,0.06]
[null,2,"DESPESAS FINANCEIRAS",null,null,null,"DF",9.7999999999999997E-3,null,9.5999999999999992E-3,1.2800000000000001E-2,9.7000000000000003E-3,1.2800000000000001E-2,9.7999999999999997E-3,1.2800000000000001E-2]
[null,3,"SEGURO E GARANTIAS CONTRATUAIS",null,null,null,"S",2.5000000000000001E-3,null,2.5000000000000001E-3,3.3E-3,2.5000000000000001E-3,3.3E-3,2.5000000000000001E-3,3.2000000000000002E-3]
[null,4,"RISCOS",null,null,null,"R",5.0000000000000001E-3,null,5.0000000000000001E-3,6.7000000000000002E-3,5.0000000000000001E-3,6.6E-3,5.0000000000000001E-3,6.4999999999999997E-3]
[null,5,"LUCRO",null,null,null,"L",null,7.0000000000000007E-2,7.51E-2,0.1,6.4699999999999994E-2,8.5000000000000006E-2,5.3999999999999999E-2,7.0000000000000007E-2]
[null,6,"TRIBUTOS",null,null,null,"I",{"$f":"SUM(H21:H24)","v":0.1115},null,{"$f":"SUM(J21:J24)","v":0.1115},{"$f":"SUM(K21:K24)","v":0.1484},{"$f":"SUM(L21:L24)","v":0.1115},{"$f":"SUM(M21:M24)","v":0.14649999999999999},{"$f":"SUM(N21:N24)","v":0.1115},0.14460000000000001]
[null,"06.01",null,"PIS",null,null,null,6.4999999999999997E-3,null,6.4999999999999997E-3,8.6999999999999994E-3,6.4999999999999997E-3,8.5000000000000006E-3,6.4999999999999997E-3,8.3999999999999995E-3]
[null,"06.02",null,"COFINS",null,null,null,0.03,null,0.03,3.9899999999999998E-2,0.03,3.9399999999999998E-2,0.03,3.8899999999999997E-2]
[null,"06.03",null,"ISS",null,null,null,0.03,null,0.03,3.9899999999999998E-2,0.03,3.9399999999999998E-2,0.03,3.8899999999999997E-2]
[null,"06.04",null,"Contribuição Sobre Receita Bruta",null,null,null,4.4999999999999998E-2,null,4.4999999999999998E-2,5.9900000000000002E-2,4.4999999999999998E-2,5.9200000000000003E-2,4.4999999999999998E-2,5.8400000000000001E-2]
[null,"BDI (%) = ",{"$nulls":6},{"$f":"ROUND((1+(I15+I19))/(1-(H16+H17+H18+H21+H22+H23+H24))-1,4)","v":0.29709999999999998},{"$f":"SUM(J15:J20)","v":0.24880000000000002},{"$f":"SUM(K15:K20)","v":0.33120000000000005},{"$f":"SUM(L15:L20)","v":0.23909999999999998},{"$f":"SUM(M15:M20)","v":0.31420000000000003},0.22910000000000003,0.29710000000000003]
[null,"* Observação: O percentual de ISSQN aqui utilizado consiste apenas em um referencial médio.  O valor real do ISSQN a ser adotado deve ser aquele proveniente das alíquotas dos municípios situados na área de influência das obras."]
{"$rows_empty":27}
[null,"Considerações:",null,"Fonte da composição, valores de referência e fórmula do BDI:  Instrução Normativa N° 62/DNIT SEDE."]
[null,"BDI DIFERENCIADO - SEM DESONERAÇÃO"]
[null,"DETALHAMENTO BDI - DIFERENCIADO"]
[null,"ITEM","DESCRIÇÃO",null,null,null,"ITEM FORM","PREÇO DE VENDA (%)","CUSTO DIRETO (%)"]
[null,1,"ADMINISTRAÇÃO CENTRAL RATEIO",null,null,null,"AC",null,3.8100000000000002E-2]
[null,2,"DESPESAS FINANCEIRAS",null,null,null,"DF",9.7999999999999997E-3]
[null,3,"SEGURO E GARANTIAS CONTRATUAIS",null,null,null,"S",2.5000000000000001E-3]
[null,4,"RISCOS",null,null,null,"R",5.0000000000000001E-3]
[null,5,"LUCRO",null,null,null,"L",null,0.05]
[null,6,"TRIBUTOS",null,null,null,"I",{"$f":"SUM(H64:H67)","v":8.1499999999999989E-2}]
[null,"06.01",null,"PIS",null,null,null,6.4999999999999997E-3]
[null,"06.02",null,"COFINS",null,null,null,0.03]
[null,"06.03",null,"ISS",null,null,null,0]
[null,"06.04",null,"Contribuição Sobre Receita Bruta",null,null,null,4.4999999999999998E-2]
[null,"BDI (%) =",{"$nulls":6},{"$f":"ROUND((1+(I58+I62))/(1-(H59+H60+H61+H64+H65+H66+H67))-1,4)","v":0.2074}]
[null,"Considerações:",null,"Fonte da composição, valores de referência e fórmula do BDI:  Instrução Normativa N° 62/DNIT SEDE."]

{"sheet":"BDI + ES","index":5,"n_rows":103,"n_cols":11,"rows_kept":103,"cut":false,"hidden":false,"merged":[[23,2,23,5],[24,3,24,5],[25,3,25,5],[18,2,18,5],[19,2,19,5],[20,2,20,5],[21,2,21,5],[22,2,22,5],[75,2,75,3],[76,2,76,3],[77,2,77,3],[79,2,79,3],[16,8,17,10],[49,8,49,10],[17,1,17,7],[16,1,16,7],[24,1,24,2],[25,1,25,2],[65,2,66,3],[68,2,68,3],[69,2,69,3],[36,2,36,5],[33,8,33,10],[58,3,58,5],[91,2,91,3],[81,2,81,3],[82,2,82,3],[83,2,83,3],[84,2,84,3],[85,2,85,3],[90,1,90,7],[86,2,86,3],[87,2,87,3],[88,2,88,3],[89,2,89,3],[98,2,98,3],[99,2,99,3],[100,2,100,3],[97,1,97,7],[27,1,27,2],[92,2,92,3],[93,2,93,3],[94,2,94,3],[95,2,95,3],[96,2,96,3],[43,3,43,5],[44,1,44,6],[49,1,49,7],[64,1,64,7],[53,2,53,5],[54,2,54,5],[80,2,80,3],[37,2,37,5],[38,2,38,5],[50,2,50,5],[51,2,51,5],[52,2,52,5],[43,1,43,2],[70,2,70,3],[71,2,71,3],[72,2,72,3],[73,2,73,3],[74,2,74,3],[40,3,40,5],[57,1,57,2],[57,3,57,5],[58,1,58,2],[14,1,14,4],[42,1,42,2],[42,3,42,5],[102,1,102,3],[65,4,65,5],[65,1,66,1],[101,1,101,6],[65,6,65,7],[67,1,67,7],[78,1,78,7],[39,2,39,5],[40,1,40,2],[32,1,32,7],[33,1,33,7],[34,2,34,5],[35,2,35,5],[1,3,1,7],[2,3,2,7],[3,3,3,7],[4,3,4,7],[5,3,5,7],[60,1,60,6],[41,1,41,2],[41,3,41,5],[26,3,26,5],[27,3,27,5],[59,1,59,2],[59,3,59,5],[55,2,55,5],[56,1,56,2],[56,3,56,5],[28,1,28,6],[26,1,26,2]]}
[]
[null,null,null,"Ministério da Integração e do Desenvolvimento Regional - MIDR"]
[null,null,null,"Companhia de Desenvolvimento dos Vales do São Francisco e do Parnaíba"]
[null,null,null,"5ª Superintendência Regional"]
[null,null,null,"Gerência Regional de Infraestrutura"]
[null,null,null,"Unidade Regional de Estudos e Projetos"]
[]
[null,"Considerações:",null,"Acórdão  Nº 2622/2013 – TCU – Plenário de 25/9/2013"]
[]
[]
[]
[]
[null,null,null,"Acórdão nº 2369/2011 - TCU - Plenário - DOU nº174 em 20 de setembro de 2011"]
[]
[null,"CONSTRUÇÃO DE RODOVIAS E FERROVIAS"]
[]
[null,"BDI SEM DESONERAÇÃO",{"$nulls":6},{"$f":"B15","v":"CONSTRUÇÃO DE RODOVIAS E FERROVIAS"}]
[null,"DETALHAMENTO BDI - SERVIÇOS"]
[null,"ITEM","DESCRIÇÃO",null,null,null,"ITEM FORM","TOTAL","1º QUARTIL","MEDIA","3º QUARTIL"]
[null,1,"ADMINISTRAÇÃO CENTRAL RATEIO",null,null,null,"AC",4.0099999999999997E-2,{"$f":"HLOOKUP($B$15&\" 1\",[39]DADOS!$B$7:$P$18,3,FALSE)","v":3.7999999999999999E-2},{"$f":"HLOOKUP($B$15&\" 2\",[39]DADOS!$B$7:$P$18,3,FALSE)","v":4.0099999999999997E-2},{"$f":"HLOOKUP($B$15&\" 3\",[39]DADOS!$B$7:$P$18,3,FALSE)","v":4.6699999999999998E-2}]
[null,2,"DESPESAS FINANCEIRAS",null,null,null,"DF",1.11E-2,{"$f":"HLOOKUP($B$15&\" 1\",[39]DADOS!$B$7:$P$18,4,FALSE)","v":1.0200000000000001E-2},{"$f":"HLOOKUP($B$15&\" 2\",[39]DADOS!$B$7:$P$18,4,FALSE)","v":1.11E-2},{"$f":"HLOOKUP($B$15&\" 3\",[39]DADOS!$B$7:$P$18,4,FALSE)","v":1.21E-2}]
[null,3,"RISCO, SEGURO E GARANTIA",null,null,null,"R",{"$f":"0.4%+0.56%","v":9.6000000000000009E-3},{"$f":"HLOOKUP($B$15&\" 1\",[39]DADOS!$B$7:$P$18,5,FALSE)","v":8.2000000000000007E-3},{"$f":"HLOOKUP($B$15&\" 2\",[39]DADOS!$B$7:$P$18,5,FALSE)","v":9.6000000000000009E-3},{"$f":"HLOOKUP($B$15&\" 3\",[39]DADOS!$B$7:$P$18,5,FALSE)","v":1.7100000000000001E-2}]
[null,4,"EXPECTATIVA DE LUCRO",null,null,null,"L",7.2999999999999995E-2,{"$f":"HLOOKUP($B$15&\" 1\",[39]DADOS!$B$7:$P$18,6,FALSE)","v":6.6400000000000001E-2},{"$f":"HLOOKUP($B$15&\" 2\",[39]DADOS!$B$7:$P$18,6,FALSE)","v":7.2999999999999995E-2},{"$f":"HLOOKUP($B$15&\" 3\",[39]DADOS!$B$7:$P$18,6,FALSE)","v":8.6900000000000005E-2}]
[null,5,"TRIBUTOS",null,null,null,"I",{"$f":"SUM(H25:H28)","v":6.1499999999999999E-2}]
[null,"05.01",null,"PIS",null,null,null,6.4999999999999997E-3]
[null,"05.02",null,"COFINS",null,null,null,0.03]
[null,"05.03",null,"ISS",null,null,null,2.5000000000000001E-2]
[null,"05.04",null,"Contribuição Sobre Receita Bruta",null,null,null,0]
[null,"BDI (%) = ((((1+AC+R)*(1+DF)*(1+L))/(1-I))-1)",{"$nulls":5},{"$f":"ROUND((((1+H20+H22)*(1+H21)*(1+H23))/(1-H24))-1,4)","v":0.2135},{"$f":"HLOOKUP($B$15&\" 1\",[39]DADOS!$B$7:$P$18,12,FALSE)","v":0.19600000000000001},{"$f":"HLOOKUP($B$15&\" 2\",[39]DADOS!$B$7:$P$18,12,FALSE)","v":0.2097},{"$f":"HLOOKUP($B$15&\" 3\",[39]DADOS!$B$7:$P$18,12,FALSE)","v":0.24229999999999999}]
[null,"* VALORES DE PIS E COFINS SEGUNDO ALIQ MÁXIMA DO REGIME CUMULATIVO"]
[]
[]
[null,"BDI COM DESONERAÇÃO"]
[null,"DETALHAMENTO BDI - SERVIÇOS"]
[null,"ITEM","DESCRIÇÃO",null,null,null,"ITEM FORM","TOTAL"]
[null,1,"ADMINISTRAÇÃO CENTRAL RATEIO",null,null,null,"AC",{"$f":"H20","v":4.0099999999999997E-2}]
[null,2,"DESPESAS FINANCEIRAS",null,null,null,"DF",{"$f":"H21","v":1.11E-2}]
[null,3,"RISCO, SEGURO E GARANTIA",null,null,null,"R",{"$f":"H22","v":9.6000000000000009E-3}]
[null,4,"EXPECTATIVA DE LUCRO",null,null,null,"L",{"$f":"H23","v":7.2999999999999995E-2}]
[null,5,"TRIBUTOS",null,null,null,"I",{"$f":"SUM(H41:H44)","v":0.1065}]
[null,"05.01",null,"PIS",null,null,null,{"$f":"H25","v":6.4999999999999997E-3}]
[null,"05.02",null,"COFINS",null,null,null,{"$f":"H26","v":0.03}]
[null,"05.03",null,"ISS",null,null,null,{"$f":"H27","v":2.5000000000000001E-2}]
[null,"05.04",null,"Contribuição Sobre Receita Bruta",null,null,null,4.4999999999999998E-2]
[null,"BDI (%) = ((((1+AC+R)*(1+DF)*(1+L))/(1-I))-1)",{"$nulls":5},{"$f":"ROUND((((1+H36+H38)*(1+H37)*(1+H39))/(1-H40))-1,4)","v":0.27460000000000001}]
[null,{"$f":"B30","v":"* VALORES DE PIS E COFINS SEGUNDO ALIQ MÁXIMA DO REGIME CUMULATIVO"}]
[null,"** PERCENTUAL DE CSRB EM CONFORMIDADE COM AS LEIS Nº 12.546/2011 E Nº 13.161/2015"]
[]
[]
[null,"DETALHAMENTO BDI - MATERIAIS",{"$nulls":6},"BDI DE MATERIAIS"]
[null,"ITEM","DESCRIÇÃO",null,null,null,"ITEM FORM","TOTAL","1º QUARTIL","MEDIA","3º QUARTIL"]
[null,1,"ADMINISTRAÇÃO CENTRAL RATEIO",null,null,null,"AC",3.4500000000000003E-2,1.4999999999999999E-2,3.4500000000000003E-2,4.4900000000000002E-2]
[null,2,"DESPESAS FINANCEIRAS",null,null,null,"DF",8.5000000000000006E-3,8.5000000000000006E-3,8.5000000000000006E-3,1.11E-2]
[null,3,"RISCO, SEGURO E GARANTIA",null,null,null,"R",{"$f":"0.48%+0.85%","v":1.3299999999999999E-2},{"$f":"0.3%+0.56%","v":8.6E-3},{"$f":"0.48%+0.85%","v":1.3299999999999999E-2},{"$f":"0.82%+0.89%","v":1.7099999999999997E-2}]
[null,4,"EXPECTATIVA DE LUCRO",null,null,null,"L",5.11E-2,3.5000000000000003E-2,5.11E-2,6.2199999999999998E-2]
[null,5,"TRIBUTOS",null,null,null,"I",{"$f":"SUM(H57:H60)","v":3.6499999999999998E-2}]
[null,"05.01",null,"PIS",null,null,null,{"$f":"H41","v":6.4999999999999997E-3}]
[null,"05.02",null,"COFINS",null,null,null,{"$f":"H42","v":0.03}]
[null,"05.03",null,"ISS",null,null,null,0]
[null,"05.04",null,"Contribuição Sobre Receita Bruta",null,null,null,0]
[null,"BDI (%) = ((((1+AC+R)*(1+DF)*(1+L))/(1-I))-1)",{"$nulls":5},{"$f":"ROUND((((1+H52+H54)*(1+H53)*(1+H55))/(1-H56))-1,4)","v":0.15279999999999999},0.111,0.14019999999999999,0.16800000000000001]
[null,{"$f":"B46","v":"* VALORES DE PIS E COFINS SEGUNDO ALIQ MÁXIMA DO REGIME CUMULATIVO"}]
[null,"** PARA INSUMOS ASFÁLTICOS COMO CAP, EMULSÃO, ETC., CONSIDERAR BDI = 15% (NÃO PRECISA DETALHAR)"]
[]
[null,"ENCARGOS SOCIAIS SOBRE A MÃO DE OBRA"]
[null,"CÓDIGO","DESCRIÇÃO",null,"COM DESONERAÇÃO",null,"SEM DESONERAÇÃO"]
[{"$nulls":4},"HORISTA %","MENSALISTA %","HORISTA %","MENSALISTA %"]
[null,"GRUPO A"]
[null,"A1","INSS",null,0,0,20,20]
[null,"A2","SESI",null,1.5,1.5,1.5,1.5]
[null,"A3","SENAI",null,1,1,1,1]
[null,"A4","INCRA",null,0.2,0.2,0.2,0.2]
[null,"A5","SEBRAE",null,0.6,0.6,0.6,0.6]
[null,"A6","Salário Educação",null,2.5,2.5,2.5,2.5]
[null,"A7","Seguro Contra Acidentes de Trabalho",null,3,3,3,3]
[null,"A8","FGTS",null,8,8,8,8]
[null,"A9","SECONCI",null,0,0,0,0]
[null,"A","Total",null,{"$f":"SUM(E69:E77)","v":16.8},{"$f":"SUM(F69:F77)","v":16.8},{"$f":"SUM(G69:G77)","v":36.799999999999997},{"$f":"SUM(H69:H77)","v":36.799999999999997}]
[null,"GRUPO B"]
[null,"B1","Repouso Semanal Remunerado",null,18.059999999999999,"-",18.059999999999999,"-"]
[null,"B2","Feriados",null,4.68,"-",4.68,"-"]
[null,"B3","Auxílio-enfermidade",null,0.87,0.66,0.87,0.66]
[null,"B4","13° salário",null,11.07,8.33,11.07,8.33]
[null,"B5","Licença-paternidade",null,7.0000000000000007E-2,0.05,7.0000000000000007E-2,0.05]
[null,"B6","Faltas Justificadas",null,0.74,0.56000000000000005,0.74,0.56000000000000005]
[null,"B7","Dias de chuva",null,1.88,"-",1.88,"-"]
[null,"B8","Auxílio Acidente de Trabalho",null,0.11,0.08,0.11,0.08]
[null,"B9","Férias Gozadas",null,11.16,8.4,11.16,8.4]
[null,"B10","Salário Maternidade",null,0.04,0.03,0.04,0.03]
[null,"B","Total ",null,{"$f":"SUM(E80:E89)","v":48.68},{"$f":"SUM(F80:F89)","v":18.110000000000003},{"$f":"SUM(G80:G89)","v":48.68},{"$f":"SUM(H80:H89)","v":18.110000000000003}]
[null,"GRUPO C"]
[null,"C1","Aviso Prévio Indenizado",null,4.8099999999999996,3.62,4.8099999999999996,3.62]
[null,"C2","Aviso Prévio Trabalhado",null,0.11,0.09,0.11,0.09]
[null,"C3","Férias Indenizadas",null,2.98,2.2400000000000002,2.98,2.2400000000000002]
[null,"C4","Depósito Rescisão Sem Justa Causa",null,2.78,2.09,2.78,2.09]
[null,"C5","Indenização Adicional",null,0.4,0.3,0.4,0.3]
[null,"C","Total ",null,{"$f":"SUM(E92:E96)","v":11.08},{"$f":"SUM(F92:F96)","v":8.34},{"$f":"SUM(G92:G96)","v":11.08},{"$f":"SUM(H92:H96)","v":8.34}]
[null,"GRUPO D"]
[null,"D1","Reincidência de A sobre B",null,{"$f":"ROUND(E78*E90/100,2)","v":8.18},{"$f":"ROUND(F78*F90/100,2)","v":3.04},{"$f":"ROUND(G78*G90/100,2)","v":17.91},{"$f":"ROUND(H78*H90/100,2)","v":6.66}]
[null,"D2","Reincidência de Grupo A sobre Aviso Prévio Trabalhado e Reincidência do FGTS sobre Aviso Prévio Indenizado",null,{"$f":"ROUND((E78*E93+E76*E92)/100,2)","v":0.4},{"$f":"ROUND((F78*F93+F76*F92)/100,2)","v":0.3},{"$f":"ROUND((G78*G93+G76*G92)/100,2)","v":0.43},{"$f":"ROUND((H78*H93+H76*H92)/100,2)","v":0.32}]
[null,"D","Total",null,{"$f":"ROUND(SUM(E99:E100),2)","v":8.58},{"$f":"ROUND(SUM(F99:F100),2)","v":3.34},{"$f":"ROUND(SUM(G99:G100),2)","v":18.34},{"$f":"ROUND(SUM(H99:H100),2)","v":6.98}]
[]
[null,"T O T A L (%)",null,null,{"$f":"E78+E90+E97+E101","v":85.14},{"$f":"F78+F90+F97+F101","v":46.59},{"$f":"G78+G90+G97+G101","v":114.89999999999999},{"$f":"SUM(H78+H90+H97+H101)","v":70.23}]

{"sheet":"CFF2","index":6,"n_rows":23,"n_cols":34,"rows_kept":23,"cut":false,"hidden":true,"merged":[[7,32,7,33],[19,0,19,1],[7,8,7,9],[7,10,7,11],[7,12,7,13],[7,14,7,15],[7,20,7,21],[7,22,7,23],[7,0,8,0],[7,1,8,1],[7,2,8,2],[7,3,8,3],[7,4,7,5],[19,16,19,17],[3,18,3,24],[4,18,4,24],[7,6,7,7],[7,16,8,16],[7,17,8,17],[3,2,3,8],[4,2,4,8],[6,0,6,15],[6,16,6,31],[7,24,7,25],[7,26,7,27],[7,28,7,29],[7,30,7,31],[7,18,8,18],[7,19,8,19],[0,2,0,8],[1,2,1,8],[0,18,0,24],[1,18,1,24],[2,18,2,24],[2,2,2,8]]}
[null,null,"Ministério do Desenvolvimento Regional - MDR",{"$nulls":15},"Ministério do Desenvolvimento Regional - MDR"]
[null,null,"Companhia de Desenvolvimento dos Vales do São Francisco e do Parnaíba",{"$nulls":15},"Companhia de Desenvolvimento dos Vales do São Francisco e do Parnaíba"]
[null,null,"5ª Superintendência Regional",{"$nulls":15},"5ª Superintendência Regional"]
[null,null,"Gerência Regional de Infraestrutura",{"$nulls":15},"Gerência Regional de Infraestrutura"]
[null,null,"Unidade Regional de Estudos e Projetos",{"$nulls":15},"Unidade Regional de Estudos e Projetos"]
[]
["Cronograma Físico e Financeiro ",{"$nulls":15},"Cronograma Físico e Financeiro "]
["ITEM","ETAPA","%","R$","30 dias",null,"60 dias",null,"90 dias",null,"120 dias",null,"150 dias",null,"180 dias",null,"ITEM","ETAPA","%","R$","210 dias",null,"240 dias",null,"270 dias",null,"300 dias",null,"330 dias",null,"360 dias",null,"Total"]
[{"$nulls":4},"%","R$","%","R$","%","R$","%","R$","%","R$","%","R$",{"$nulls":4},"%","R$","%","R$","%","R$","%","R$","%","R$","%","R$","%","R$"]
[1,{"$f":"VLOOKUP(A10,#REF!,4,0)","v":{"$error":"#REF!"}},{"$f":"D10/$D$20","v":{"$error":"#REF!"}},{"$f":"VLOOKUP(A10,#REF!,10,0)","v":{"$error":"#REF!"}},6.4999999999999997E-3,{"$f":"IF(E10=\"\",\"\",E10*$D10)","v":{"$error":"#REF!"}},6.0000000000000001E-3,{"$f":"IF(G10=\"\",\"\",G10*$D10)","v":{"$error":"#REF!"}},2.8899999999999999E-2,{"$f":"IF(I10=\"\",\"\",I10*$D10)","v":{"$error":"#REF!"}},2.93E-2,{"$f":"IF(K10=\"\",\"\",K10*$D10)","v":{"$error":"#REF!"}},0.11749999999999999,{"$f":"IF(M10=\"\",\"\",M10*$D10)","v":{"$error":"#REF!"}},0.11749999999999999,{"$f":"IF(O10=\"\",\"\",O10*$D10)","v":{"$error":"#REF!"}},{"$f":"A10","v":1},{"$f":"B10","v":{"$error":"#REF!"}},{"$f":"T10/$D$20","v":{"$error":"#REF!"}},{"$f":"D10","v":{"$error":"#REF!"}},0.11749999999999999,{"$f":"IF(U10=\"\",\"\",U10*$D10)","v":{"$error":"#REF!"}},0.11749999999999999,{"$f":"IF(W10=\"\",\"\",W10*$D10)","v":{"$error":"#REF!"}},0.1169,{"$f":"IF(Y10=\"\",\"\",Y10*$D10)","v":{"$error":"#REF!"}},0.11219999999999999,{"$f":"IF(AA10=\"\",\"\",AA10*$D10)","v":{"$error":"#REF!"}},0.1152,{"$f":"IF(AC10=\"\",\"\",AC10*$D10)","v":{"$error":"#REF!"}},0.115,{"$f":"IF(AE10=\"\",\"\",AE10*$D10)","v":{"$error":"#REF!"}},{"$f":"SUM(AE10,AC10,AA10,Y10,W10,U10,O10,M10,I10,G10,E10,K10)","v":0.99999999999999978},{"$f":"SUM(AF10,AD10,AB10,Z10,X10,V10,P10,N10,J10,H10,F10,L10)","v":{"$error":"#REF!"}}]
[2,{"$f":"VLOOKUP(A11,#REF!,4,0)","v":{"$error":"#REF!"}},{"$f":"D11/$D$20","v":{"$error":"#REF!"}},{"$f":"VLOOKUP(A11,#REF!,10,0)","v":{"$error":"#REF!"}},null,{"$f":"IF(E11=\"\",\"\",E11*$D11)","v":""},0.125,{"$f":"IF(G11=\"\",\"\",G11*$D11)","v":{"$error":"#REF!"}},0.125,{"$f":"IF(I11=\"\",\"\",I11*$D11)","v":{"$error":"#REF!"}},0.125,{"$f":"IF(K11=\"\",\"\",K11*$D11)","v":{"$error":"#REF!"}},0.125,{"$f":"IF(M11=\"\",\"\",M11*$D11)","v":{"$error":"#REF!"}},0.125,{"$f":"IF(O11=\"\",\"\",O11*$D11)","v":{"$error":"#REF!"}},{"$f":"A11","v":2},{"$f":"B11","v":{"$error":"#REF!"}},{"$f":"T11/$D$20","v":{"$error":"#REF!"}},{"$f":"D11","v":{"$error":"#REF!"}},0.125,{"$f":"IF(U11=\"\",\"\",U11*$D11)","v":{"$error":"#REF!"}},0.125,{"$f":"IF(W11=\"\",\"\",W11*$D11)","v":{"$error":"#REF!"}},0.125,{"$f":"IF(Y11=\"\",\"\",Y11*$D11)","v":{"$error":"#REF!"}},null,{"$f":"IF(AA11=\"\",\"\",AA11*$D11)","v":""},null,{"$f":"IF(AC11=\"\",\"\",AC11*$D11)","v":""},null,{"$f":"IF(AE11=\"\",\"\",AE11*$D11)","v":""},1,{"$error":"#REF!"}]
[3,{"$f":"VLOOKUP(A12,#REF!,4,0)","v":{"$error":"#REF!"}},{"$error":"#REF!"},{"$f":"VLOOKUP(A12,#REF!,10,0)","v":{"$error":"#REF!"}},null,"",null,"",null,"",null,"",0.125,{"$error":"#REF!"},0.125,{"$error":"#REF!"},3,{"$error":"#REF!"},{"$error":"#REF!"},{"$error":"#REF!"},0.125,{"$error":"#REF!"},0.125,{"$error":"#REF!"},0.125,{"$error":"#REF!"},0.125,{"$error":"#REF!"},0.125,{"$error":"#REF!"},0.125,{"$error":"#REF!"},1,{"$error":"#REF!"}]
[4,{"$f":"VLOOKUP(A13,#REF!,4,0)","v":{"$error":"#REF!"}},{"$error":"#REF!"},{"$f":"VLOOKUP(A13,#REF!,10,0)","v":{"$error":"#REF!"}},null,"",null,{"$f":"IF(G13=\"\",\"\",G13*$D13)","v":""},null,"",null,"",0.125,{"$f":"IF(M13=\"\",\"\",M13*$D13)","v":{"$error":"#REF!"}},0.125,{"$f":"IF(O13=\"\",\"\",O13*$D13)","v":{"$error":"#REF!"}},4,{"$error":"#REF!"},{"$error":"#REF!"},{"$error":"#REF!"},0.125,{"$error":"#REF!"},0.125,{"$error":"#REF!"},0.125,{"$error":"#REF!"},0.125,{"$error":"#REF!"},0.125,{"$error":"#REF!"},0.125,{"$error":"#REF!"},{"$f":"SUM(AE13,AC13,AA13,Y13,W13,U13,O13,M13,I13,G13,E13,K13)","v":1},{"$error":"#REF!"}]
[5,{"$f":"VLOOKUP(A14,#REF!,4,0)","v":{"$error":"#REF!"}},{"$error":"#REF!"},{"$f":"VLOOKUP(A14,#REF!,10,0)","v":{"$error":"#REF!"}},null,"",null,{"$f":"IF(G14=\"\",\"\",G14*$D14)","v":""},0.1,{"$error":"#REF!"},0.1,{"$error":"#REF!"},0.1,{"$error":"#REF!"},0.1,{"$error":"#REF!"},5,{"$error":"#REF!"},{"$error":"#REF!"},{"$error":"#REF!"},0.1,{"$error":"#REF!"},0.1,{"$error":"#REF!"},0.1,{"$error":"#REF!"},0.1,{"$error":"#REF!"},0.1,{"$error":"#REF!"},0.1,{"$error":"#REF!"},0.99999999999999989,{"$error":"#REF!"}]
[6,{"$f":"VLOOKUP(A15,#REF!,4,0)","v":{"$error":"#REF!"}},{"$error":"#REF!"},{"$f":"VLOOKUP(A15,#REF!,10,0)","v":{"$error":"#REF!"}},0.05,{"$error":"#REF!"},0.05,{"$error":"#REF!"},0.05,{"$error":"#REF!"},0.05,{"$error":"#REF!"},0.05,{"$error":"#REF!"},0.05,{"$error":"#REF!"},6,{"$error":"#REF!"},{"$error":"#REF!"},{"$error":"#REF!"},0.05,{"$error":"#REF!"},0.05,{"$error":"#REF!"},0.05,{"$error":"#REF!"},0.05,{"$error":"#REF!"},0.25,{"$error":"#REF!"},0.25,{"$error":"#REF!"},1.0000000000000004,{"$error":"#REF!"}]
[7,{"$f":"VLOOKUP(A16,#REF!,4,0)","v":{"$error":"#REF!"}},{"$error":"#REF!"},{"$f":"VLOOKUP(A16,#REF!,10,0)","v":{"$error":"#REF!"}},null,"",0.1,{"$error":"#REF!"},0.1,{"$error":"#REF!"},0.15,{"$error":"#REF!"},0.15,{"$error":"#REF!"},0.15,{"$error":"#REF!"},7,{"$error":"#REF!"},{"$error":"#REF!"},{"$error":"#REF!"},0.15,{"$error":"#REF!"},0.15,{"$error":"#REF!"},0.05,{"$error":"#REF!"},null,"",null,"",null,"",1,{"$error":"#REF!"}]
[8,{"$f":"VLOOKUP(A17,#REF!,4,0)","v":{"$error":"#REF!"}},{"$error":"#REF!"},{"$f":"VLOOKUP(A17,#REF!,10,0)","v":{"$error":"#REF!"}},1,{"$error":"#REF!"},null,"",null,"",null,"",null,"",null,"",8,{"$error":"#REF!"},{"$error":"#REF!"},{"$error":"#REF!"},null,"",null,"",null,"",null,"",null,"",null,"",1,{"$error":"#REF!"}]
[9,{"$f":"VLOOKUP(A18,#REF!,4,0)","v":{"$error":"#REF!"}},{"$error":"#REF!"},{"$f":"VLOOKUP(A18,#REF!,10,0)","v":{"$error":"#REF!"}},null,"",0.05,{"$error":"#REF!"},0.1,{"$error":"#REF!"},0.1,{"$error":"#REF!"},0.1,{"$error":"#REF!"},0.1,{"$error":"#REF!"},9,{"$error":"#REF!"},{"$f":"T18/$D$20","v":{"$error":"#REF!"}},{"$error":"#REF!"},0.1,{"$error":"#REF!"},0.1,{"$error":"#REF!"},0.1,{"$error":"#REF!"},0.1,{"$error":"#REF!"},0.1,{"$error":"#REF!"},0.05,{"$error":"#REF!"},0.99999999999999989,{"$error":"#REF!"}]
[10,{"$f":"VLOOKUP(A19,#REF!,4,0)","v":{"$error":"#REF!"}},{"$error":"#REF!"},{"$f":"VLOOKUP(A19,#REF!,10,0)","v":{"$error":"#REF!"}},null,"",null,"",0.1,{"$error":"#REF!"},0.1,{"$error":"#REF!"},0.1,{"$error":"#REF!"},0.1,{"$error":"#REF!"},10,{"$error":"#REF!"},{"$error":"#REF!"},{"$error":"#REF!"},0.1,{"$error":"#REF!"},0.1,{"$error":"#REF!"},0.1,{"$error":"#REF!"},0.1,{"$error":"#REF!"},0.1,{"$error":"#REF!"},0.1,{"$error":"#REF!"},0.99999999999999989,{"$error":"#REF!"}]
["TOTAL GERAL",null,{"$f":"SUM(C10:C19)","v":{"$error":"#REF!"}},{"$f":"SUM(D10:D19)","v":{"$error":"#REF!"}},{"$f":"F20/$D$20","v":{"$error":"#REF!"}},{"$f":"SUM(F10:F19)","v":{"$error":"#REF!"}},{"$f":"H20/$D$20","v":{"$error":"#REF!"}},{"$f":"SUM(H10:H19)","v":{"$error":"#REF!"}},{"$f":"J20/$D$20","v":{"$error":"#REF!"}},{"$f":"SUM(J10:J19)","v":{"$error":"#REF!"}},{"$f":"L20/$D$20","v":{"$error":"#REF!"}},{"$f":"SUM(L10:L19)","v":{"$error":"#REF!"}},{"$f":"N20/$D$20","v":{"$error":"#REF!"}},{"$f":"SUM(N10:N19)","v":{"$error":"#REF!"}},{"$f":"P20/$D$20","v":{"$error":"#REF!"}},{"$f":"SUM(P10:P19)","v":{"$error":"#REF!"}},"TOTAL GERAL",null,{"$f":"SUM(S10:S19)","v":{"$error":"#REF!"}},{"$f":"SUM(T10:T19)","v":{"$error":"#REF!"}},{"$f":"V20/$D$20","v":{"$error":"#REF!"}},{"$f":"SUM(V10:V19)","v":{"$error":"#REF!"}},{"$f":"X20/$D$20","v":{"$error":"#REF!"}},{"$f":"SUM(X10:X19)","v":{"$error":"#REF!"}},{"$f":"Z20/$D$20","v":{"$error":"#REF!"}},{"$f":"SUM(Z10:Z19)","v":{"$error":"#REF!"}},{"$f":"AB20/$D$20","v":{"$error":"#REF!"}},{"$f":"SUM(AB10:AB19)","v":{"$error":"#REF!"}},{"$f":"AD20/$D$20","v":{"$error":"#REF!"}},{"$f":"SUM(AD10:AD19)","v":{"$error":"#REF!"}},{"$f":"AF20/$D$20","v":{"$error":"#REF!"}},{"$f":"SUM(AF10:AF19)","v":{"$error":"#REF!"}},{"$f":"SUM(AE20,AC20,AA20,Y20,W20,U20,O20,M20,I20,G20,E20,K20)","v":{"$error":"#REF!"}},{"$f":"SUM(AH10:AH19)","v":{"$error":"#REF!"}}]
[]
["1.1","ADMINISTRAÇÃO LOCAL",null,{"$f":"VLOOKUP(A22,#REF!,10,0)","v":{"$error":"#REF!"}},6.4999999999999997E-3,{"$f":"IF(E22=\"\",\"\",E22*$D22)","v":{"$error":"#REF!"}},6.0000000000000001E-3,{"$f":"IF(G22=\"\",\"\",G22*$D22)","v":{"$error":"#REF!"}},2.8899999999999999E-2,{"$f":"IF(I22=\"\",\"\",I22*$D22)","v":{"$error":"#REF!"}},2.93E-2,{"$f":"IF(K22=\"\",\"\",K22*$D22)","v":{"$error":"#REF!"}},0.11749999999999999,{"$f":"IF(M22=\"\",\"\",M22*$D22)","v":{"$error":"#REF!"}},0.11749999999999999,{"$f":"IF(O22=\"\",\"\",O22*$D22)","v":{"$error":"#REF!"}},{"$f":"A22","v":"1.1"},{"$f":"B22","v":"ADMINISTRAÇÃO LOCAL"},null,{"$f":"D22","v":{"$error":"#REF!"}},0.11749999999999999,{"$f":"IF(U22=\"\",\"\",U22*$D22)","v":{"$error":"#REF!"}},0.11749999999999999,{"$f":"IF(W22=\"\",\"\",W22*$D22)","v":{"$error":"#REF!"}},0.1168,{"$f":"IF(Y22=\"\",\"\",Y22*$D22)","v":{"$error":"#REF!"}},0.11219999999999999,{"$f":"IF(AA22=\"\",\"\",AA22*$D22)","v":{"$error":"#REF!"}},0.1152,{"$f":"IF(AC22=\"\",\"\",AC22*$D22)","v":{"$error":"#REF!"}},0.115,{"$f":"IF(AE22=\"\",\"\",AE22*$D22)","v":{"$error":"#REF!"}},{"$f":"SUM(AE22,AC22,AA22,Y22,W22,U22,O22,M22,I22,G22,E22,K22)","v":0.99989999999999979},{"$f":"SUM(AF22,AD22,AB22,Z22,X22,V22,P22,N22,J22,H22,F22,L22)","v":{"$error":"#REF!"}}]
[null,"RESTANTE",null,{"$f":"D20-D22","v":{"$error":"#REF!"}},{"$f":"F23/$D$23","v":{"$error":"#REF!"}},{"$f":"F20-F22","v":{"$error":"#REF!"}},{"$f":"H23/$D$23","v":{"$error":"#REF!"}},{"$f":"H20-H22","v":{"$error":"#REF!"}},{"$f":"J23/$D$23","v":{"$error":"#REF!"}},{"$f":"J20-J22","v":{"$error":"#REF!"}},{"$f":"L23/$D$23","v":{"$error":"#REF!"}},{"$f":"L20-L22","v":{"$error":"#REF!"}},{"$f":"N23/$D$23","v":{"$error":"#REF!"}},{"$f":"N20-N22","v":{"$error":"#REF!"}},{"$f":"P23/$D$23","v":{"$error":"#REF!"}},{"$f":"P20-P22","v":{"$error":"#REF!"}},null,"RESTANTE",null,{"$f":"T20-T22","v":{"$error":"#REF!"}},{"$f":"V23/$D$23","v":{"$error":"#REF!"}},{"$f":"V20-V22","v":{"$error":"#REF!"}},{"$f":"X23/$D$23","v":{"$error":"#REF!"}},{"$f":"X20-X22","v":{"$error":"#REF!"}},{"$f":"Z23/$D$23","v":{"$error":"#REF!"}},{"$f":"Z20-Z22","v":{"$error":"#REF!"}},{"$f":"AB23/$D$23","v":{"$error":"#REF!"}},{"$f":"AB20-AB22","v":{"$error":"#REF!"}},{"$f":"AD23/$D$23","v":{"$error":"#REF!"}},{"$f":"AD20-AD22","v":{"$error":"#REF!"}},{"$f":"AF23/$D$23","v":{"$error":"#REF!"}},{"$f":"AF20-AF22","v":{"$error":"#REF!"}},{"$f":"AH23/$D$23","v":{"$error":"#REF!"}},{"$f":"AH20-AH22","v":{"$error":"#REF!"}}]

{"sheet":"ABC Serviços","index":7,"n_rows":28,"n_cols":16,"rows_kept":28,"cut":false,"hidden":false,"merged":[[0,4,0,5],[0,7,0,9],[1,4,1,5],[1,7,1,9],[2,1,2,10]]}
[null,null,null,"Obra"]
[null,null,null,{"$f":"RESUMO!C7","v":"CONTRATAÇÃO DE SERVIÇOS DE EXECUÇÃO DE PAVIMENTAÇÃO EM PARALELEPÍPEDO GRANÍTICO, EM VIAS DE DIVERSOS MUNICÍPIOS INSERIDOS NA ÁREA DE ATUAÇÃO DA 5ª SUPERINTENDÊNCIA REGIONAL DA CODEVASF, NO ESTADO DE ALAGOAS"}]
[null,"Curva ABC de Serviços"]
[null,"Código","Banco","Descrição","Und","Quant.","Valor Unit com BDI","Total","Peso (%)","Peso Acumulado (%)","Classe",null,"Onde:","A <=",0.75]
[{"$nulls":7},{"$f":"SUM(H1:H4)","v":0},{"$nulls":5},{"$f":"O4","v":0.75},"< B <=",0.95]
[10,{"$f":"VLOOKUP(A6,'PO1'!$A:$P,4,0)","v":101169},{"$f":"VLOOKUP(A6,'PO1'!$A:$P,3,0)","v":"SINAPI"},{"$f":"VLOOKUP(A6,'PO1'!$A:$P,5,0)","v":"EXECUÇÃO DE PAVIMENTO EM PARALELEPÍPEDOS, REJUNTAMENTO COM ARGAMASSA TRAÇO 1:3 (CIMENTO E AREIA). AF_05/2020"},{"$f":"VLOOKUP(A6,'PO1'!$A:$P,6,0)","v":"m²"},{"$f":"VLOOKUP(A6,'PO1'!$A:$P,7,0)","v":156000},{"$f":"VLOOKUP(A6,'PO1'!$A:$P,10,0)","v":86.55},{"$f":"VLOOKUP(A6,'PO1'!$A:$P,11,0)","v":13501800},{"$f":"H6/$H$28","v":0.67571553723930167},{"$f":"I6+J5","v":0.67571553723930167},{"$f":"IF(J6<=$O$4,\"A\",IF(AND(J6<=$P$5,J6>$N$5),\"B\",IF(J6>$O$6,\"C\")))","v":"A"},null,null,"C >",0.95]
[11,{"$f":"VLOOKUP(A7,'PO1'!$A:$P,4,0)","v":94273},{"$f":"VLOOKUP(A7,'PO1'!$A:$P,3,0)","v":"SINAPI"},{"$f":"VLOOKUP(A7,'PO1'!$A:$P,5,0)","v":"ASSENTAMENTO DE GUIA (MEIO-FIO) EM TRECHO RETO, CONFECCIONADA EM CONCRETO PRÉ-FABRICADO, DIMENSÕES 100X15X13X30 CM (COMPRIMENTO X BASE INFERIOR X BASE SUPERIOR X ALTURA), PARA VIAS URBANAS (USO VIÁRIO). AF_06/2016"},{"$f":"VLOOKUP(A7,'PO1'!$A:$P,6,0)","v":"M"},{"$f":"VLOOKUP(A7,'PO1'!$A:$P,7,0)","v":52000},{"$f":"VLOOKUP(A7,'PO1'!$A:$P,10,0)","v":64.91},{"$f":"VLOOKUP(A7,'PO1'!$A:$P,11,0)","v":3375320},{"$f":"H7/$H$28","v":0.16892237828693651},{"$f":"I7+J6","v":0.84463791552623824},"B"]
[16,{"$f":"VLOOKUP(A8,'PO1'!$A:$P,4,0)","v":95876},{"$f":"VLOOKUP(A8,'PO1'!$A:$P,3,0)","v":"SINAPI"},{"$f":"VLOOKUP(A8,'PO1'!$A:$P,5,0)","v":"TRANSPORTE COM CAMINHÃO BASCULANTE DE 14 M³, EM VIA URBANA PAVIMENTADA, DMT ATÉ 30 KM (UNIDADE: M3XKM). AF_07/2020 (PEDRA)"},{"$f":"VLOOKUP(A8,'PO1'!$A:$P,6,0)","v":"M3XKM"},{"$f":"VLOOKUP(A8,'PO1'!$A:$P,7,0)","v":262080},{"$f":"VLOOKUP(A8,'PO1'!$A:$P,10,0)","v":2.5099999999999998},{"$f":"VLOOKUP(A8,'PO1'!$A:$P,11,0)","v":657820.80000000005},3.2921516781405979E-2,0.87755943230764422,"B"]
[7,{"$f":"VLOOKUP(A9,'PO1'!$A:$P,4,0)","v":101124},{"$f":"VLOOKUP(A9,'PO1'!$A:$P,3,0)","v":"SINAPI"},{"$f":"VLOOKUP(A9,'PO1'!$A:$P,5,0)","v":"ESCAVAÇÃO HORIZONTAL, INCLUINDO CARGA E DESCARGA EM SOLO DE 1A CATEGORIA COM TRATOR DE ESTEIRAS (100HP/LÂMINA: 2,19M3). AF_07/2020"},{"$f":"VLOOKUP(A9,'PO1'!$A:$P,6,0)","v":"m³"},{"$f":"VLOOKUP(A9,'PO1'!$A:$P,7,0)","v":34320},{"$f":"VLOOKUP(A9,'PO1'!$A:$P,10,0)","v":17.45},{"$f":"VLOOKUP(A9,'PO1'!$A:$P,11,0)","v":598884},2.9971946244502355E-2,0.90753137855214661,"B"]
[18,{"$f":"VLOOKUP(A10,'PO1'!$A:$P,4,0)","v":95876},{"$f":"VLOOKUP(A10,'PO1'!$A:$P,3,0)","v":"SINAPI"},{"$f":"VLOOKUP(A10,'PO1'!$A:$P,5,0)","v":"TRANSPORTE COM CAMINHÃO BASCULANTE DE 14 M³, EM VIA URBANA PAVIMENTADA, DMT ATÉ 30 KM (UNIDADE: M3XKM). AF_07/2020 (AREIA) "},{"$f":"VLOOKUP(A10,'PO1'!$A:$P,6,0)","v":"M3XKM"},{"$f":"VLOOKUP(A10,'PO1'!$A:$P,7,0)","v":222300},{"$f":"VLOOKUP(A10,'PO1'!$A:$P,10,0)","v":2.5099999999999998},{"$f":"VLOOKUP(A10,'PO1'!$A:$P,11,0)","v":557973},2.7924500841371141E-2,0.93545587939351771,"B"]
[9,{"$f":"VLOOKUP(A11,'PO1'!$A:$P,4,0)","v":100576},{"$f":"VLOOKUP(A11,'PO1'!$A:$P,3,0)","v":"SINAPI"},{"$f":"VLOOKUP(A11,'PO1'!$A:$P,5,0)","v":"REGULARIZAÇÃO E COMPACTAÇÃO DE SUBLEITO DE SOLO  PREDOMINANTEMENTE ARGILOSO. AF_11/2019"},{"$f":"VLOOKUP(A11,'PO1'!$A:$P,6,0)","v":"m²"},{"$f":"VLOOKUP(A11,'PO1'!$A:$P,7,0)","v":156000},{"$f":"VLOOKUP(A11,'PO1'!$A:$P,10,0)","v":2.91},{"$f":"VLOOKUP(A11,'PO1'!$A:$P,11,0)","v":453960},2.2719031927976519E-2,0.95817491132149424,"C"]
[1,{"$f":"VLOOKUP(A12,'PO1'!$A:$P,4,0)","v":"CPU-01"},{"$f":"VLOOKUP(A12,'PO1'!$A:$P,3,0)","v":"Codevasf"},{"$f":"VLOOKUP(A12,'PO1'!$A:$P,5,0)","v":"ADMINISTRAÇÃO LOCAL"},{"$f":"VLOOKUP(A12,'PO1'!$A:$P,6,0)","v":"m²"},{"$f":"VLOOKUP(A12,'PO1'!$A:$P,7,0)","v":156000},{"$f":"VLOOKUP(A12,'PO1'!$A:$P,10,0)","v":0.87},{"$f":"VLOOKUP(A12,'PO1'!$A:$P,11,0)","v":135720},6.7922878959929796E-3,0.96496719921748719,"C"]
[14,{"$f":"VLOOKUP(A13,'PO1'!$A:$P,4,0)","v":"CPU-06"},{"$f":"VLOOKUP(A13,'PO1'!$A:$P,3,0)","v":"Codevasf"},{"$f":"VLOOKUP(A13,'PO1'!$A:$P,5,0)","v":"ESCORAMENTO DE MEIO FIO COM MATERIAL LOCAL COMPACTADO MANUALMENTE, EM FAIXA DE 0,50M"},{"$f":"VLOOKUP(A13,'PO1'!$A:$P,6,0)","v":"M"},{"$f":"VLOOKUP(A13,'PO1'!$A:$P,7,0)","v":26000},{"$f":"VLOOKUP(A13,'PO1'!$A:$P,10,0)","v":5.19},{"$f":"VLOOKUP(A13,'PO1'!$A:$P,11,0)","v":134940},6.7532517586596872E-3,0.9717204509761469,"C"]
[15,{"$f":"VLOOKUP(A14,'PO1'!$A:$P,4,0)","v":"CPU-07"},{"$f":"VLOOKUP(A14,'PO1'!$A:$P,3,0)","v":"Codevasf"},{"$f":"VLOOKUP(A14,'PO1'!$A:$P,5,0)","v":"DETALHAMENTO PROJETO EXECUTIVO DE PAVIMENTAÇÃO"},{"$f":"VLOOKUP(A14,'PO1'!$A:$P,6,0)","v":"m²"},{"$f":"VLOOKUP(A14,'PO1'!$A:$P,7,0)","v":156000},{"$f":"VLOOKUP(A14,'PO1'!$A:$P,10,0)","v":0.72},{"$f":"VLOOKUP(A14,'PO1'!$A:$P,11,0)","v":112320},5.6212037759941907E-3,0.97734165475214108,"C"]
[20,{"$f":"VLOOKUP(A15,'PO1'!$A:$P,4,0)","v":95876},{"$f":"VLOOKUP(A15,'PO1'!$A:$P,3,0)","v":"SINAPI"},{"$f":"VLOOKUP(A15,'PO1'!$A:$P,5,0)","v":"TRANSPORTE COM CAMINHÃO BASCULANTE DE 14 M³, EM VIA URBANA PAVIMENTADA, DMT ATÉ 30 KM (UNIDADE: M3XKM). AF_07/2020  (BOTA-FORA)"},{"$f":"VLOOKUP(A15,'PO1'!$A:$P,6,0)","v":"M3XKM"},{"$f":"VLOOKUP(A15,'PO1'!$A:$P,7,0)","v":42900},{"$f":"VLOOKUP(A15,'PO1'!$A:$P,10,0)","v":2.5099999999999998},{"$f":"VLOOKUP(A15,'PO1'!$A:$P,11,0)","v":107679},5.3889387588610975E-3,0.98273059351100223,"C"]
[6,{"$f":"VLOOKUP(A16,'PO1'!$A:$P,4,0)","v":"CPU-04"},{"$f":"VLOOKUP(A16,'PO1'!$A:$P,3,0)","v":"Codevasf"},{"$f":"VLOOKUP(A16,'PO1'!$A:$P,5,0)","v":"SERVIÇOS TOPOGRÁFICOS PARA PAVIMENTAÇÃO, INCLUSIVE NOTAS DE SERVIÇOS, ACOMPANHAMENTO E GREIDE"},{"$f":"VLOOKUP(A16,'PO1'!$A:$P,6,0)","v":"m²"},{"$f":"VLOOKUP(A16,'PO1'!$A:$P,7,0)","v":156000},{"$f":"VLOOKUP(A16,'PO1'!$A:$P,10,0)","v":0.57999999999999996},{"$f":"VLOOKUP(A16,'PO1'!$A:$P,11,0)","v":90480},4.5281919306619867E-3,0.98725878544166423,"C"]
[2,{"$f":"VLOOKUP(A17,'PO1'!$A:$P,4,0)","v":"CPU-02"},{"$f":"VLOOKUP(A17,'PO1'!$A:$P,3,0)","v":"SINAPI"},{"$f":"VLOOKUP(A17,'PO1'!$A:$P,5,0)","v":"MOBILIZAÇÃO E DESMOBILIZAÇÃO"},{"$f":"VLOOKUP(A17,'PO1'!$A:$P,6,0)","v":"m²"},{"$f":"VLOOKUP(A17,'PO1'!$A:$P,7,0)","v":156000},{"$f":"VLOOKUP(A17,'PO1'!$A:$P,10,0)","v":0.57999999999999996},{"$f":"VLOOKUP(A17,'PO1'!$A:$P,11,0)","v":90480},4.5281919306619867E-3,0.99178697737232624,"C"]
[12,{"$f":"VLOOKUP(A18,'PO1'!$A:$P,4,0)","v":83693},{"$f":"VLOOKUP(A18,'PO1'!$A:$P,3,0)","v":"SINAPI"},{"$f":"VLOOKUP(A18,'PO1'!$A:$P,5,0)","v":"CAIACAO EM MEIO FIO"},{"$f":"VLOOKUP(A18,'PO1'!$A:$P,6,0)","v":"m²"},{"$f":"VLOOKUP(A18,'PO1'!$A:$P,7,0)","v":12480},{"$f":"VLOOKUP(A18,'PO1'!$A:$P,10,0)","v":5.44},{"$f":"VLOOKUP(A18,'PO1'!$A:$P,11,0)","v":67891.199999999997},3.3977053934898215E-3,0.99518468276581606,"C"]
[3,{"$f":"VLOOKUP(A19,'PO1'!$A:$P,4,0)","v":103689},{"$f":"VLOOKUP(A19,'PO1'!$A:$P,3,0)","v":"SINAPI"},{"$f":"VLOOKUP(A19,'PO1'!$A:$P,5,0)","v":"FORNECIMENTO E INSTALAÇÃO DE PLACA DE OBRA COM CHAPA GALVANIZADA E ESTRUTURA DE MADEIRA. AF_03/2022_PS"},{"$f":"VLOOKUP(A19,'PO1'!$A:$P,6,0)","v":"m²"},{"$f":"VLOOKUP(A19,'PO1'!$A:$P,7,0)","v":84.24},{"$f":"VLOOKUP(A19,'PO1'!$A:$P,10,0)","v":378.61},{"$f":"VLOOKUP(A19,'PO1'!$A:$P,11,0)","v":31894.1},1.5961826509253588E-3,0.99678086541674138,"C"]
[8,{"$f":"VLOOKUP(A20,'PO1'!$A:$P,4,0)","v":100574},{"$f":"VLOOKUP(A20,'PO1'!$A:$P,3,0)","v":"SINAPI"},{"$f":"VLOOKUP(A20,'PO1'!$A:$P,5,0)","v":"ESPALHAMENTO DE MATERIAL COM TRATOR DE ESTEIRAS. AF_11/2019"},{"$f":"VLOOKUP(A20,'PO1'!$A:$P,6,0)","v":"m³"},{"$f":"VLOOKUP(A20,'PO1'!$A:$P,7,0)","v":34320},{"$f":"VLOOKUP(A20,'PO1'!$A:$P,10,0)","v":1.61},{"$f":"VLOOKUP(A20,'PO1'!$A:$P,11,0)","v":55255.199999999997},2.7653199686904751E-3,0.99954618538543183,"C"]
[4,{"$f":"VLOOKUP(A21,'PO1'!$A:$P,4,0)","v":103689},{"$f":"VLOOKUP(A21,'PO1'!$A:$P,3,0)","v":"SINAPI"},{"$f":"VLOOKUP(A21,'PO1'!$A:$P,5,0)","v":"FORNECIMENTO E INSTALAÇÃO DE PLACA DE OBRA COM CHAPA GALVANIZADA E ESTRUTURA DE MADEIRA. AF_03/2022_PS"},{"$f":"VLOOKUP(A21,'PO1'!$A:$P,6,0)","v":"m²"},{"$f":"VLOOKUP(A21,'PO1'!$A:$P,7,0)","v":13},{"$f":"VLOOKUP(A21,'PO1'!$A:$P,10,0)","v":378.61},{"$f":"VLOOKUP(A21,'PO1'!$A:$P,11,0)","v":4921.93},2.4632453259596768E-4,0.99979250991802782,"C"]
[5,{"$f":"VLOOKUP(A22,'PO1'!$A:$P,4,0)","v":"CPU-03"},{"$f":"VLOOKUP(A22,'PO1'!$A:$P,3,0)","v":"Codevasf"},{"$f":"VLOOKUP(A22,'PO1'!$A:$P,5,0)","v":"CANTEIRO DE OBRAS E ALMOXARIFADO"},{"$f":"VLOOKUP(A22,'PO1'!$A:$P,6,0)","v":"m²"},{"$f":"VLOOKUP(A22,'PO1'!$A:$P,7,0)","v":156000},{"$f":"VLOOKUP(A22,'PO1'!$A:$P,10,0)","v":0.02},{"$f":"VLOOKUP(A22,'PO1'!$A:$P,11,0)","v":3120},1.5614454933317196E-4,0.99994865446736103,"C"]
[13,{"$f":"VLOOKUP(A23,'PO1'!$A:$P,4,0)","v":"CPU-05"},{"$f":"VLOOKUP(A23,'PO1'!$A:$P,3,0)","v":"Codevasf"},{"$f":"VLOOKUP(A23,'PO1'!$A:$P,5,0)","v":"CONSERTO DE QUEBRA NO RAMAL NA RUA SEM PAVIMENTO COM FORNECIMENTO DE MATERIAL HIDRÁULICO"},{"$f":"VLOOKUP(A23,'PO1'!$A:$P,6,0)","v":"UND"},{"$f":"VLOOKUP(A23,'PO1'!$A:$P,7,0)","v":52},{"$f":"VLOOKUP(A23,'PO1'!$A:$P,10,0)","v":19.73},{"$f":"VLOOKUP(A23,'PO1'!$A:$P,11,0)","v":1025.96},5.1345532639058047E-5,1,"C"]
[21,{"$f":"VLOOKUP(A24,'PO1'!$A:$P,4,0)","v":93593},{"$f":"VLOOKUP(A24,'PO1'!$A:$P,3,0)","v":"SINAPI"},{"$f":"VLOOKUP(A24,'PO1'!$A:$P,5,0)","v":"TRANSPORTE COM CAMINHÃO BASCULANTE DE 14 M³, EM VIA URBANA PAVIMENTADA, ADICIONAL PARA DMT EXCEDENTE A 30 KM (UNIDADE: M3XKM). AF_07/2020 (BOTA-FORA)"},{"$f":"VLOOKUP(A24,'PO1'!$A:$P,6,0)","v":"M3XKM"},{"$f":"VLOOKUP(A24,'PO1'!$A:$P,7,0)","v":0},{"$f":"VLOOKUP(A24,'PO1'!$A:$P,10,0)","v":1},{"$f":"VLOOKUP(A24,'PO1'!$A:$P,11,0)","v":0},0,1,"C"]
[22,{"$f":"VLOOKUP(A25,'PO1'!$A:$P,4,0)","v":93592},{"$f":"VLOOKUP(A25,'PO1'!$A:$P,3,0)","v":"SINAPI"},{"$f":"VLOOKUP(A25,'PO1'!$A:$P,5,0)","v":"TRANSPORTE COM CAMINHÃO BASCULANTE DE 14 M³, EM VIA URBANA EM REVESTIMENTO PRIMÁRIO (UNIDADE: M3XKM). AF_07/2020 (BOTA-FORA)"},{"$f":"VLOOKUP(A25,'PO1'!$A:$P,6,0)","v":"M3XKM"},{"$f":"VLOOKUP(A25,'PO1'!$A:$P,7,0)","v":0},{"$f":"VLOOKUP(A25,'PO1'!$A:$P,10,0)","v":2.76},{"$f":"VLOOKUP(A25,'PO1'!$A:$P,11,0)","v":0},0,1,"C"]
[17,{"$f":"VLOOKUP(A26,'PO1'!$A:$P,4,0)","v":93593},{"$f":"VLOOKUP(A26,'PO1'!$A:$P,3,0)","v":"SINAPI"},{"$f":"VLOOKUP(A26,'PO1'!$A:$P,5,0)","v":"TRANSPORTE COM CAMINHÃO BASCULANTE DE 14 M³, EM VIA URBANA PAVIMENTADA, ADICIONAL PARA DMT EXCEDENTE A 30 KM (UNIDADE: M3XKM). AF_07/2020 (PEDRA)"},{"$f":"VLOOKUP(A26,'PO1'!$A:$P,6,0)","v":"M3XKM"},{"$f":"VLOOKUP(A26,'PO1'!$A:$P,7,0)","v":0},{"$f":"VLOOKUP(A26,'PO1'!$A:$P,10,0)","v":1},{"$f":"VLOOKUP(A26,'PO1'!$A:$P,11,0)","v":0},0,1,"C"]
[19,{"$f":"VLOOKUP(A27,'PO1'!$A:$P,4,0)","v":93593},{"$f":"VLOOKUP(A27,'PO1'!$A:$P,3,0)","v":"SINAPI"},{"$f":"VLOOKUP(A27,'PO1'!$A:$P,5,0)","v":"TRANSPORTE COM CAMINHÃO BASCULANTE DE 14 M³, EM VIA URBANA PAVIMENTADA, ADICIONAL PARA DMT EXCEDENTE A 30 KM (UNIDADE: M3XKM). AF_07/2020 (AREIA)"},{"$f":"VLOOKUP(A27,'PO1'!$A:$P,6,0)","v":"M3XKM"},{"$f":"VLOOKUP(A27,'PO1'!$A:$P,7,0)","v":0},{"$f":"VLOOKUP(A27,'PO1'!$A:$P,10,0)","v":1},{"$f":"VLOOKUP(A27,'PO1'!$A:$P,11,0)","v":0},0,1,"C"]
[{"$nulls":7},{"$f":"SUM(H6:H27)","v":19981485.190000001}]

{"sheet":"CPUs","index":8,"n_rows":161,"n_cols":11,"rows_kept":161,"cut":false,"hidden":false,"merged":[[1,4,1,5],[3,0,3,9],[36,4,36,5],[37,4,37,5],[153,7,153,8],[155,4,155,5],[156,4,156,5],[157,4,157,5],[158,4,158,5],[139,7,139,8],[133,7,133,8],[135,4,135,5],[136,4,136,5],[137,4,137,5],[124,4,124,5],[125,4,125,5],[127,7,127,8],[129,4,129,5],[130,4,130,5],[131,4,131,5],[117,7,117,8],[119,4,119,5],[120,4,120,5],[121,4,121,5],[160,7,160,8],[144,4,144,5],[146,7,146,8],[148,4,148,5],[149,4,149,5],[150,4,150,5],[151,4,151,5],[141,4,141,5],[142,4,142,5],[143,4,143,5],[122,4,122,5],[123,4,123,5],[109,7,109,8],[111,4,111,5],[112,4,112,5],[113,4,113,5],[114,4,114,5],[115,4,115,5],[102,4,102,5],[103,4,103,5],[104,4,104,5],[105,4,105,5],[106,4,106,5],[107,4,107,5],[94,4,94,5],[95,4,95,5],[96,4,96,5],[97,4,97,5],[99,7,99,8],[101,4,101,5],[87,7,87,8],[89,4,89,5],[90,4,90,5],[91,4,91,5],[92,4,92,5],[93,4,93,5],[80,4,80,5],[81,4,81,5],[82,4,82,5],[83,4,83,5],[84,4,84,5],[85,4,85,5],[72,4,72,5],[73,4,73,5],[75,7,75,8],[77,4,77,5],[78,4,78,5],[79,4,79,5],[64,4,64,5],[65,4,65,5],[67,7,67,8],[69,4,69,5],[70,4,70,5],[71,4,71,5],[56,4,56,5],[58,7,58,8],[60,4,60,5],[61,4,61,5],[62,4,62,5],[63,4,63,5],[50,4,50,5],[51,4,51,5],[52,4,52,5],[53,4,53,5],[54,4,54,5],[55,4,55,5],[42,4,42,5],[43,4,43,5],[44,4,44,5],[46,7,46,8],[48,4,48,5],[49,4,49,5],[32,4,32,5],[33,4,33,5],[34,4,34,5],[35,4,35,5],[39,7,39,8],[41,4,41,5],[24,4,24,5],[25,4,25,5],[27,7,27,8],[29,4,29,5],[30,4,30,5],[31,4,31,5],[18,4,18,5],[19,4,19,5],[20,4,20,5],[21,4,21,5],[22,4,22,5],[23,4,23,5],[10,4,10,5],[11,4,11,5],[12,4,12,5],[13,4,13,5],[15,7,15,8],[17,4,17,5],[4,4,4,5],[5,4,5,5],[6,4,6,5],[7,4,7,5],[8,4,8,5],[9,4,9,5]]}
[{"$nulls":4},"Bancos",null,"B.D.I.",null,"Encargos Sociais"]
[null,null,null,{"$f":"RESUMO!C7","v":"CONTRATAÇÃO DE SERVIÇOS DE EXECUÇÃO DE PAVIMENTAÇÃO EM PARALELEPÍPEDO GRANÍTICO, EM VIAS DE DIVERSOS MUNICÍPIOS INSERIDOS NA ÁREA DE ATUAÇÃO DA 5ª SUPERINTENDÊNCIA REGIONAL DA CODEVASF, NO ESTADO DE ALAGOAS"},"SINAPI - 10/2023 - Alagoas\nSICRO3 - 07/2023 - Alagoas\nORSE - 09/2023 - Sergipe\nSem Desoneração\n",null,{"$f":"RESUMO!F8","v":0.2135},null,"Não Desonerado: \nHorista:  114,90%\nMensalista: 70,23% "]
[]
["Composições Analíticas com Preço Unitário - Composições Principais",{"$nulls":9},{"$f":"MEMÓRIA!M9","v":12000}]
[" 1.1 ","Código","Banco","Descrição","Tipo",null,"Und","Quant.","Valor Unit","Total","m²"]
["Composição","CPU-01","Próprio","ADMINISTRAÇÃO LOCAL","SERT - SERVIÇOS TÉCNICOS",null,"Global",1,8646.56,8646.56,{"$f":"TRUNC(J6/(K4),2)","v":0.72}]
["Composição Auxiliar",93565,"SINAPI","ENGENHEIRO CIVIL DE OBRA JUNIOR COM ENCARGOS COMPLEMENTARES","SEDI - SERVIÇOS DIVERSOS",null,"MES",0.1,20823.560000000001,2082.35]
["Composição Auxiliar",93566,"SINAPI","AUXILIAR DE ESCRITORIO COM ENCARGOS COMPLEMENTARES","SEDI - SERVIÇOS DIVERSOS",null,"MES",0.66700000000000004,2888.89,1926.88]
["Composição Auxiliar",93572,"SINAPI","ENCARREGADO GERAL DE OBRAS COM ENCARGOS COMPLEMENTARES","SEDI - SERVIÇOS DIVERSOS",null,"MES",0.66700000000000004,4526.7299999999996,3019.32]
["Composição Auxiliar",100321,"SINAPI","TÉCNICO EM SEGURANÇA DO TRABALHO COM ENCARGOS COMPLEMENTARES","SEDI - SERVIÇOS DIVERSOS",null,"MES",0.2,4802.2299999999996,960.44]
["Insumo",2705,"SINAPI","ENERGIA ELETRICA ATE 2000 KWH INDUSTRIAL, SEM DEMANDA","Material",null,"KWH",100,1.1200000000000001,112]
["Insumo",44480,"SINAPI","TARIFA \"A\" ENTRE  0 E 20M3 FORNECIMENTO  D'AGUA","Taxas",null,"m³",1,21.57,21.57]
["Insumo",4222,"SINAPI","GASOLINA COMUM","Material",null,"L",20,5.82,116.4]
["Insumo",2789,"ORSE","Veículo leve - pick up (97kw) h","Equipamento",null,"un",40,10.19,407.6]
[{"$nulls":4},"MO sem LS =>",7308.87,"LS =>",0,"MO com LS =>",7308.87]
[{"$nulls":4},"Valor do BDI =>",1846.04,null,"Valor com BDI =>",null,10492.6]
[]
[" 1.2 ","Código","Banco","Descrição","Tipo",null,"Und","Quant.","Valor Unit","Total"]
["Composição",103689,"SINAPI","FORNECIMENTO E INSTALAÇÃO DE PLACA DE OBRA COM CHAPA GALVANIZADA E ESTRUTURA DE MADEIRA. AF_03/2022_PS","PAVI - PAVIMENTAÇÃO",null,"m²",1,312,312]
["Composição Auxiliar",102234,"SINAPI","PINTURA IMUNIZANTE PARA MADEIRA, 2 DEMÃOS. AF_01/2021","PINT - PINTURAS",null,"m²",0.5,24.56,12.28]
["Composição Auxiliar",88262,"SINAPI","CARPINTEIRO DE FORMAS COM ENCARGOS COMPLEMENTARES","SEDI - SERVIÇOS DIVERSOS",null,"H",0.37290000000000001,23.48,8.75]
["Composição Auxiliar",88316,"SINAPI","SERVENTE COM ENCARGOS COMPLEMENTARES","SEDI - SERVIÇOS DIVERSOS",null,"H",1.1186,18.649999999999999,20.86]
["Insumo",4509,"SINAPI","SARRAFO *2,5 X 10* CM EM PINUS, MISTA OU EQUIVALENTE DA REGIAO - BRUTA","Material",null,"M",3.2082999999999999,6.01,19.28]
["Insumo",4813,"SINAPI","PLACA DE OBRA (PARA CONSTRUCAO CIVIL) EM CHAPA GALVANIZADA *N. 22*, ADESIVADA, DE *2,4 X 1,2* M (SEM POSTES PARA FIXACAO)","Material",null,"m²",1,250,250]
["Insumo",5065,"SINAPI","PREGO DE ACO POLIDO COM CABECA 10 X 10 (7/8 X 17)","Material",null,"KG",1.1299999999999999E-2,45.96,0.51]
["Insumo",5069,"SINAPI","PREGO DE ACO POLIDO COM CABECA 17 X 27 (2 1/2 X 11)","Material",null,"KG",1.32E-2,24.62,0.32]
[{"$nulls":4},"MO sem LS =>",26.06,"LS =>",0,"MO com LS =>",26.06]
[{"$nulls":4},"Valor do BDI =>",66.61,null,"Valor com BDI =>",null,378.61]
[]
[" 1.4 ","Código","Banco","Descrição","Tipo",null,"Und","Quant.","Valor Unit","Total","m²"]
["Composição","CPU-02","Próprio","MOBILIZAÇÃO E DESMOBILIZAÇÃO","CHOR - CUSTOS HORÁRIOS DE MÁQUINAS E EQUIPAMENTOS",null,"UND",1,5868.28,5868.28,{"$f":"TRUNC(J31/K4,2)","v":0.48}]
["Composição Auxiliar"," 5914640 ","SICRO3","Transporte com cavalo mecânico com semirreboque com capacidade de 30 t - rodovia pavimentada","",null,"tkm",1540,0.53,816.2]
["Composição Auxiliar"," 91386 ","SINAPI","CAMINHÃO BASCULANTE 10 M3, TRUCADO CABINE SIMPLES, PESO BRUTO TOTAL 23.000 KG, CARGA ÚTIL MÁXIMA 15.935 KG, DISTÂNCIA ENTRE EIXOS 4,80 M, POTÊNCIA 230 CV INCLUSIVE CAÇAMBA METÁLICA - CHP DIURNO. AF_06/2014","CHOR - CUSTOS HORÁRIOS DE MÁQUINAS E EQUIPAMENTOS",null,"CHP",4,268.64,1074.56]
["Composição Auxiliar"," 89876 ","SINAPI","CAMINHÃO BASCULANTE 14 M3, COM CAVALO MECÂNICO DE CAPACIDADE MÁXIMA DE TRAÇÃO COMBINADO DE 36000 KG, POTÊNCIA 286 CV, INCLUSIVE SEMIREBOQUE COM CAÇAMBA METÁLICA - CHP DIURNO. AF_12/2014","CHOR - CUSTOS HORÁRIOS DE MÁQUINAS E EQUIPAMENTOS",null,"CHP",4,319.99,1279.96]
["Composição Auxiliar"," 5901 ","SINAPI","CAMINHÃO PIPA 10.000 L TRUCADO, PESO BRUTO TOTAL 23.000 KG, CARGA ÚTIL MÁXIMA 15.935 KG, DISTÂNCIA ENTRE EIXOS 4,8 M, POTÊNCIA 230 CV, INCLUSIVE TANQUE DE AÇO PARA TRANSPORTE DE ÁGUA - CHP DIURNO. AF_06/2014","CHOR - CUSTOS HORÁRIOS DE MÁQUINAS E EQUIPAMENTOS",null,"CHP",4,319.87,1279.48]
["Composição Auxiliar"," 73340 ","SINAPI","CAMINHÃO TOCO, PBT 14.300 KG, CARGA ÚTIL MÁX. 9.710 KG, DIST. ENTRE EIXOS 3,56 M, POTÊNCIA 185 CV, INCLUSIVE CARROCERIA FIXA ABERTA DE MADEIRA P/ TRANSPORTE GERAL DE CARGA SECA, DIMEN. APROX. 2,50 X 6,50 X 0,50 M - MATERIAIS NA OPERAÇÃO. AF_06/2014","CHOR - CUSTOS HORÁRIOS DE MÁQUINAS E EQUIPAMENTOS",null,"H",4,158.84,635.36]
["Composição Auxiliar"," 67826 ","SINAPI","CAMINHÃO BASCULANTE 6 M3 TOCO, PESO BRUTO TOTAL 16.000 KG, CARGA ÚTIL MÁXIMA 11.130 KG, DISTÂNCIA ENTRE EIXOS 5,36 M, POTÊNCIA 185 CV, INCLUSIVE CAÇAMBA METÁLICA - CHP DIURNO. AF_06/2014","CHOR - CUSTOS HORÁRIOS DE MÁQUINAS E EQUIPAMENTOS",null,"CHP",4,185.49,741.96]
["Insumo"," 2789 ","ORSE","Veículo leve - pick up (97kw) h","Equipamento",null,"un",4,10.19,40.76]
[{"$nulls":4},"MO sem LS =>",295.32,"LS =>",0,"MO com LS =>",295.32]
[{"$nulls":4},"Valor do BDI =>",1252.8699999999999,null,"Valor com BDI =>",null,7121.15]
[]
[" 1.5 ","Código","Banco","Descrição","Tipo",null,"Und","Quant.","Valor Unit","Total","m²"]
["Composição","CPU-03","Próprio","CANTEIRO DE OBRAS E ALMOXARIFADO","CANT - CANTEIRO DE OBRAS",null,"UND",1,317.06,317.06,{"$f":"TRUNC(J43/K4,2)","v":0.02}]
["Insumo",10775,"SINAPI","LOCACAO DE CONTAINER 2,30 X 6,00 M, ALT. 2,50 M, COM 1 SANITARIO, PARA ESCRITORIO, COMPLETO, SEM DIVISORIAS INTERNAS (NAO INCLUI MOBILIZACAO/DESMOBILIZACAO)","Equipamento",null,"MES",0.2,890,178]
["Insumo",10776,"SINAPI","LOCACAO DE CONTAINER 2,30 X 6,00 M, ALT. 2,50 M, PARA ESCRITORIO, SEM DIVISORIAS INTERNAS E SEM SANITARIO (NAO INCLUI MOBILIZACAO/DESMOBILIZACAO)","Equipamento",null,"MES",0.2,695.31,139.06]
[{"$nulls":4},"MO sem LS =>",0,"LS =>",0,"MO com LS =>",0]
[{"$nulls":4},"Valor do BDI =>",67.69,null,"Valor com BDI =>",null,384.75]
[]
[" 2.1 ","Código","Banco","Descrição","Tipo",null,"Und","Quant.","Valor Unit","Total"]
["Composição","CPU-04","Próprio","SERVIÇOS TOPOGRÁFICOS PARA PAVIMENTAÇÃO, INCLUSIVE NOTAS DE SERVIÇOS, ACOMPANHAMENTO E GREIDE","SERT - SERVIÇOS TÉCNICOS",null,"m²",1,0.48,0.48]
["Composição Auxiliar",92145,"SINAPI","CAMINHONETE CABINE SIMPLES COM MOTOR 1.6 FLEX, CÂMBIO MANUAL, POTÊNCIA 101/104 CV, 2 PORTAS - CHP DIURNO. AF_11/2015","CHOR - CUSTOS HORÁRIOS DE MÁQUINAS E EQUIPAMENTOS",null,"CHP",1E-3,73.22,7.0000000000000007E-2]
["Composição Auxiliar",88253,"SINAPI","AUXILIAR DE TOPÓGRAFO COM ENCARGOS COMPLEMENTARES","SEDI - SERVIÇOS DIVERSOS",null,"H",2.5000000000000001E-3,20.03,0.05]
["Composição Auxiliar",90781,"SINAPI","TOPOGRAFO COM ENCARGOS COMPLEMENTARES","SEDI - SERVIÇOS DIVERSOS",null,"H",2.5000000000000001E-3,42.16,0.1]
["Composição Auxiliar",88597,"SINAPI","DESENHISTA DETALHISTA COM ENCARGOS COMPLEMENTARES","SEDI - SERVIÇOS DIVERSOS",null,"H",2E-3,44.32,0.08]
["Composição Auxiliar",88288,"SINAPI","NIVELADOR COM ENCARGOS COMPLEMENTARES","SEDI - SERVIÇOS DIVERSOS",null,"H",2.5000000000000001E-3,16.22,0.04]
["Composição Auxiliar",88316,"SINAPI","SERVENTE COM ENCARGOS COMPLEMENTARES","SEDI - SERVIÇOS DIVERSOS",null,"H",7.4999999999999997E-3,18.649999999999999,0.13]
["Insumo",20206,"SINAPI","SARRAFO APARELHADO *2 X 10* CM, EM MACARANDUBA/MASSARANDUBA, ANGELIM OU EQUIVALENTE DA REGIAO","Material",null,"M",2.8860000000000001E-3,6.75,0.01]
[{"$nulls":4},"MO sem LS =>",0.36,"LS =>",0,"MO com LS =>",0.36]
[{"$nulls":4},"Valor do BDI =>",0.1,null,"Valor com BDI =>",null,0.57999999999999996]
[]
[" 2.2 ","Código","Banco","Descrição","Tipo",null,"Und","Quant.","Valor Unit","Total"]
["Composição",101124,"SINAPI","ESCAVAÇÃO HORIZONTAL, INCLUINDO CARGA E DESCARGA EM SOLO DE 1A CATEGORIA COM TRATOR DE ESTEIRAS (100HP/LÂMINA: 2,19M3). AF_07/2020","MOVT - MOVIMENTO DE TERRA",null,"m³",1,14.38,14.38]
["Composição Auxiliar",100974,"SINAPI","CARGA, MANOBRA E DESCARGA DE SOLOS E MATERIAIS GRANULARES EM CAMINHÃO BASCULANTE 10 M³ - CARGA COM PÁ CARREGADEIRA (CAÇAMBA DE 1,7 A 2,8 M³ / 128 HP) E DESCARGA LIVRE (UNIDADE: M3). AF_07/2020","TRAN - TRANSPORTES, CARGAS E DESCARGAS",null,"m³",1.25,8.41,10.51]
["Composição Auxiliar",88316,"SINAPI","SERVENTE COM ENCARGOS COMPLEMENTARES","SEDI - SERVIÇOS DIVERSOS",null,"H",3.1E-2,18.649999999999999,0.56999999999999995]
["Composição Auxiliar",89031,"SINAPI","TRATOR DE ESTEIRAS, POTÊNCIA 100 HP, PESO OPERACIONAL 9,4 T, COM LÂMINA 2,19 M3 - CHI DIURNO. AF_06/2014","CHOR - CUSTOS HORÁRIOS DE MÁQUINAS E EQUIPAMENTOS",null,"CHI",1.95E-2,63.5,1.23]
["Composição Auxiliar",89032,"SINAPI","TRATOR DE ESTEIRAS, POTÊNCIA 100 HP, PESO OPERACIONAL 9,4 T, COM LÂMINA 2,19 M3 - CHP DIURNO. AF_06/2014","CHOR - CUSTOS HORÁRIOS DE MÁQUINAS E EQUIPAMENTOS",null,"CHP",1.15E-2,180.78,2.0699999999999998]
[{"$nulls":4},"MO sem LS =>",2.04,"LS =>",0,"MO com LS =>",2.04]
[{"$nulls":4},"Valor do BDI =>",3.07,null,"Valor com BDI =>",null,17.45]
[]
[" 2.3 ","Código","Banco","Descrição","Tipo",null,"Und","Quant.","Valor Unit","Total"]
["Composição",100574,"SINAPI","ESPALHAMENTO DE MATERIAL COM TRATOR DE ESTEIRAS. AF_11/2019","PAVI - PAVIMENTAÇÃO",null,"m³",1,1.33,1.33]
["Composição Auxiliar",5851,"SINAPI","TRATOR DE ESTEIRAS, POTÊNCIA 150 HP, PESO OPERACIONAL 16,7 T, COM RODA MOTRIZ ELEVADA E LÂMINA 3,18 M3 - CHP DIURNO. AF_06/2014","CHOR - CUSTOS HORÁRIOS DE MÁQUINAS E EQUIPAMENTOS",null,"CHP",3.0000000000000001E-3,241.35,0.72]
["Composição Auxiliar",5853,"SINAPI","TRATOR DE ESTEIRAS, POTÊNCIA 150 HP, PESO OPERACIONAL 16,7 T, COM RODA MOTRIZ ELEVADA E LÂMINA 3,18 M3 - CHI DIURNO. AF_06/2014","CHOR - CUSTOS HORÁRIOS DE MÁQUINAS E EQUIPAMENTOS",null,"CHI",6.0000000000000001E-3,76.2,0.45]
["Composição Auxiliar",88316,"SINAPI","SERVENTE COM ENCARGOS COMPLEMENTARES","SEDI - SERVIÇOS DIVERSOS",null,"H",8.9999999999999993E-3,18.649999999999999,0.16]
[{"$nulls":4},"MO sem LS =>",0.25,"LS =>",0,"MO com LS =>",0.25]
[{"$nulls":4},"Valor do BDI =>",0.28000000000000003,null,"Valor com BDI =>",null,1.61]
[]
[" 2.4 ","Código","Banco","Descrição","Tipo",null,"Und","Quant.","Valor Unit","Total"]
["Composição",100576,"SINAPI","REGULARIZAÇÃO E COMPACTAÇÃO DE SUBLEITO DE SOLO  PREDOMINANTEMENTE ARGILOSO. AF_11/2019","PAVI - PAVIMENTAÇÃO",null,"m²",1,2.4,2.4]
["Composição Auxiliar",5901,"SINAPI","CAMINHÃO PIPA 10.000 L TRUCADO, PESO BRUTO TOTAL 23.000 KG, CARGA ÚTIL MÁXIMA 15.935 KG, DISTÂNCIA ENTRE EIXOS 4,8 M, POTÊNCIA 230 CV, INCLUSIVE TANQUE DE AÇO PARA TRANSPORTE DE ÁGUA - CHP DIURNO. AF_06/2014","CHOR - CUSTOS HORÁRIOS DE MÁQUINAS E EQUIPAMENTOS",null,"CHP",1E-3,319.87,0.31]
["Composição Auxiliar",5903,"SINAPI","CAMINHÃO PIPA 10.000 L TRUCADO, PESO BRUTO TOTAL 23.000 KG, CARGA ÚTIL MÁXIMA 15.935 KG, DISTÂNCIA ENTRE EIXOS 4,8 M, POTÊNCIA 230 CV, INCLUSIVE TANQUE DE AÇO PARA TRANSPORTE DE ÁGUA - CHI DIURNO. AF_06/2014","CHOR - CUSTOS HORÁRIOS DE MÁQUINAS E EQUIPAMENTOS",null,"CHI",7.0000000000000001E-3,68.709999999999994,0.48]
["Composição Auxiliar",5932,"SINAPI","MOTONIVELADORA POTÊNCIA BÁSICA LÍQUIDA (PRIMEIRA MARCHA) 125 HP, PESO BRUTO 13032 KG, LARGURA DA LÂMINA DE 3,7 M - CHP DIURNO. AF_06/2014","CHOR - CUSTOS HORÁRIOS DE MÁQUINAS E EQUIPAMENTOS",null,"CHP",1E-4,251.97,0.02]
["Composição Auxiliar",5934,"SINAPI","MOTONIVELADORA POTÊNCIA BÁSICA LÍQUIDA (PRIMEIRA MARCHA) 125 HP, PESO BRUTO 13032 KG, LARGURA DA LÂMINA DE 3,7 M - CHI DIURNO. AF_06/2014","CHOR - CUSTOS HORÁRIOS DE MÁQUINAS E EQUIPAMENTOS",null,"CHI",8.0000000000000002E-3,94.07,0.75]
["Composição Auxiliar",73436,"SINAPI","ROLO COMPACTADOR VIBRATÓRIO PÉ DE CARNEIRO PARA SOLOS, POTÊNCIA 80 HP, PESO OPERACIONAL SEM/COM LASTRO 7,4 / 8,8 T, LARGURA DE TRABALHO 1,68 M - CHP DIURNO. AF_02/2016","CHOR - CUSTOS HORÁRIOS DE MÁQUINAS E EQUIPAMENTOS",null,"CHP",2E-3,164.25,0.32]
["Composição Auxiliar",88316,"SINAPI","SERVENTE COM ENCARGOS COMPLEMENTARES","SEDI - SERVIÇOS DIVERSOS",null,"H",8.0000000000000002E-3,18.649999999999999,0.14000000000000001]
["Composição Auxiliar",93244,"SINAPI","ROLO COMPACTADOR VIBRATÓRIO PÉ DE CARNEIRO PARA SOLOS, POTÊNCIA 80 HP, PESO OPERACIONAL SEM/COM LASTRO 7,4 / 8,8 T, LARGURA DE TRABALHO 1,68 M - CHI DIURNO. AF_02/2016","CHOR - CUSTOS HORÁRIOS DE MÁQUINAS E EQUIPAMENTOS",null,"CHI",6.0000000000000001E-3,63.91,0.38]
[{"$nulls":4},"MO sem LS =>",0.59,"LS =>",0,"MO com LS =>",0.59]
[{"$nulls":4},"Valor do BDI =>",0.51,null,"Valor com BDI =>",null,2.91]
[]
[" 3.1 ","Código","Banco","Descrição","Tipo",null,"Und","Quant.","Valor Unit","Total"]
["Composição",101169,"SINAPI","EXECUÇÃO DE PAVIMENTO EM PARALELEPÍPEDOS, REJUNTAMENTO COM ARGAMASSA TRAÇO 1:3 (CIMENTO E AREIA). AF_05/2020","PAVI - PAVIMENTAÇÃO",null,"m²",1,71.33,71.33]
["Composição Auxiliar",5684,"SINAPI","ROLO COMPACTADOR VIBRATÓRIO DE UM CILINDRO AÇO LISO, POTÊNCIA 80 HP, PESO OPERACIONAL MÁXIMO 8,1 T, IMPACTO DINÂMICO 16,15 / 9,5 T, LARGURA DE TRABALHO 1,68 M - CHP DIURNO. AF_06/2014","CHOR - CUSTOS HORÁRIOS DE MÁQUINAS E EQUIPAMENTOS",null,"CHP",3.0999999999999999E-3,160.97,0.49]
["Composição Auxiliar",5685,"SINAPI","ROLO COMPACTADOR VIBRATÓRIO DE UM CILINDRO AÇO LISO, POTÊNCIA 80 HP, PESO OPERACIONAL MÁXIMO 8,1 T, IMPACTO DINÂMICO 16,15 / 9,5 T, LARGURA DE TRABALHO 1,68 M - CHI DIURNO. AF_06/2014","CHOR - CUSTOS HORÁRIOS DE MÁQUINAS E EQUIPAMENTOS",null,"CHI",0.13089999999999999,62.23,8.14]
["Composição Auxiliar",88260,"SINAPI","CALCETEIRO COM ENCARGOS COMPLEMENTARES","SEDI - SERVIÇOS DIVERSOS",null,"H",0.40210000000000001,23.66,9.51]
["Composição Auxiliar",88316,"SINAPI","SERVENTE COM ENCARGOS COMPLEMENTARES","SEDI - SERVIÇOS DIVERSOS",null,"H",0.40210000000000001,18.649999999999999,7.49]
["Composição Auxiliar",88628,"SINAPI","ARGAMASSA TRAÇO 1:3 (EM VOLUME DE CIMENTO E AREIA MÉDIA ÚMIDA), PREPARO MECÂNICO COM BETONEIRA 400 L. AF_08/2019","SEDI - SERVIÇOS DIVERSOS",null,"m³",2.0400000000000001E-2,531.97,10.85]
["Insumo",367,"SINAPI","AREIA GROSSA - POSTO JAZIDA/FORNECEDOR (RETIRADO NA JAZIDA, SEM TRANSPORTE)","Material",null,"m³",0.114,96.24,10.97]
["Insumo",4385,"SINAPI","PARALELEPIPEDO GRANITICO OU BASALTICO, PARA PAVIMENTACAO, SEM FRETE (VARIACAO REGIONAL DE PECAS POR M2)","Material",null,"MIL",3.3000000000000002E-2,723.89,23.88]
[{"$nulls":4},"MO sem LS =>",15.94,"LS =>",0,"MO com LS =>",15.94]
[{"$nulls":4},"Valor do BDI =>",15.22,null,"Valor com BDI =>",null,86.55]
[]
[" 4.1 ","Código","Banco","Descrição","Tipo",null,"Und","Quant.","Valor Unit","Total"]
["Composição",94273,"SINAPI","ASSENTAMENTO DE GUIA (MEIO-FIO) EM TRECHO RETO, CONFECCIONADA EM CONCRETO PRÉ-FABRICADO, DIMENSÕES 100X15X13X30 CM (COMPRIMENTO X BASE INFERIOR X BASE SUPERIOR X ALTURA), PARA VIAS URBANAS (USO VIÁRIO). AF_06/2016","DROP - DRENAGEM/OBRAS DE CONTENÇÃO / POÇOS DE VISITA E CAIXAS",null,"M",1,53.49,53.49]
["Composição Auxiliar",88309,"SINAPI","PEDREIRO COM ENCARGOS COMPLEMENTARES","SEDI - SERVIÇOS DIVERSOS",null,"H",0.39400000000000002,23.85,9.39]
["Composição Auxiliar",88316,"SINAPI","SERVENTE COM ENCARGOS COMPLEMENTARES","SEDI - SERVIÇOS DIVERSOS",null,"H",0.39400000000000002,18.649999999999999,7.34]
["Composição Auxiliar",88629,"SINAPI","ARGAMASSA TRAÇO 1:3 (EM VOLUME DE CIMENTO E AREIA MÉDIA ÚMIDA), PREPARO MANUAL. AF_08/2019","SEDI - SERVIÇOS DIVERSOS",null,"m³",2E-3,633.35,1.26]
["Insumo",370,"SINAPI","AREIA MEDIA - POSTO JAZIDA/FORNECEDOR (RETIRADO NA JAZIDA, SEM TRANSPORTE)","Material",null,"m³",7.0000000000000001E-3,95,0.66]
["Insumo",4059,"SINAPI","MEIO-FIO OU GUIA DE CONCRETO, PRE-MOLDADO, COMP 1 M, *30 X 12/15* CM (H X L1/L2)","Material",null,"M",1.0049999999999999,34.67,34.840000000000003]
[{"$nulls":4},"MO sem LS =>",12.83,"LS =>",0,"MO com LS =>",12.83]
[{"$nulls":4},"Valor do BDI =>",11.42,null,"Valor com BDI =>",null,64.91]
[]
[" 5.1 ","Código","Banco","Descrição","Tipo",null,"Und","Quant.","Valor Unit","Total"]
["Composição",83693,"SINAPI","CAIACAO EM MEIO FIO","PAVI - PAVIMENTAÇÃO",null,"m²",1,4.49,4.49]
["Composição Auxiliar",88310,"SINAPI","PINTOR COM ENCARGOS COMPLEMENTARES","SEDI - SERVIÇOS DIVERSOS",null,"H",0.15,25.08,3.76]
["Composição Auxiliar",88316,"SINAPI","SERVENTE COM ENCARGOS COMPLEMENTARES","SEDI - SERVIÇOS DIVERSOS",null,"H",7.4999999999999997E-3,18.649999999999999,0.13]
["Insumo",11161,"SINAPI","CAL HIDRATADA PARA PINTURA","Material",null,"KG",0.3,2,0.6]
[{"$nulls":4},"MO sem LS =>",2.85,"LS =>",0,"MO com LS =>",2.85]
[{"$nulls":4},"Valor do BDI =>",0.95,null,"Valor com BDI =>",null,5.44]
[]
[" 5.2 ","Código","Banco","Descrição","Tipo",null,"Und","Quant.","Valor Unit","Total"]
["Composição","CPU-05","Próprio","CONSERTO DE QUEBRA NO RAMAL NA RUA SEM PAVIMENTO COM FORNECIMENTO DE MATERIAL HIDRÁULICO","ASTU - ASSENTAMENTO DE TUBOS E PECAS",null,"UND",1,16.260000000000002,16.260000000000002]
["Composição Auxiliar",88316,"SINAPI","SERVENTE COM ENCARGOS COMPLEMENTARES","SEDI - SERVIÇOS DIVERSOS",null,"H",0.2,18.649999999999999,3.73]
["Composição Auxiliar",88267,"SINAPI","ENCANADOR OU BOMBEIRO HIDRÁULICO COM ENCARGOS COMPLEMENTARES","SEDI - SERVIÇOS DIVERSOS",null,"H",0.1,27.97,2.79]
["Insumo",9867,"SINAPI","TUBO PVC, SOLDAVEL, DE 20 MM, AGUA FRIA (NBR-5648)","Material",null,"M",1,4.34,4.34]
["Insumo",3859,"SINAPI","LUVA SOLDAVEL COM ROSCA, PVC, 20 MM X 1/2\", PARA AGUA FRIA PREDIAL","Material",null,"UN",2,1.56,3.12]
["Insumo",10585,"ORSE","Arco de serra un","Material",null,"un",0.1,22.8,2.2799999999999998]
[{"$nulls":4},"MO sem LS =>",5.0199999999999996,"LS =>",0,"MO com LS =>",5.0199999999999996]
[{"$nulls":4},"Valor do BDI =>",3.47,null,"Valor com BDI =>",null,19.73]
[]
[" 5.3 ","Código","Banco","Descrição","Tipo",null,"Und","Quant.","Valor Unit","Total"]
["Composição","CPU-06","Próprio","ESCORAMENTO DE MEIO FIO COM MATERIAL LOCAL COMPACTADO MANUALMENTE, EM FAIXA DE 0,50M","DROP - DRENAGEM/OBRAS DE CONTENÇÃO / POÇOS DE VISITA E CAIXAS",null,"M",1,4.28,4.28]
["Composição Auxiliar",88316,"SINAPI","SERVENTE COM ENCARGOS COMPLEMENTARES","SEDI - SERVIÇOS DIVERSOS",null,"H",0.23,18.649999999999999,4.28]
[{"$nulls":4},"MO sem LS =>",3.1,"LS =>",0,"MO com LS =>",3.1]
[{"$nulls":4},"Valor do BDI =>",0.91,null,"Valor com BDI =>",null,5.19]
[]
[" 6.1 ","Código","Banco","Descrição","Tipo",null,"Und","Quant.","Valor Unit","Total"]
["Composição","CPU-07","Próprio","DETALHAMENTO PROJETO EXECUTIVO DE PAVIMENTAÇÃO","SERT - SERVIÇOS TÉCNICOS",null,"m²",1,0.6,0.6]
[null,null,null,"Composição própria","Serviços",null,"m²",1,0.6,0.6]
[{"$nulls":4},"MO sem LS =>",0.6,"LS =>",0,"MO com LS =>",0.6]
[{"$nulls":4},"Valor do BDI =>",{"$f":"J140-J139","v":0.12},null,"Valor com BDI =>",null,0.72]
[]
[" 7.1 ","Código","Banco","Descrição","Tipo",null,"Und","Quant.","Valor Unit","Total"]
["Composição",95876,"SINAPI","TRANSPORTE COM CAMINHÃO BASCULANTE DE 14 M³, EM VIA URBANA PAVIMENTADA, DMT ATÉ 30 KM (UNIDADE: M3XKM). AF_07/2020 ","TRAN - TRANSPORTES, CARGAS E DESCARGAS",null,"M3XKM",1,2.0699999999999998,2.0699999999999998]
["Composição Auxiliar",89876,"SINAPI","CAMINHÃO BASCULANTE 14 M3, COM CAVALO MECÂNICO DE CAPACIDADE MÁXIMA DE TRAÇÃO COMBINADO DE 36000 KG, POTÊNCIA 286 CV, INCLUSIVE SEMIREBOQUE COM CAÇAMBA METÁLICA - CHP DIURNO. AF_12/2014","CHOR - CUSTOS HORÁRIOS DE MÁQUINAS E EQUIPAMENTOS",null,"CHP",5.8999999999999999E-3,319.99,1.88]
["Composição Auxiliar",89877,"SINAPI","CAMINHÃO BASCULANTE 14 M3, COM CAVALO MECÂNICO DE CAPACIDADE MÁXIMA DE TRAÇÃO COMBINADO DE 36000 KG, POTÊNCIA 286 CV, INCLUSIVE SEMIREBOQUE COM CAÇAMBA METÁLICA - CHI DIURNO. AF_12/2014","CHOR - CUSTOS HORÁRIOS DE MÁQUINAS E EQUIPAMENTOS",null,"CHI",2.5000000000000001E-3,76.98,0.19]
[{"$nulls":4},"MO sem LS =>",0.14000000000000001,"LS =>",0,"MO com LS =>",0.14000000000000001]
[{"$nulls":4},"Valor do BDI =>",0.44,null,"Valor com BDI =>",null,2.5099999999999998]
[]
[" 7.2 ","Código","Banco","Descrição","Tipo",null,"Und","Quant.","Valor Unit","Total"]
["Composição",93593,"SINAPI","TRANSPORTE COM CAMINHÃO BASCULANTE DE 14 M³, EM VIA URBANA PAVIMENTADA, ADICIONAL PARA DMT EXCEDENTE A 30 KM (UNIDADE: M3XKM). AF_07/2020","TRAN - TRANSPORTES, CARGAS E DESCARGAS",null,"M3XKM",1,0.83,0.83]
["Composição Auxiliar",89876,"SINAPI","CAMINHÃO BASCULANTE 14 M3, COM CAVALO MECÂNICO DE CAPACIDADE MÁXIMA DE TRAÇÃO COMBINADO DE 36000 KG, POTÊNCIA 286 CV, INCLUSIVE SEMIREBOQUE COM CAÇAMBA METÁLICA - CHP DIURNO. AF_12/2014","CHOR - CUSTOS HORÁRIOS DE MÁQUINAS E EQUIPAMENTOS",null,"CHP",2.3999999999999998E-3,319.99,0.76]
["Composição Auxiliar",89877,"SINAPI","CAMINHÃO BASCULANTE 14 M3, COM CAVALO MECÂNICO DE CAPACIDADE MÁXIMA DE TRAÇÃO COMBINADO DE 36000 KG, POTÊNCIA 286 CV, INCLUSIVE SEMIREBOQUE COM CAÇAMBA METÁLICA - CHI DIURNO. AF_12/2014","CHOR - CUSTOS HORÁRIOS DE MÁQUINAS E EQUIPAMENTOS",null,"CHI",1E-3,76.98,7.0000000000000007E-2]
[{"$nulls":4},"MO sem LS =>",0.05,"LS =>",0,"MO com LS =>",0.05]
[{"$nulls":4},"Valor do BDI =>",0.17,null,"Valor com BDI =>",null,1]
[]
[" 7.5 ","Código","Banco","Descrição","Tipo",null,"Und","Quant.","Valor Unit","Total"]
["Composição",93592,"SINAPI","TRANSPORTE COM CAMINHÃO BASCULANTE DE 14 M³, EM VIA URBANA EM REVESTIMENTO PRIMÁRIO (UNIDADE: M3XKM). AF_07/2020 (BOTA-FORA)","TRAN - TRANSPORTES, CARGAS E DESCARGAS",null,"M3XKM",1,2.2799999999999998,2.2799999999999998]
["Composição Auxiliar",89876,"SINAPI","CAMINHÃO BASCULANTE 14 M3, COM CAVALO MECÂNICO DE CAPACIDADE MÁXIMA DE TRAÇÃO COMBINADO DE 36000 KG, POTÊNCIA 286 CV, INCLUSIVE SEMIREBOQUE COM CAÇAMBA METÁLICA - CHP DIURNO. AF_12/2014","CHOR - CUSTOS HORÁRIOS DE MÁQUINAS E EQUIPAMENTOS",null,"CHP",6.4999999999999997E-3,319.99,2.0699999999999998]
["Composição Auxiliar",89877,"SINAPI","CAMINHÃO BASCULANTE 14 M3, COM CAVALO MECÂNICO DE CAPACIDADE MÁXIMA DE TRAÇÃO COMBINADO DE 36000 KG, POTÊNCIA 286 CV, INCLUSIVE SEMIREBOQUE COM CAÇAMBA METÁLICA - CHI DIURNO. AF_12/2014","CHOR - CUSTOS HORÁRIOS DE MÁQUINAS E EQUIPAMENTOS",null,"CHI",2.8E-3,76.98,0.21]
[{"$nulls":4},"MO sem LS =>",0.17,"LS =>",0,"MO com LS =>",0.17]
[{"$nulls":4},"Valor do BDI =>",0.48,null,"Valor com BDI =>",null,2.76]

{"sheet":"PROJ.EXEC","index":9,"n_rows":34,"n_cols":6,"rows_kept":34,"cut":false,"hidden":false,"merged":[[7,0,7,7],[0,1,0,7],[1,1,1,7],[2,1,2,7],[3,1,3,7],[4,1,4,7]]}
[null,"Ministério do Desenvolvimento Regional - MDR"]
[null,"Companhia de Desenvolvimento dos Vales do São Francisco e do Parnaíba"]
[null,"5ª Superintendência Regional"]
[null,"Gerência Regional de Infraestrutura"]
[null,"Unidade Regional de Estudos e Projetos"]
[]
[]
["CPU - 07 - COMPOSIÇÃO PREÇO PROJETO EXECUTIVO "]
["A- EQUIPE TÉCNICA",{"$nulls":4},{"$f":"SUM(F11:F15)","v":2807.25}]
["Cod. SINAPI","A.1 - Pessoal de Nível Superior","Unidade","Quant.","Pr. Unit.","Pr. Total"]
[90777,"Engenheiro","h",15,119.76,{"$f":"E11*D11","v":1796.4}]
[90781,"Topógrafo","h",10,42.16,{"$f":"E12*D12","v":421.59999999999997}]
[null,"A.2 - Pessoal de Nível Técnico e Aux."]
[88253,"Auxiliar de Topógrafo","h",10,20.03,{"$f":"E14*D14","v":200.3}]
[90773,"Desenhista","h",15,25.93,388.95]
["B - ENCARGOS SOCIAIS"]
[null,"JÁ INCLUSOS EM \"A-EQUIPE TÉCNICA\""]
["C - DESPESAS GERAIS",{"$nulls":4},{"$f":"SUM(F20:F26)","v":114.28}]
["Cod. SINAPI",null,"Unid.","Quant.","Pr. Unit.","Pr. Total"]
[null,"C.1 - Materiais de Consumo"]
[null,"C.2 - Veículos"]
["ORSE/5896","Veículo tipo sedan ou pick-up capacidade 0,6 ton h","h",8,8.33,{"$f":"E22*D22","v":66.64}]
[null,"C.3 - Combustível"]
[4222,"GASOLINA COMUM","l",2,5.82,{"$f":"E24*D24","v":11.64}]
[null,"C.3 - Equipamentos, Instalações e Mobiliário"]
[7247,"LOCACAO DE TEODOLITO ELETRONICO, PRECISAO ANGULAR DE 5 A 7 SEGUNDOS, INCLUINDO TRIPE","h",16,2.25,36]
["D - ENSAIOS",{"$nulls":4},{"$f":"SUM(F29:F30)","v":655.99292500000001}]
["Cod. SINAPI"]
[101385,"Auxiliar de Laboratório","mês",{"$f":"7000*0.0000107","v":7.4899999999999994E-2},4522.66,{"$f":"E29*D29","v":338.74723399999999}]
["*B8957","Laboratório de Solos","mês",{"$f":"7000*0.0000107","v":7.4899999999999994E-2},4235.59,{"$f":"E30*D30","v":317.24569099999997}]
["*Relatório de Custos Gerais do DNIT, página 1"]
["SOMA",{"$nulls":4},{"$f":"SUM(F27,F18,F9)","v":3577.5229250000002}]
[]
[{"$nulls":4},"Por m²:",{"$f":"F32/(MEMÓRIA!M11*1000)","v":0.59625382083333334}]

{"sheet":"DES.MOB.","index":10,"n_rows":31,"n_cols":7,"rows_kept":31,"cut":false,"hidden":false,"merged":[[7,0,7,7],[1,1,1,7],[0,1,0,7],[2,1,2,7],[3,1,3,7],[4,1,4,7]]}
[null,"Ministério do Desenvolvimento Regional - MDR"]
[null,"Companhia de Desenvolvimento dos Vales do São Francisco e do Parnaíba"]
[null,"5ª Superintendência Regional"]
[null,"Gerência Regional de Infraestrutura"]
[null,"Unidade Regional de Estudos e Projetos"]
[]
[]
["MEMÓRIA DE CÁLCULO DOS MOMENTOS DE TRANSPORTE PARA MOBILIZAÇÃO E DESMOBILIZAÇÃO"]
["Deslocamento:"]
[null,"Distância méd. (Km)","Qtde.","Total (Km)"]
["Mobilização (entre os trechos de serviço);",1,1,1]
["Desmobilização (entre os trechos de serviço):",1,1,1]
["Mobilização intermunicipal (entre as localidades):",10,1,10]
["Desmobilização intermunicipal (entre as localidades):",10,1,10]
[null,null,"Mobilização - Total (km)",11]
[null,null,"Desmobilização - Total (km)",11]
[]
["Peso das máquinas:"]
["Betoneira capacidade nominal de 400 l, capacidade de mistura 280 l, motor elétrico trifásico potência de 2 cv, sem carregador",{"$nulls":4},1,"ton"]
["Rolo compactador vibratório de um cilindro aço liso, potência 80 hp, peso operacional máximo 8,1 t, impacto dinâmico 16,15 / 9,5 t, largura de trabalho 1,68 m",{"$nulls":4},9.5,"ton"]
["Rolo compactador vibratório pé de carneiro para solos, potência 80 hp, peso operacional sem/com lastro 7,4 / 8,8 t, largura de trabalho 1,68 m",{"$nulls":4},8.8000000000000007,"ton"]
["Trator de esteiras, potência 150 hp, peso operacional 16,7 t, com roda motriz elevada e lâmina 3,18 m3",{"$nulls":4},16.7,"ton"]
["Trator de esteiras, potência 100 hp, peso operacional 9,4 t, com lâmina 2,19 m3",{"$nulls":4},9.4,"ton"]
["Motoniveladora potência básica líquida (primeira marcha) 125 hp, peso bruto 13032 kg, largura da lâmina de 3,7 m",{"$nulls":4},13,"ton"]
["Pá carregadeira sobre rodas, potência líquida 128 hp, capacidade da caçamba 1,7 a 2,8 m3, peso operacional 11632 kg",{"$nulls":4},11.6,"ton"]
[]
[null,null,null,"Total",null,{"$f":"SUM(F19:F26)","v":70},"ton"]
["Portanto:"]
[null,null,"Mobilização - Total (km)",{"$f":"F27*D15","v":770},"t x km"]
[null,null,"Desmobilização - Total (km)",{"$f":"F27*D16","v":770},"t x km"]
[null,null,null,{"$f":"TRUNC(D29+D30,2)","v":1540}]

{"sheet":"EAI","index":11,"n_rows":37,"n_cols":20,"rows_kept":37,"cut":false,"hidden":true,"merged":[[13,16,13,17],[15,1,35,1],[9,0,11,0],[9,3,9,5],[9,6,9,7],[9,9,11,9],[10,14,10,15],[13,1,14,1],[13,2,13,6],[7,0,7,19],[0,3,0,8],[1,3,1,8],[2,3,2,8],[3,3,3,8],[4,3,4,8]]}
[null,null,null,"Ministério do Desenvolvimento Regional - MDR"]
[null,null,null,"Companhia de Desenvolvimento dos Vales do São Francisco e do Parnaíba"]
[null,null,null,"5ª Superintendência Regional"]
[null,null,null,"Gerência Regional de Infraestrutura"]
[null,null,null,"Unidade Regional de Estudos e Projetos"]
[]
[]
["MEMÓRIA DE CÁLCULO"]
[]
["REAJUSTE",null,null,"TIPOLOGIA DO MATERIAL",null,null,"EAI",null,null,"IMPOSTOS","COFINS",6.4999999999999997E-3]
[{"$nulls":4},"INDÍCE","2014-07-01","ÍNDICE INICIAL",270.23700000000002,null,null,"PIS",0.03,null,null,"LEGENDA"]
[{"$nulls":4},{"$f":"H12/H11","v":{"$error":"#REF!"}},"2023-07-01","ÍNDICE FINAL",{"$f":"#REF!","v":{"$error":"#REF!"}},null,null,"ICMS",0.18,null,null,"ENTRADA DE DADOS"]
[]
["DATA-BASE","MATERIAL","LOCAL",{"$nulls":4},"CUSTO ANP (R$/Kg)","CUSTO ANP","IMPOSTOS DO PRODUTO","CUSTO DO PRODUTO COM IMPOSTOS","DMTs","CUSTO DO TRANSPORTE RODOVIA PAVIMENTADA","IMCS","ATUALIZAÇÃO DO CUSTO DE TRANSPORTE","CUSTO DO TRANSPORTE RODOVIA PAVIMENTADA COM IMPOSTO E ATUALIZAÇÃO MONETÁRIA","PEDÁGIO",null,"TOTAL TRANSPORTE","TOTAL GERAL (TRANSP. + AQUISIÇÃO)"]
["2023-07-01",null,"REFINARIAS","ENDEREÇO","ESTADO","CIDADE","DESTINO","ESTADO","R$/t","R$/t","R$/t","KM","R$/t","R$/t","R$/t","R$/t","CUSTO","R$/t","R$/t","R$/t"]
[1,"Emulsão Asfáltica para Imprimação - EAI","Refinaria Lubrificantes e Derivados do Nordeste (Lubnor)","Av. Leite Barbosa, s/nº - Mucuripe - Fortaleza - Ceará\nCEP: 60180-420","Ceará","Fortaleza - CE","Arapiraca - AL",{"$f":"#REF!","v":{"$error":"#REF!"}},{"$f":"IFERROR(H16*1000,\"-\")","v":"-"},{"$f":"IFERROR(K16-I16,\"-\")","v":"-"},{"$f":"IFERROR(TRUNC(I16*(1+(1/(1-$L$10-$L$11))*($L$10+$L$11+($L$12/(1-$L$12)))),2),\"-\")","v":"-"},946,{"$f":"IF(L16=0,0,((26.939+0.253*L16)))","v":266.27699999999999},{"$f":"TRUNC(M16*($L$12/(1-$L$12)),2)","v":58.45},{"$f":"M16*1.1*($H$12/$H$11)","v":{"$error":"#REF!"}},{"$f":"N16+O16","v":{"$error":"#REF!"}},0,{"$f":"(ROUNDUP(((#REF!)*2/28),0)*Q16)/(#REF!)","v":{"$error":"#REF!"}},{"$f":"P16+R16","v":{"$error":"#REF!"}},{"$f":"IFERROR(S16+K16,\"-\")","v":"-"}]
[2,null,"CENTRO OESTE ASFALTOS LTDA","Setor de Inflamáveis, S/N, Trecho 02 - Lote 1.100 - Guará - CEP: 71225-000","Distrito Federal","Brasília -DF","Arapiraca - AL",{"$f":"#REF!","v":{"$error":"#REF!"}},{"$f":"IFERROR(H17*1000,\"-\")","v":"-"},{"$f":"IFERROR(K17-I17,\"-\")","v":"-"},{"$f":"IFERROR(TRUNC(I17*(1+(1/(1-$L$10-$L$11))*($L$10+$L$11+($L$12/(1-$L$12)))),2),\"-\")","v":"-"},1803,{"$f":"IF(L17=0,0,((26.939+0.253*L17)))","v":483.09800000000001},{"$f":"TRUNC(M17*($L$12/(1-$L$12)),2)","v":106.04},{"$f":"M17*1.1*($H$12/$H$11)","v":{"$error":"#REF!"}},{"$f":"N17+O17","v":{"$error":"#REF!"}},null,{"$f":"(ROUNDUP(((#REF!)*2/28),0)*Q17)/(#REF!)","v":{"$error":"#REF!"}},{"$f":"P17+R17","v":{"$error":"#REF!"}},{"$f":"IFERROR(S17+K17,\"-\")","v":"-"}]
[3,null,"STRATURA ASFALTOS S/A","Av. Presidente Wilson, 08 - Junidaí - CEP: 75115-100","Goiás","Anápolis - GO","Arapiraca - AL",{"$f":"#REF!","v":{"$error":"#REF!"}},"-","-","-",1997,532.17999999999995,116.82,{"$error":"#REF!"},{"$error":"#REF!"},null,{"$f":"(ROUNDUP(((#REF!)*2/28),0)*Q18)/(#REF!)","v":{"$error":"#REF!"}},{"$error":"#REF!"},"-"]
[4,null,"DISTRIBUIDORA BRASILEIRA DE ASFALTO AS - DISBRAL","Via Primária Oito, S/N - Daiag, Aparecida de Goiânia - GO, 74993-430","Goiás","Aparecida de Goiânia -GO","Arapiraca - AL",{"$f":"#REF!","v":{"$error":"#REF!"}},"-","-","-",2015,536.73400000000004,117.81,{"$error":"#REF!"},{"$error":"#REF!"},null,{"$f":"(ROUNDUP(((#REF!)*2/28),0)*Q19)/(#REF!)","v":{"$error":"#REF!"}},{"$error":"#REF!"},"-"]
[5,null,"INDÚSTRIA NACIONAL DE ASFALTOS S/A","VIA PRIMEIRA E SEGUNDA 3, S/N.º LOTES 01 A 10 - DISTRITO AGROINDUSTRIAL - CEP: 75370-000","Goiás","Goianira - GO","Arapiraca - AL",{"$f":"#REF!","v":{"$error":"#REF!"}},"-","-","-",2021,538.25199999999995,118.15,{"$error":"#REF!"},{"$error":"#REF!"},null,{"$f":"(ROUNDUP(((#REF!)*2/28),0)*Q20)/(#REF!)","v":{"$error":"#REF!"}},{"$error":"#REF!"},"-"]
[6,null,"STRATURA ASFALTOS S/A","RUA VICTOR RODRIGUES RESENDE, 333 - DISTRITO IND. DE UBERLÂNDIA - CEP: 38405-440","Minas Gerais","Uberlândia - MG","Arapiraca - AL",{"$f":"#REF!","v":{"$error":"#REF!"}},"-","-","-",1791,480.06200000000001,105.37,{"$error":"#REF!"},{"$error":"#REF!"},177,{"$f":"(ROUNDUP(((#REF!)*2/28),0)*Q21)/(#REF!)","v":{"$error":"#REF!"}},{"$error":"#REF!"},"-"]
[7,null,"BETUNEL INDÚSTRIA E COMÉRCIO LTDA.","RUA VICTOR RODRIGUES DE REZENDE, 185 - DISTRITO INDUSTRIAL - CEP: 38402-334","Minas Gerais","Uberlândia - MG","Arapiraca - AL",{"$f":"#REF!","v":{"$error":"#REF!"}},"-","-","-",1999,532.68600000000004,116.93,{"$error":"#REF!"},{"$error":"#REF!"},177,{"$f":"(ROUNDUP(((#REF!)*2/28),0)*Q22)/(#REF!)","v":{"$error":"#REF!"}},{"$error":"#REF!"},"-"]
[8,null,"DISTRIBUIDORA BRASILEIRA DE ASFALTO AS - DISBRAL","R. São Judas Tadeu, 288 - Cachoeira, Sarzedo - MG, 32450-000","Minas Gerais","Sarzedo - MG","Arapiraca - AL",{"$f":"#REF!","v":{"$error":"#REF!"}},"-","-","-",1800,482.339,105.87,{"$error":"#REF!"},{"$error":"#REF!"},177,{"$f":"(ROUNDUP(((#REF!)*2/28),0)*Q23)/(#REF!)","v":{"$error":"#REF!"}},{"$error":"#REF!"},"-"]
[9,null,"NACIONAL DE ASFALTOS S/A","Nacional Asfaltos, Q. 1112 Sul Alameda 3, 16 - Plano Diretor Sul, Palmas - TO, 77024-166","Tocantins","Palmas - TO","Arapiraca - AL",{"$f":"#REF!","v":{"$error":"#REF!"}},"-","-","-",1792,480.315,105.43,{"$error":"#REF!"},{"$error":"#REF!"},null,{"$f":"(ROUNDUP(((#REF!)*2/28),0)*Q24)/(#REF!)","v":{"$error":"#REF!"}},{"$error":"#REF!"},"-"]
[10,null,"Usina de Asfalto Santa Edwiges Ltda"," Av. Jairo Pacheco, 185 - Loteamento Polo Empresarial Oeste, Campo Grande - MS, 79108-650","Mato Grosso do Sul","Campo Grande - MS","Arapiraca - AL",{"$f":"#REF!","v":{"$error":"#REF!"}},"-","-","-",2852,748.495,164.3,{"$error":"#REF!"},{"$error":"#REF!"},null,{"$f":"(ROUNDUP(((#REF!)*2/28),0)*Q25)/(#REF!)","v":{"$error":"#REF!"}},{"$error":"#REF!"},"-"]
[11,null,"ARAPETRO DISTRIBUIDORA DE PETRÓLEO LTDA.","RUA 04, S/Nº LOTES 17 A 20. - DISTRITO INDUSTRIAL 1/8 - CEP: 78600-000","Mato Grosso","Barra do Garcas - MT","Arapiraca - AL",{"$f":"#REF!","v":{"$error":"#REF!"}},"-",{"$f":"IFERROR(K26-I26,\"-\")","v":"-"},"-",3195,835.274,183.35,{"$error":"#REF!"},{"$error":"#REF!"},112.2,{"$f":"(ROUNDUP(((#REF!)*2/28),0)*Q26)/(#REF!)","v":{"$error":"#REF!"}},{"$error":"#REF!"},"-"]
[12,null,"CENTRO OESTE ASFALTOS LTDA","Rua N, S/Nº. LOTES 39/43 E LOTES 129/133 - DISTRITO INDUSTRIAL - CEP: 78098-400 ","Mato Grosso","Cuiabá - MT","Arapiraca - AL",{"$f":"#REF!","v":{"$error":"#REF!"}},"-","-","-",2849,747.73599999999999,164.13,{"$error":"#REF!"},{"$error":"#REF!"},254.4,{"$f":"(ROUNDUP(((#REF!)*2/28),0)*Q27)/(#REF!)","v":{"$error":"#REF!"}},{"$error":"#REF!"},"-"]
[13,null,"BETUNEL INDÚSTRIA E COMÉRCIO LTDA.","RUA N ESQUINA COM RUA X, S/N QD. ND. 7 L 01/08 - DIST. IND. - CEP: 78015-285","Mato Grosso","Cuiabá - MT","Arapiraca - AL",{"$f":"#REF!","v":{"$error":"#REF!"}},"-","-","-",2849,747.73599999999999,164.13,{"$error":"#REF!"},{"$error":"#REF!"},254.4,{"$f":"(ROUNDUP(((#REF!)*2/28),0)*Q28)/(#REF!)","v":{"$error":"#REF!"}},{"$error":"#REF!"},"-"]
[14,null,"EMAM - EMULSÕES E TRANSPORTES LTDA.","RODOVIA DOS IMIGRANTES, S/Nº - KM 8,6 - CAPELA DO PISSARRÃO, Várzea Grande - MT, 78132-400","Mato Grosso","Varzea Grande - MT","Arapiraca - AL",{"$f":"#REF!","v":{"$error":"#REF!"}},"-","-","-",2869,752.79599999999994,165.24,{"$error":"#REF!"},{"$error":"#REF!"},254.4,{"$f":"(ROUNDUP(((#REF!)*2/28),0)*Q29)/(#REF!)","v":{"$error":"#REF!"}},{"$error":"#REF!"},"-"]
[15,null,"NTA - NOVAS TÉCNICAS DE ASFALTOS S/A","R. Sofía A Fadim, 150 - Santa Terezinha, Paulínia - SP, 13140-000","São Paulo","Paulínia - SP","Arapiraca - AL",{"$f":"#REF!","v":{"$error":"#REF!"}},"-","-","-",2358,623.51299999999992,136.86000000000001,{"$error":"#REF!"},{"$error":"#REF!"},436.8,{"$f":"(ROUNDUP(((#REF!)*2/28),0)*Q30)/(#REF!)","v":{"$error":"#REF!"}},{"$error":"#REF!"},"-"]
[16,null,"COMPANHIA BRASILEIRA DE ASFALTOS DA AMAZÔNIA - IMPORTAÇÃO E EXPORTAÇÃO","Avenida Doutor Olindo Dártora 2451, Galpão 02, Morro Grande - CEP: 07726-555","São Paulo","Caieiras - SP","Arapiraca - AL",{"$f":"#REF!","v":{"$error":"#REF!"}},"-","-","-",2328,615.923,135.19999999999999,{"$error":"#REF!"},{"$error":"#REF!"},294.60000000000002,{"$f":"(ROUNDUP(((#REF!)*2/28),0)*Q31)/(#REF!)","v":{"$error":"#REF!"}},{"$error":"#REF!"},"-"]
[17,null,"VIAPOL LTDA.","Rod. Vito Ardito, 6401 - Km 118,5 - Jardim Campo Grande, Caçapava - SP, 12282-535","São Paulo","Caçapava - SP","Arapiraca - AL",{"$f":"#REF!","v":{"$error":"#REF!"}},"-","-","-",2191,581.26199999999994,127.59,{"$error":"#REF!"},{"$error":"#REF!"},399.6,{"$f":"(ROUNDUP(((#REF!)*2/28),0)*Q32)/(#REF!)","v":{"$error":"#REF!"}},{"$error":"#REF!"},"-"]
[18,null,"STRATURA ASFALTOS S/A","R. Luís de Camões - Campos Elyseos, Duque de Caxias - RJ, 25225-035","Rio de Janeiro","Duque de Caxias - RJ","Arapiraca - AL",{"$f":"#REF!","v":{"$error":"#REF!"}},"-","-","-",1957,522.05999999999995,114.59,{"$error":"#REF!"},{"$error":"#REF!"},null,{"$f":"(ROUNDUP(((#REF!)*2/28),0)*Q33)/(#REF!)","v":{"$error":"#REF!"}},{"$error":"#REF!"},"-"]
[19,null,"PROBITEC - PRODUTOS BETUMINOSOS E TECNOLOGIA DE APLICAÇÃO LTDA.","Av. Canal da Pavuna, 620 - Pavuna, Rio de Janeiro - RJ, 21535-630","Rio de Janeiro","Rio de Janeiro - RJ","Arapiraca - AL",{"$f":"#REF!","v":{"$error":"#REF!"}},"-","-","-",1974,526.36099999999999,115.54,{"$error":"#REF!"},{"$error":"#REF!"},null,{"$f":"(ROUNDUP(((#REF!)*2/28),0)*Q34)/(#REF!)","v":{"$error":"#REF!"}},{"$error":"#REF!"},"-"]
[20,null,"CASA DO ASFALTO DISTRIBUIDORA, INDÚSTRIA E COMÉRCIO DE ASFALTO LTDA","BR-376 Lote 6/7/7 A-3-1 Gleba Patrimônio - Marialva, PR, 86990-000","Paraná","Marialva - PR","Arapiraca - AL",{"$f":"#REF!","v":{"$error":"#REF!"}},"-","-","-",2649,697.13599999999997,153.02000000000001,{"$error":"#REF!"},{"$error":"#REF!"},889.8,{"$f":"(ROUNDUP(((#REF!)*2/28),0)*Q35)/(#REF!)","v":{"$error":"#REF!"}},{"$error":"#REF!"},"-"]
[21,null,"PETROBRAS DISTRIBUIDORA S.A.","R. Maquinista Eleodoro Jacinto, 100 - Oficinas, Ponta Grossa - PR, 84045-170","Paraná","Ponta Grossa - PR","Arapiraca - AL",{"$f":"#REF!","v":{"$error":"#REF!"}},"-","-","-",2773,728.50799999999992,159.91,{"$error":"#REF!"},{"$error":"#REF!"},747.6,{"$f":"(ROUNDUP(((#REF!)*2/28),0)*Q36)/(#REF!)","v":{"$error":"#REF!"}},{"$error":"#REF!"},"-"]
[{"$nulls":19},{"$f":"SUBTOTAL(5,T16:T36)","v":0}]

{"sheet":"CAP (2)","index":12,"n_rows":28,"n_cols":20,"rows_kept":28,"cut":false,"hidden":true,"merged":[[13,16,13,17],[15,1,26,1],[9,0,11,0],[9,3,9,5],[9,6,9,7],[9,9,11,9],[10,14,10,15],[13,1,14,1],[13,2,13,6],[7,0,7,19],[0,3,0,8],[1,3,1,8],[2,3,2,8],[3,3,3,8],[4,3,4,8]]}
[null,null,null,"Ministério do Desenvolvimento Regional - MDR"]
[null,null,null,"Companhia de Desenvolvimento dos Vales do São Francisco e do Parnaíba"]
[null,null,null,"5ª Superintendência Regional"]
[null,null,null,"Gerência Regional de Infraestrutura"]
[null,null,null,"Unidade Regional de Estudos e Projetos"]
[]
[]
["MEMÓRIA DE CÁLCULO"]
[]
["REAJUSTE",null,null,"TIPOLOGIA DO MATERIAL",null,null,"CIMENTOS ASFÁLTICOS CAP-50/70",null,null,"IMPOSTOS","COFINS",6.4999999999999997E-3]
[{"$nulls":4},"INDÍCE","2014-07-01","ÍNDICE INICIAL",270.23700000000002,null,null,"PIS",0.03,{"$f":"(H12-H11)/H12","v":0.50482010499601448},null,"LEGENDA"]
[{"$nulls":4},{"$f":"H12/H11","v":2.0194680965226817},"2023-07-01","ÍNDICE FINAL",545.73500000000001,null,null,"ICMS",0.18,null,null,"ENTRADA DE DADOS"]
[]
["DATA-BASE","MATERIAL","LOCAL",{"$nulls":4},"CUSTO ANP (R$/Kg)","CUSTO ANP","IMPOSTOS DO PRODUTO","CUSTO DO PRODUTO COM IMPOSTOS","DMTs","CUSTO DO TRANSPORTE RODOVIA PAVIMENTADA","IMCS","ATUALIZAÇÃO DO CUSTO DE TRANSPORTE","CUSTO DO TRANSPORTE RODOVIA PAVIMENTADA COM IMPOSTO E ATUALIZAÇÃO MONETÁRIA","PEDÁGIO",null,"TOTAL TRANSPORTE","TOTAL GERAL (TRANSP. + AQUISIÇÃO)"]
["2022-01-01",null,"REFINARIAS","ENDEREÇO","ESTADO","CIDADE","DESTINO","ESTADO","R$/t","R$/t","R$/t","KM","R$/t","R$/t","R$/t","R$/t","CUSTO","R$/t","R$/t","R$/t"]
[1,"CAP 50-70","Refinaria Landulpho Alves (RLAM)","Rodovia BA 523, KM 4 - Mataripe São Francisco do Conde - BA \nCEP: 43900-000","Bahia","SÃO FRANCISCO DO CONDE - BA","Maceió-AL",{"$f":"#REF!","v":{"$error":"#REF!"}},{"$f":"H16*1000","v":{"$error":"#REF!"}},{"$f":"K16-I16","v":{"$error":"#REF!"}},{"$f":"TRUNC(I16*(1/(1-($L$10+$L$11)))*(1/(1-$L$12)),2)","v":{"$error":"#REF!"}},566,{"$f":"IF(L16=0,0,((26.939+0.253*L16)))","v":170.137},{"$f":"TRUNC(M16*($L$12/(1-$L$12)),2)","v":37.340000000000003},{"$f":"M16*1.1*($H$12/$H$11)","v":377.9448678918875},{"$f":"N16+O16","v":415.28486789188753},37.9,{"$f":"(ROUNDUP(((#REF!)*2/28),0)*Q16)/(#REF!)","v":{"$error":"#REF!"}},{"$f":"P16+R16","v":{"$error":"#REF!"}},{"$f":"S16+K16","v":{"$error":"#REF!"}}]
[2,null,"Emam Asfaltos","Av. Antônio Paterson, 213 - Nova Candeias, Candeias - BA, 43815-370","Bahia","CANDEIAS - BA","Maceió-AL",{"$f":"#REF!","v":{"$error":"#REF!"}},{"$error":"#REF!"},{"$error":"#REF!"},{"$f":"TRUNC(I17*(1/(1-($L$10+$L$11)))*(1/(1-$L$12)),2)","v":{"$error":"#REF!"}},557,{"$f":"IF(L17=0,0,((26.939+0.253*L17)))","v":167.85999999999999},{"$f":"TRUNC(M17*($L$12/(1-$L$12)),2)","v":36.840000000000003},{"$f":"M17*1.1*($H$12/$H$11)","v":372.88670615052706},{"$f":"N17+O17","v":409.72670615052709},37.9,{"$f":"(ROUNDUP(((#REF!)*2/28),0)*Q17)/(#REF!)","v":{"$error":"#REF!"}},{"$f":"P17+R17","v":{"$error":"#REF!"}},{"$error":"#REF!"}]
[3,null,"Emam Asfaltos","CE-060, Km 11,5 - Pavuna, Pacatuba - CE, 61800-000","Ceará","FORTALEZA - CE","Maceió-AL",{"$f":"#REF!","v":{"$error":"#REF!"}},{"$error":"#REF!"},{"$error":"#REF!"},{"$f":"TRUNC(I18*(1/(1-($L$10+$L$11)))*(1/(1-$L$12)),2)","v":{"$error":"#REF!"}},961,270.072,{"$f":"TRUNC(M18*($L$12/(1-$L$12)),2)","v":59.28},{"$f":"M18*1.1*($H$12/$H$11)","v":599.94196654048108},{"$f":"N18+O18","v":659.22196654048105},0,{"$f":"(ROUNDUP(((#REF!)*2/28),0)*Q18)/(#REF!)","v":{"$error":"#REF!"}},{"$error":"#REF!"},{"$f":"S18+K18","v":{"$error":"#REF!"}}]
[4,null,"Refinaria Duque de Caxias (Reduc)","Rodovia Washignton Luiz, km 113,7 Campos Elíseos - Duque de Caxias - RJ\nCEP: 25213-005","Rio de Janeiro","DUQUE DE CAXIAS - RJ","Maceió-AL",{"$f":"#REF!","v":{"$error":"#REF!"}},{"$error":"#REF!"},{"$error":"#REF!"},{"$f":"TRUNC(I19*(1/(1-($L$10+$L$11)))*(1/(1-$L$12)),2)","v":{"$error":"#REF!"}},2050,545.58899999999994,{"$f":"TRUNC(M19*($L$12/(1-$L$12)),2)","v":119.76},1211.9795372450847,1331.7395372450846,288.60000000000002,{"$f":"(ROUNDUP(((#REF!)*2/28),0)*Q19)/(#REF!)","v":{"$error":"#REF!"}},{"$error":"#REF!"},{"$error":"#REF!"}]
[5,null,"Refinaria Alberto Pasqualini (Refap)","Av. Getúlio Vargas, 11001 - Bairro Brigadeira Canoas - RS - Brasil\nCEP: 92420-221","Rio Grande do Sul","CANOAS - RS","Maceió-AL",{"$f":"#REF!","v":{"$error":"#REF!"}},{"$error":"#REF!"},{"$error":"#REF!"},{"$error":"#REF!"},3580,932.67899999999997,{"$f":"TRUNC(M20*($L$12/(1-$L$12)),2)","v":204.73},2071.8670332763463,2276.5970332763463,854.4,{"$f":"(ROUNDUP(((#REF!)*2/28),0)*Q20)/(#REF!)","v":{"$error":"#REF!"}},{"$error":"#REF!"},{"$error":"#REF!"}]
[6,null,"Refinaria Gabriel Passos (Regap)","Av. Refinaria Gabriel Passos, 690, Distrito Industrial, Paulo Camilo Sul Betim - MG\nCEP: 32669-205","Minas Gerais","BETIM - MG","Maceió-AL",{"$f":"#REF!","v":{"$error":"#REF!"}},{"$error":"#REF!"},{"$error":"#REF!"},{"$error":"#REF!"},1816,486.387,106.76,1080.4673319697154,1187.2273319697154,177,{"$f":"(ROUNDUP(((#REF!)*2/28),0)*Q21)/(#REF!)","v":{"$error":"#REF!"}},{"$error":"#REF!"},{"$error":"#REF!"}]
[7,null,"Unidade de Industrialização do Xisto (SIX)","Rodovia do Xisto, BR 472, KM 153, São Mateus do Sul - PR, CEP 83900-000","Paraná","SÃO MATEUS DO SUL - PR","Maceió-AL",{"$f":"#REF!","v":{"$error":"#REF!"}},{"$error":"#REF!"},{"$error":"#REF!"},{"$error":"#REF!"},2985,{"$f":"IF(L22=0,0,((26.939+0.253*L22)))","v":782.14400000000001},171.69,{"$f":"M22*1.1*($H$12/$H$11)","v":1737.4663403753002},{"$f":"N22+O22","v":1909.1563403753003},585.6,{"$f":"(ROUNDUP(((#REF!)*2/28),0)*Q22)/(#REF!)","v":{"$error":"#REF!"}},{"$f":"P22+R22","v":{"$error":"#REF!"}},{"$f":"S22+K22","v":{"$error":"#REF!"}}]
[8,null,"Refinaria Presidente Getúlio Vargas (Repar)","Rodovia do Xisto, BR 476, KM 16, Araucária - PR \nCEP: 83707-440","Paraná","ARAUCÁRIA - PR","Maceió-AL",{"$f":"#REF!","v":{"$error":"#REF!"}},{"$error":"#REF!"},{"$error":"#REF!"},{"$error":"#REF!"},2874,754.06099999999992,165.52,1675.0823455651887,1840.6023455651887,585.6,{"$f":"(ROUNDUP(((#REF!)*2/28),0)*Q23)/(#REF!)","v":{"$error":"#REF!"}},{"$error":"#REF!"},{"$error":"#REF!"}]
[9,null,"Refinaria Capuava (Recap)","Av. Alberto Soares Sampaio, 2122-A\nCapuava - Mauá - SP","São Paulo","MAUÁ - SP","Maceió-AL",{"$f":"#REF!","v":{"$error":"#REF!"}},{"$error":"#REF!"},{"$error":"#REF!"},{"$error":"#REF!"},2418,{"$f":"IF(L24=0,0,((26.939+0.253*L24)))","v":638.69299999999998},140.19999999999999,{"$f":"M24*1.1*($H$12/$H$11)","v":1418.8021506695973},{"$f":"N24+O24","v":1559.0021506695973},311.39999999999998,{"$f":"(ROUNDUP(((#REF!)*2/28),0)*Q24)/(#REF!)","v":{"$error":"#REF!"}},{"$f":"P24+R24","v":{"$error":"#REF!"}},{"$f":"S24+K24","v":{"$error":"#REF!"}}]
[10,null,"Refinaria Presidente Bernardes (RPBC)","Av. 9 de abril, 777 - Jardim das Indústrias - Cubatão - SP \nCEP: 11505-000","São Paulo","CUBATÃO - SP","Maceió-AL",{"$f":"#REF!","v":{"$error":"#REF!"}},{"$error":"#REF!"},{"$error":"#REF!"},{"$error":"#REF!"},2452,647.29499999999996,142.08000000000001,1437.9107616925141,1579.9907616925141,311.39999999999998,{"$f":"(ROUNDUP(((#REF!)*2/28),0)*Q25)/(#REF!)","v":{"$error":"#REF!"}},{"$error":"#REF!"},{"$error":"#REF!"}]
[11,null,"Refinaria de Paulínia (Replan)","Rodovia SP 332 - Km 130 Bonfim - Paulínia - SP \nCEP: 13140-000","São Paulo","PAULÍNIA - SP","Maceió-AL",{"$f":"#REF!","v":{"$error":"#REF!"}},{"$error":"#REF!"},{"$error":"#REF!"},{"$error":"#REF!"},2466,650.83699999999999,142.86000000000001,1445.779013290186,1588.6390132901861,528.6,{"$f":"(ROUNDUP(((#REF!)*2/28),0)*Q26)/(#REF!)","v":{"$error":"#REF!"}},{"$error":"#REF!"},{"$error":"#REF!"}]
[12,null,"Refinaria Henrique Lage (Revap)","Rodovia Presidente Dutra, KM 143, S/M, Bairro Jardim Diamante - São José dos Campos - SP\nCEP: 12223-900","São Paulo","SÃO JOSÉ DOS CAMPOS - SP","Maceió-AL",{"$f":"#REF!","v":{"$error":"#REF!"}},{"$error":"#REF!"},{"$error":"#REF!"},{"$error":"#REF!"},2306,610.35699999999997,133.97999999999999,1355.8561378882239,1489.8361378882239,399.6,{"$f":"(ROUNDUP(((#REF!)*2/28),0)*Q27)/(#REF!)","v":{"$error":"#REF!"}},{"$error":"#REF!"},{"$error":"#REF!"}]
[{"$nulls":19},{"$f":"SUBTOTAL(5,T16:T27)","v":{"$error":"#REF!"}}]

{"sheet":"EAI (2)","index":13,"n_rows":37,"n_cols":20,"rows_kept":37,"cut":false,"hidden":true,"merged":[[13,16,13,17],[15,1,35,1],[9,0,11,0],[9,3,9,5],[9,6,9,7],[9,9,11,9],[10,14,10,15],[13,1,14,1],[13,2,13,6],[7,0,7,19],[0,3,0,8],[1,3,1,8],[2,3,2,8],[3,3,3,8],[4,3,4,8]]}
[null,null,null,"Ministério do Desenvolvimento Regional - MDR"]
[null,null,null,"Companhia de Desenvolvimento dos Vales do São Francisco e do Parnaíba"]
[null,null,null,"5ª Superintendência Regional"]
[null,null,null,"Gerência Regional de Infraestrutura"]
[null,null,null,"Unidade Regional de Estudos e Projetos"]
[]
[]
["MEMÓRIA DE CÁLCULO"]
[]
["REAJUSTE",null,null,"TIPOLOGIA DO MATERIAL",null,null,"EAI",null,null,"IMPOSTOS","COFINS",6.4999999999999997E-3]
[{"$nulls":4},"INDÍCE","2014-07-01","ÍNDICE INICIAL",270.23700000000002,null,null,"PIS",0.03,null,null,"LEGENDA"]
[{"$nulls":4},{"$f":"H12/H11","v":{"$error":"#REF!"}},"2023-07-01","ÍNDICE FINAL",{"$f":"#REF!","v":{"$error":"#REF!"}},null,null,"ICMS",0.18,null,null,"ENTRADA DE DADOS"]
[]
["DATA-BASE","MATERIAL","LOCAL",{"$nulls":4},"CUSTO ANP (R$/Kg)","CUSTO ANP","IMPOSTOS DO PRODUTO","CUSTO DO PRODUTO COM IMPOSTOS","DMTs","CUSTO DO TRANSPORTE RODOVIA PAVIMENTADA","IMCS","ATUALIZAÇÃO DO CUSTO DE TRANSPORTE","CUSTO DO TRANSPORTE RODOVIA PAVIMENTADA COM IMPOSTO E ATUALIZAÇÃO MONETÁRIA","PEDÁGIO",null,"TOTAL TRANSPORTE","TOTAL GERAL (TRANSP. + AQUISIÇÃO)"]
["2022-07-01",null,"REFINARIAS","ENDEREÇO","ESTADO","CIDADE","DESTINO","ESTADO","R$/t","R$/t","R$/t","KM","R$/t","R$/t","R$/t","R$/t","CUSTO","R$/t","R$/t","R$/t"]
[1,"Emulsão Asfáltica para Imprimação - EAI","Refinaria Lubrificantes e Derivados do Nordeste (Lubnor)","Av. Leite Barbosa, s/nº - Mucuripe - Fortaleza - Ceará\nCEP: 60180-420","Ceará","Fortaleza - CE","Maceió-AL",{"$f":"#REF!","v":{"$error":"#REF!"}},{"$f":"IFERROR(H16*1000,\"-\")","v":"-"},{"$f":"IFERROR(K16-I16,\"-\")","v":"-"},{"$f":"IFERROR(TRUNC(I16*(1+(1/(1-$L$10-$L$11))*($L$10+$L$11+($L$12/(1-$L$12)))),2),\"-\")","v":"-"},957,{"$f":"IF(L16=0,0,((26.939+0.253*L16)))","v":269.06},{"$f":"TRUNC(M16*($L$12/(1-$L$12)),2)","v":59.06},{"$f":"M16*1.1*($H$12/$H$11)","v":{"$error":"#REF!"}},{"$f":"N16+O16","v":{"$error":"#REF!"}},0,{"$f":"(ROUNDUP(((#REF!)*2/28),0)*Q16)/(#REF!)","v":{"$error":"#REF!"}},{"$f":"P16+R16","v":{"$error":"#REF!"}},{"$f":"IFERROR(S16+K16,\"-\")","v":"-"}]
[2,null,"CENTRO OESTE ASFALTOS LTDA","Setor de Inflamáveis, S/N, Trecho 02 - Lote 1.100 - Guará - CEP: 71225-000","Distrito Federal","Brasília -DF","Maceió-AL",{"$f":"#REF!","v":{"$error":"#REF!"}},{"$f":"IFERROR(H17*1000,\"-\")","v":"-"},{"$f":"IFERROR(K17-I17,\"-\")","v":"-"},{"$f":"IFERROR(TRUNC(I17*(1+(1/(1-$L$10-$L$11))*($L$10+$L$11+($L$12/(1-$L$12)))),2),\"-\")","v":"-"},1803,{"$f":"IF(L17=0,0,((26.939+0.253*L17)))","v":483.09800000000001},{"$f":"TRUNC(M17*($L$12/(1-$L$12)),2)","v":106.04},{"$f":"M17*1.1*($H$12/$H$11)","v":{"$error":"#REF!"}},{"$f":"N17+O17","v":{"$error":"#REF!"}},null,{"$f":"(ROUNDUP(((#REF!)*2/28),0)*Q17)/(#REF!)","v":{"$error":"#REF!"}},{"$f":"P17+R17","v":{"$error":"#REF!"}},{"$f":"IFERROR(S17+K17,\"-\")","v":"-"}]
[3,null,"STRATURA ASFALTOS S/A","Av. Presidente Wilson, 08 - Junidaí - CEP: 75115-100","Goiás","Anápolis - GO","Maceió-AL",{"$f":"#REF!","v":{"$error":"#REF!"}},"-","-","-",1997,532.17999999999995,116.82,{"$error":"#REF!"},{"$error":"#REF!"},null,{"$f":"(ROUNDUP(((#REF!)*2/28),0)*Q18)/(#REF!)","v":{"$error":"#REF!"}},{"$error":"#REF!"},"-"]
[4,null,"DISTRIBUIDORA BRASILEIRA DE ASFALTO AS - DISBRAL","Via Primária Oito, S/N - Daiag, Aparecida de Goiânia - GO, 74993-430","Goiás","Aparecida de Goiânia -GO","Maceió-AL",{"$f":"#REF!","v":{"$error":"#REF!"}},"-","-","-",2015,536.73400000000004,117.81,{"$error":"#REF!"},{"$error":"#REF!"},null,{"$f":"(ROUNDUP(((#REF!)*2/28),0)*Q19)/(#REF!)","v":{"$error":"#REF!"}},{"$error":"#REF!"},"-"]
[5,null,"INDÚSTRIA NACIONAL DE ASFALTOS S/A","VIA PRIMEIRA E SEGUNDA 3, S/N.º LOTES 01 A 10 - DISTRITO AGROINDUSTRIAL - CEP: 75370-000","Goiás","Goianira - GO","Maceió-AL",{"$f":"#REF!","v":{"$error":"#REF!"}},"-","-","-",2021,538.25199999999995,118.15,{"$error":"#REF!"},{"$error":"#REF!"},null,{"$f":"(ROUNDUP(((#REF!)*2/28),0)*Q20)/(#REF!)","v":{"$error":"#REF!"}},{"$error":"#REF!"},"-"]
[6,null,"STRATURA ASFALTOS S/A","RUA VICTOR RODRIGUES RESENDE, 333 - DISTRITO IND. DE UBERLÂNDIA - CEP: 38405-440","Minas Gerais","Uberlândia - MG","Maceió-AL",{"$f":"#REF!","v":{"$error":"#REF!"}},"-","-","-",2063,548.87799999999993,120.48,{"$error":"#REF!"},{"$error":"#REF!"},177,{"$f":"(ROUNDUP(((#REF!)*2/28),0)*Q21)/(#REF!)","v":{"$error":"#REF!"}},{"$error":"#REF!"},"-"]
[7,null,"BETUNEL INDÚSTRIA E COMÉRCIO LTDA.","RUA VICTOR RODRIGUES DE REZENDE, 185 - DISTRITO INDUSTRIAL - CEP: 38402-334","Minas Gerais","Uberlândia - MG","Maceió-AL",{"$f":"#REF!","v":{"$error":"#REF!"}},"-","-","-",2062,548.625,120.42,{"$error":"#REF!"},{"$error":"#REF!"},177,{"$f":"(ROUNDUP(((#REF!)*2/28),0)*Q22)/(#REF!)","v":{"$error":"#REF!"}},{"$error":"#REF!"},"-"]
[8,null,"DISTRIBUIDORA BRASILEIRA DE ASFALTO AS - DISBRAL","R. São Judas Tadeu, 288 - Cachoeira, Sarzedo - MG, 32450-000","Minas Gerais","Sarzedo - MG","Maceió-AL",{"$f":"#REF!","v":{"$error":"#REF!"}},"-","-","-",1833,490.68800000000005,107.71,{"$error":"#REF!"},{"$error":"#REF!"},177,{"$f":"(ROUNDUP(((#REF!)*2/28),0)*Q23)/(#REF!)","v":{"$error":"#REF!"}},{"$error":"#REF!"},"-"]
[9,null,"NACIONAL DE ASFALTOS S/A","Nacional Asfaltos, Q. 1112 Sul Alameda 3, 16 - Plano Diretor Sul, Palmas - TO, 77024-166","Tocantins","Palmas - TO","Maceió-AL",{"$f":"#REF!","v":{"$error":"#REF!"}},"-","-","-",1792,480.315,105.43,{"$error":"#REF!"},{"$error":"#REF!"},null,{"$f":"(ROUNDUP(((#REF!)*2/28),0)*Q24)/(#REF!)","v":{"$error":"#REF!"}},{"$error":"#REF!"},"-"]
[10,null,"Usina de Asfalto Santa Edwiges Ltda"," Av. Jairo Pacheco, 185 - Loteamento Polo Empresarial Oeste, Campo Grande - MS, 79108-650","Mato Grosso do Sul","Campo Grande - MS","Maceió-AL",{"$f":"#REF!","v":{"$error":"#REF!"}},"-","-","-",2852,748.495,164.3,{"$error":"#REF!"},{"$error":"#REF!"},null,{"$f":"(ROUNDUP(((#REF!)*2/28),0)*Q25)/(#REF!)","v":{"$error":"#REF!"}},{"$error":"#REF!"},"-"]
[11,null,"ARAPETRO DISTRIBUIDORA DE PETRÓLEO LTDA.","RUA 04, S/Nº LOTES 17 A 20. - DISTRITO INDUSTRIAL 1/8 - CEP: 78600-000","Mato Grosso","Barra do Garcas - MT","Maceió-AL",{"$f":"#REF!","v":{"$error":"#REF!"}},"-",{"$f":"IFERROR(K26-I26,\"-\")","v":"-"},"-",3135,820.09399999999994,180.02,{"$error":"#REF!"},{"$error":"#REF!"},112.2,{"$f":"(ROUNDUP(((#REF!)*2/28),0)*Q26)/(#REF!)","v":{"$error":"#REF!"}},{"$error":"#REF!"},"-"]
[12,null,"CENTRO OESTE ASFALTOS LTDA","Rua N, S/Nº. LOTES 39/43 E LOTES 129/133 - DISTRITO INDUSTRIAL - CEP: 78098-400 ","Mato Grosso","Cuiabá - MT","Maceió-AL",{"$f":"#REF!","v":{"$error":"#REF!"}},"-","-","-",2950,773.28899999999999,169.74,{"$error":"#REF!"},{"$error":"#REF!"},254.4,{"$f":"(ROUNDUP(((#REF!)*2/28),0)*Q27)/(#REF!)","v":{"$error":"#REF!"}},{"$error":"#REF!"},"-"]
[13,null,"BETUNEL INDÚSTRIA E COMÉRCIO LTDA.","RUA N ESQUINA COM RUA X, S/N QD. ND. 7 L 01/08 - DIST. IND. - CEP: 78015-285","Mato Grosso","Cuiabá - MT","Maceió-AL",{"$f":"#REF!","v":{"$error":"#REF!"}},"-","-","-",2948,772.78300000000002,169.63,{"$error":"#REF!"},{"$error":"#REF!"},254.4,{"$f":"(ROUNDUP(((#REF!)*2/28),0)*Q28)/(#REF!)","v":{"$error":"#REF!"}},{"$error":"#REF!"},"-"]
[14,null,"EMAM - EMULSÕES E TRANSPORTES LTDA.","RODOVIA DOS IMIGRANTES, S/Nº - KM 8,6 - CAPELA DO PISSARRÃO, Várzea Grande - MT, 78132-400","Mato Grosso","Varzea Grande - MT","Maceió-AL",{"$f":"#REF!","v":{"$error":"#REF!"}},"-","-","-",2969,778.096,170.8,{"$error":"#REF!"},{"$error":"#REF!"},254.4,{"$f":"(ROUNDUP(((#REF!)*2/28),0)*Q29)/(#REF!)","v":{"$error":"#REF!"}},{"$error":"#REF!"},"-"]
[15,null,"NTA - NOVAS TÉCNICAS DE ASFALTOS S/A","R. Sofía A Fadim, 150 - Santa Terezinha, Paulínia - SP, 13140-000","São Paulo","Paulínia - SP","Maceió-AL",{"$f":"#REF!","v":{"$error":"#REF!"}},"-","-","-",2475,653.11399999999992,143.36000000000001,{"$error":"#REF!"},{"$error":"#REF!"},436.8,{"$f":"(ROUNDUP(((#REF!)*2/28),0)*Q30)/(#REF!)","v":{"$error":"#REF!"}},{"$error":"#REF!"},"-"]
[16,null,"COMPANHIA BRASILEIRA DE ASFALTOS DA AMAZÔNIA - IMPORTAÇÃO E EXPORTAÇÃO","Avenida Doutor Olindo Dártora 2451, Galpão 02, Morro Grande - CEP: 07726-555","São Paulo","Caieiras - SP","Maceió-AL",{"$f":"#REF!","v":{"$error":"#REF!"}},"-","-","-",2421,639.452,140.36000000000001,{"$error":"#REF!"},{"$error":"#REF!"},294.60000000000002,{"$f":"(ROUNDUP(((#REF!)*2/28),0)*Q31)/(#REF!)","v":{"$error":"#REF!"}},{"$error":"#REF!"},"-"]
[17,null,"VIAPOL LTDA","Rod. Vito Ardito, 6401 - Km 118,5 - Jardim Campo Grande, Caçapava - SP, 12282-535","São Paulo","Caçapava - SP","Maceió-AL",{"$f":"#REF!","v":{"$error":"#REF!"}},"-","-","-",2285,605.04399999999998,132.81,{"$error":"#REF!"},{"$error":"#REF!"},399.6,{"$f":"(ROUNDUP(((#REF!)*2/28),0)*Q32)/(#REF!)","v":{"$error":"#REF!"}},{"$error":"#REF!"},"-"]
[18,null,"STRATURA ASFALTOS S/A","R. Luís de Camões - Campos Elyseos, Duque de Caxias - RJ, 25225-035","Rio de Janeiro","Duque de Caxias - RJ","Maceió-AL",{"$f":"#REF!","v":{"$error":"#REF!"}},"-","-","-",1957,522.05999999999995,114.59,{"$error":"#REF!"},{"$error":"#REF!"},null,{"$f":"(ROUNDUP(((#REF!)*2/28),0)*Q33)/(#REF!)","v":{"$error":"#REF!"}},{"$error":"#REF!"},"-"]
[19,null,"PROBITEC - PRODUTOS BETUMINOSOS E TECNOLOGIA DE APLICAÇÃO LTDA.","Av. Canal da Pavuna, 620 - Pavuna, Rio de Janeiro - RJ, 21535-630","Rio de Janeiro","Rio de Janeiro - RJ","Maceió-AL",{"$f":"#REF!","v":{"$error":"#REF!"}},"-","-","-",1974,526.36099999999999,115.54,{"$error":"#REF!"},{"$error":"#REF!"},null,{"$f":"(ROUNDUP(((#REF!)*2/28),0)*Q34)/(#REF!)","v":{"$error":"#REF!"}},{"$error":"#REF!"},"-"]
[20,null,"CASA DO ASFALTO DISTRIBUIDORA, INDÚSTRIA E COMÉRCIO DE ASFALTO LTDA","BR-376 Lote 6/7/7 A-3-1 Gleba Patrimônio - Marialva, PR, 86990-000","Paraná","Marialva - PR","Maceió-AL",{"$f":"#REF!","v":{"$error":"#REF!"}},"-","-","-",2828,742.423,162.97,{"$error":"#REF!"},{"$error":"#REF!"},889.8,{"$f":"(ROUNDUP(((#REF!)*2/28),0)*Q35)/(#REF!)","v":{"$error":"#REF!"}},{"$error":"#REF!"},"-"]
[21,null,"PETROBRAS DISTRIBUIDORA S.A.","R. Maquinista Eleodoro Jacinto, 100 - Oficinas, Ponta Grossa - PR, 84045-170","Paraná","Ponta Grossa - PR","Maceió-AL",{"$f":"#REF!","v":{"$error":"#REF!"}},"-","-","-",2943,771.51800000000003,169.35,{"$error":"#REF!"},{"$error":"#REF!"},747.6,{"$f":"(ROUNDUP(((#REF!)*2/28),0)*Q36)/(#REF!)","v":{"$error":"#REF!"}},{"$error":"#REF!"},"-"]
[{"$nulls":19},{"$f":"SUBTOTAL(5,T16:T36)","v":0}]

{"sheet":"RR-1C (2)","index":14,"n_rows":37,"n_cols":20,"rows_kept":37,"cut":false,"hidden":true,"merged":[[13,16,13,17],[15,1,35,1],[9,0,11,0],[9,3,9,5],[9,6,9,7],[9,9,11,9],[10,14,10,15],[13,1,14,1],[13,2,13,6],[7,0,7,19],[0,3,0,8],[1,3,1,8],[2,3,2,8],[3,3,3,8],[4,3,4,8]]}
[null,null,null,"Ministério do Desenvolvimento Regional - MDR"]
[null,null,null,"Companhia de Desenvolvimento dos Vales do São Francisco e do Parnaíba"]
[null,null,null,"5ª Superintendência Regional"]
[null,null,null,"Gerência Regional de Infraestrutura"]
[null,null,null,"Unidade Regional de Estudos e Projetos"]
[]
[]
["MEMÓRIA DE CÁLCULO"]
[]
["REAJUSTE",null,null,"TIPOLOGIA DO MATERIAL",null,null,"RR-1C",null,null,"IMPOSTOS","COFINS",6.4999999999999997E-3]
[{"$nulls":4},"INDÍCE","2014-07-01","ÍNDICE INICIAL",270.23700000000002,null,null,"PIS",0.03,null,null,"LEGENDA"]
[{"$nulls":4},{"$f":"H12/H11","v":{"$error":"#REF!"}},"2023-07-01","ÍNDICE FINAL",{"$f":"EAI!H12","v":{"$error":"#REF!"}},null,null,"ICMS",0.18,null,null,"ENTRADA DE DADOS"]
[]
["DATA-BASE","MATERIAL","LOCAL",{"$nulls":4},"CUSTO ANP (R$/Kg)","CUSTO ANP","IMPOSTOS DO PRODUTO","CUSTO DO PRODUTO COM IMPOSTOS","DMTs","CUSTO DO TRANSPORTE RODOVIA PAVIMENTADA","IMCS","ATUALIZAÇÃO DO CUSTO DE TRANSPORTE","CUSTO DO TRANSPORTE RODOVIA PAVIMENTADA COM IMPOSTO E ATUALIZAÇÃO MONETÁRIA","PEDÁGIO",null,"TOTAL TRANSPORTE","TOTAL GERAL (TRANSP. + AQUISIÇÃO)"]
["2022-01-01",null,"REFINARIAS","ENDEREÇO","ESTADO","CIDADE","DESTINO","ESTADO","R$/t","R$/t","R$/t","KM","R$/t","R$/t","R$/t","R$/t","CUSTO","R$/t","R$/t","R$/t"]
[1,"RR-1C","Refinaria Lubrificantes e Derivados do Nordeste (Lubnor)","Av. Leite Barbosa, s/nº - Mucuripe - Fortaleza - Ceará\nCEP: 60180-420","Ceará","Fortaleza - CE","Maceió - AL",{"$f":"#REF!","v":{"$error":"#REF!"}},{"$f":"IFERROR(H16*1000,\"-\")","v":"-"},{"$f":"IFERROR(K16-I16,\"-\")","v":"-"},{"$f":"IFERROR(TRUNC(I16*(1+(1/(1-$L$10-$L$11))*($L$10+$L$11+($L$12/(1-$L$12)))),2),\"-\")","v":"-"},957,{"$f":"IF(L16=0,0,((26.939+0.253*L16)))","v":269.06},{"$f":"TRUNC(M16*($L$12/(1-$L$12)),2)","v":59.06},{"$f":"M16*1.1*($H$12/$H$11)","v":{"$error":"#REF!"}},{"$f":"N16+O16","v":{"$error":"#REF!"}},0,{"$f":"(ROUNDUP(((#REF!)*2/28),0)*Q16)/(#REF!)","v":{"$error":"#REF!"}},{"$f":"P16+R16","v":{"$error":"#REF!"}},{"$f":"IFERROR(S16+K16,\"-\")","v":"-"}]
[2,null,"CENTRO OESTE ASFALTOS LTDA","Setor de Inflamáveis, S/N, Trecho 02 - Lote 1.100 - Guará - CEP: 71225-000","Distrito Federal","Brasília -DF","Maceió - AL",{"$f":"#REF!","v":{"$error":"#REF!"}},{"$f":"IFERROR(H17*1000,\"-\")","v":"-"},{"$f":"IFERROR(K17-I17,\"-\")","v":"-"},{"$f":"IFERROR(TRUNC(I17*(1+(1/(1-$L$10-$L$11))*($L$10+$L$11+($L$12/(1-$L$12)))),2),\"-\")","v":"-"},1803,{"$f":"IF(L17=0,0,((26.939+0.253*L17)))","v":483.09800000000001},{"$f":"TRUNC(M17*($L$12/(1-$L$12)),2)","v":106.04},{"$f":"M17*1.1*($H$12/$H$11)","v":{"$error":"#REF!"}},{"$f":"N17+O17","v":{"$error":"#REF!"}},null,{"$f":"(ROUNDUP(((#REF!)*2/28),0)*Q17)/(#REF!)","v":{"$error":"#REF!"}},{"$f":"P17+R17","v":{"$error":"#REF!"}},{"$f":"IFERROR(S17+K17,\"-\")","v":"-"}]
[3,null,"STRATURA ASFALTOS S/A","Av. Presidente Wilson, 08 - Junidaí - CEP: 75115-100","Goiás","Anápolis - GO","Maceió - AL",{"$f":"#REF!","v":{"$error":"#REF!"}},"-","-","-",2041,543.31200000000001,119.26,{"$error":"#REF!"},{"$error":"#REF!"},112.2,{"$f":"(ROUNDUP(((#REF!)*2/28),0)*Q18)/(#REF!)","v":{"$error":"#REF!"}},{"$error":"#REF!"},"-"]
[4,null,"DISTRIBUIDORA BRASILEIRA DE ASFALTO AS - DISBRAL","Via Primária Oito, S/N - Daiag, Aparecida de Goiânia - GO, 74993-430","Goiás","Aparecida de Goiânia -GO","Maceió - AL",{"$f":"#REF!","v":{"$error":"#REF!"}},"-","-","-",2109,560.51599999999996,123.04,{"$error":"#REF!"},{"$error":"#REF!"},142.80000000000001,{"$f":"(ROUNDUP(((#REF!)*2/28),0)*Q19)/(#REF!)","v":{"$error":"#REF!"}},{"$error":"#REF!"},"-"]
[5,null,"INDÚSTRIA NACIONAL DE ASFALTOS S/A","VIA PRIMEIRA E SEGUNDA 3, S/N.º LOTES 01 A 10 - DISTRITO AGROINDUSTRIAL - CEP: 75370-000","Goiás","Goianira - GO","Maceió - AL",{"$f":"#REF!","v":{"$error":"#REF!"}},"-","-","-",2098,557.73299999999995,122.42,{"$error":"#REF!"},{"$error":"#REF!"},112.2,{"$f":"(ROUNDUP(((#REF!)*2/28),0)*Q20)/(#REF!)","v":{"$error":"#REF!"}},{"$error":"#REF!"},"-"]
[6,null,"STRATURA ASFALTOS S/A","RUA VICTOR RODRIGUES RESENDE, 333 - DISTRITO IND. DE UBERLÂNDIA - CEP: 38405-440","Minas Gerais","Uberlândia - MG","Maceió - AL",{"$f":"#REF!","v":{"$error":"#REF!"}},"-","-","-",1791,480.06200000000001,105.37,{"$error":"#REF!"},{"$error":"#REF!"},177,{"$f":"(ROUNDUP(((#REF!)*2/28),0)*Q21)/(#REF!)","v":{"$error":"#REF!"}},{"$error":"#REF!"},"-"]
[7,null,"BETUNEL INDÚSTRIA E COMÉRCIO LTDA.","RUA VICTOR RODRIGUES DE REZENDE, 185 - DISTRITO INDUSTRIAL - CEP: 38402-334","Minas Gerais","Uberlândia - MG","Maceió - AL",{"$f":"#REF!","v":{"$error":"#REF!"}},"-","-","-",2062,548.625,120.42,{"$error":"#REF!"},{"$error":"#REF!"},177,{"$f":"(ROUNDUP(((#REF!)*2/28),0)*Q22)/(#REF!)","v":{"$error":"#REF!"}},{"$error":"#REF!"},"-"]
[8,null,"DISTRIBUIDORA BRASILEIRA DE ASFALTO AS - DISBRAL","R. São Judas Tadeu, 288 - Cachoeira, Sarzedo - MG, 32450-000","Minas Gerais","Sarzedo - MG","Maceió - AL",{"$f":"#REF!","v":{"$error":"#REF!"}},"-","-","-",1833,490.68800000000005,107.71,{"$error":"#REF!"},{"$error":"#REF!"},177,{"$f":"(ROUNDUP(((#REF!)*2/28),0)*Q23)/(#REF!)","v":{"$error":"#REF!"}},{"$error":"#REF!"},"-"]
[9,null,"NACIONAL DE ASFALTOS S/A","Nacional Asfaltos, Q. 1112 Sul Alameda 3, 16 - Plano Diretor Sul, Palmas - TO, 77024-166","Tocantins","Palmas - TO","Maceió - AL",{"$f":"#REF!","v":{"$error":"#REF!"}},"-","-","-",1792,480.315,105.43,{"$error":"#REF!"},{"$error":"#REF!"},null,{"$f":"(ROUNDUP(((#REF!)*2/28),0)*Q24)/(#REF!)","v":{"$error":"#REF!"}},{"$error":"#REF!"},"-"]
[10,null,"Usina de Asfalto Santa Edwiges Ltda"," Av. Jairo Pacheco, 185 - Loteamento Polo Empresarial Oeste, Campo Grande - MS, 79108-650","Mato Grosso do Sul","Campo Grande - MS","Maceió - AL",{"$f":"#REF!","v":{"$error":"#REF!"}},"-","-","-",2852,748.495,164.3,{"$error":"#REF!"},{"$error":"#REF!"},null,{"$f":"(ROUNDUP(((#REF!)*2/28),0)*Q25)/(#REF!)","v":{"$error":"#REF!"}},{"$error":"#REF!"},"-"]
[11,null,"ARAPETRO DISTRIBUIDORA DE PETRÓLEO LTDA.","RUA 04, S/Nº LOTES 17 A 20. - DISTRITO INDUSTRIAL 1/8 - CEP: 78600-000","Mato Grosso","Barra do Garcas - MT","Maceió - AL",{"$f":"#REF!","v":{"$error":"#REF!"}},"-",{"$f":"IFERROR(K26-I26,\"-\")","v":"-"},"-",2558,674.11299999999994,147.97,{"$error":"#REF!"},{"$error":"#REF!"},112.2,{"$f":"(ROUNDUP(((#REF!)*2/28),0)*Q26)/(#REF!)","v":{"$error":"#REF!"}},{"$error":"#REF!"},"-"]
[12,null,"CENTRO OESTE ASFALTOS LTDA","Rua N, S/Nº. LOTES 39/43 E LOTES 129/133 - DISTRITO INDUSTRIAL - CEP: 78098-400 ","Mato Grosso","Cuiabá - MT","Maceió - AL",{"$f":"#REF!","v":{"$error":"#REF!"}},"-","-","-",2950,773.28899999999999,169.74,{"$error":"#REF!"},{"$error":"#REF!"},254.4,{"$f":"(ROUNDUP(((#REF!)*2/28),0)*Q27)/(#REF!)","v":{"$error":"#REF!"}},{"$error":"#REF!"},"-"]
[13,null,"BETUNEL INDÚSTRIA E COMÉRCIO LTDA.","RUA N ESQUINA COM RUA X, S/N QD. ND. 7 L 01/08 - DIST. IND. - CEP: 78015-285","Mato Grosso","Cuiabá - MT","Maceió - AL",{"$f":"#REF!","v":{"$error":"#REF!"}},"-","-","-",2948,772.78300000000002,169.63,{"$error":"#REF!"},{"$error":"#REF!"},254.4,{"$f":"(ROUNDUP(((#REF!)*2/28),0)*Q28)/(#REF!)","v":{"$error":"#REF!"}},{"$error":"#REF!"},"-"]
[14,null,"EMAM - EMULSÕES E TRANSPORTES LTDA.","RODOVIA DOS IMIGRANTES, S/Nº - KM 8,6 - CAPELA DO PISSARRÃO, Várzea Grande - MT, 78132-400","Mato Grosso","Varzea Grande - MT","Maceió - AL",{"$f":"#REF!","v":{"$error":"#REF!"}},"-","-","-",2969,778.096,170.8,{"$error":"#REF!"},{"$error":"#REF!"},254.4,{"$f":"(ROUNDUP(((#REF!)*2/28),0)*Q29)/(#REF!)","v":{"$error":"#REF!"}},{"$error":"#REF!"},"-"]
[15,null,"NTA - NOVAS TÉCNICAS DE ASFALTOS S/A","R. Sofía A Fadim, 150 - Santa Terezinha, Paulínia - SP, 13140-000","São Paulo","Paulínia - SP","Maceió - AL",{"$f":"#REF!","v":{"$error":"#REF!"}},"-","-","-",2475,653.11399999999992,143.36000000000001,{"$error":"#REF!"},{"$error":"#REF!"},436.8,{"$f":"(ROUNDUP(((#REF!)*2/28),0)*Q30)/(#REF!)","v":{"$error":"#REF!"}},{"$error":"#REF!"},"-"]
[16,null,"COMPANHIA BRASILEIRA DE ASFALTOS DA AMAZÔNIA - IMPORTAÇÃO E EXPORTAÇÃO","Avenida Doutor Olindo Dártora 2451, Galpão 02, Morro Grande - CEP: 07726-555","São Paulo","Caieiras - SP","Maceió - AL",{"$f":"#REF!","v":{"$error":"#REF!"}},"-","-","-",2421,639.452,140.36000000000001,{"$error":"#REF!"},{"$error":"#REF!"},294.60000000000002,{"$f":"(ROUNDUP(((#REF!)*2/28),0)*Q31)/(#REF!)","v":{"$error":"#REF!"}},{"$error":"#REF!"},"-"]
[17,null,"VIAPOL LTDA.","Rod. Vito Ardito, 6401 - Km 118,5 - Jardim Campo Grande, Caçapava - SP, 12282-535","São Paulo","Caçapava - SP","Maceió - AL",{"$f":"#REF!","v":{"$error":"#REF!"}},"-","-","-",2285,605.04399999999998,132.81,{"$error":"#REF!"},{"$error":"#REF!"},399.6,{"$f":"(ROUNDUP(((#REF!)*2/28),0)*Q32)/(#REF!)","v":{"$error":"#REF!"}},{"$error":"#REF!"},"-"]
[18,null,"STRATURA ASFALTOS S/A","R. Luís de Camões - Campos Elyseos, Duque de Caxias - RJ, 25225-035","Rio de Janeiro","Duque de Caxias - RJ","Maceió - AL",{"$f":"#REF!","v":{"$error":"#REF!"}},"-","-","-",1957,522.05999999999995,114.59,{"$error":"#REF!"},{"$error":"#REF!"},null,{"$f":"(ROUNDUP(((#REF!)*2/28),0)*Q33)/(#REF!)","v":{"$error":"#REF!"}},{"$error":"#REF!"},"-"]
[19,null,"PROBITEC - PRODUTOS BETUMINOSOS E TECNOLOGIA DE APLICAÇÃO LTDA.","Av. Canal da Pavuna, 620 - Pavuna, Rio de Janeiro - RJ, 21535-630","Rio de Janeiro","Rio de Janeiro - RJ","Maceió - AL",{"$f":"#REF!","v":{"$error":"#REF!"}},"-","-","-",1974,526.36099999999999,115.54,{"$error":"#REF!"},{"$error":"#REF!"},null,{"$f":"(ROUNDUP(((#REF!)*2/28),0)*Q34)/(#REF!)","v":{"$error":"#REF!"}},{"$error":"#REF!"},"-"]
[20,null,"CASA DO ASFALTO DISTRIBUIDORA, INDÚSTRIA E COMÉRCIO DE ASFALTO LTDA","BR-376 Lote 6/7/7 A-3-1 Gleba Patrimônio - Marialva, PR, 86990-000","Paraná","Marialva - PR","Maceió - AL",{"$f":"#REF!","v":{"$error":"#REF!"}},"-","-","-",2828,742.423,162.97,{"$error":"#REF!"},{"$error":"#REF!"},889.8,{"$f":"(ROUNDUP(((#REF!)*2/28),0)*Q35)/(#REF!)","v":{"$error":"#REF!"}},{"$error":"#REF!"},"-"]
[21,null,"PETROBRAS DISTRIBUIDORA S.A.","R. Maquinista Eleodoro Jacinto, 100 - Oficinas, Ponta Grossa - PR, 84045-170","Paraná","Ponta Grossa - PR","Maceió - AL",{"$f":"#REF!","v":{"$error":"#REF!"}},"-","-","-",2943,771.51800000000003,169.35,{"$error":"#REF!"},{"$error":"#REF!"},747.6,{"$f":"(ROUNDUP(((#REF!)*2/28),0)*Q36)/(#REF!)","v":{"$error":"#REF!"}},{"$error":"#REF!"},"-"]
[{"$nulls":19},{"$f":"SUBTOTAL(5,T16:T36)","v":0}]

{"sheet":"Comparação ARAPIRACA-MACEIO","index":15,"n_rows":18,"n_cols":10,"rows_kept":18,"cut":false,"hidden":true,"merged":[[0,0,0,9],[9,0,9,9]]}
["ARAPIRACA"]
[4,null,null,"AQUISIÇÃO E TRANSPORTE DE MATERIAL BETUMINOSO",{"$nulls":5},{"$f":"SUM(J3:J8)","v":10500379.469999999}]
["4.1","Codevasf","CPU-08","Aquisição de Cimento Asfáltico 50/70 (BDI=15%)","t",1622.34,0.15,4439.1499999999996,5105.0200000000004,8282078.1399999997]
["4.2","Codevasf","CPU-09","Aquisição de Emulsão Asfáltica para imprimação - EAI (BDI=15%)","t",277.95999999999998,0.15,2859.76,3288.72,914132.61]
["4.3","Codevasf","CPU-10","Aquisição de Emulsão Asfáltica RR-1C (BDI=15%)","t",96.22,0.15,3085.62,3548.46,341432.82]
["4.4","Codevasf","CPU-11","Transporte de Cimento Asfáltico 50/70 (BDI=15%)","t",1622.34,0.15,366.13,421.04,683070.03]
["4.5","Codevasf","CPU-12","Transporte de Emulsão Asfáltica para imprimação - EAI (BDI = 15%)","t",277.95999999999998,0.15,649.92999999999995,747.41,207750.08]
["4.6","Codevasf","CPU-13","Transporte de Emulsão Asfáltica RR-1C (BDI=15%)","t",96.22,0.15,649.92999999999995,747.41,71915.789999999994]
[]
["MACEIÓ"]
[4,null,null,"AQUISIÇÃO E TRANSPORTE DE MATERIAL BETUMINOSO",{"$nulls":5},10589722.6]
["4.1","Codevasf","CPU-08","Aquisição de Cimento Asfáltico 50/70 (BDI=15%)","t",1622.34,0.15,4439.1499999999996,5105.0200000000004,8282078.1399999997]
["4.2","Codevasf","CPU-09","Aquisição de Emulsão Asfáltica para imprimação - EAI (BDI=15%)","t",277.95999999999998,0.15,2859.76,3288.72,914132.61]
["4.3","Codevasf","CPU-10","Aquisição de Emulsão Asfáltica RR-1C (BDI=15%)","t",96.22,0.15,3085.62,3548.46,341432.82]
["4.4","Codevasf","CPU-11","Transporte de Cimento Asfáltico 50/70 (BDI=15%)","t",1622.34,0.15,412.44,474.3,769475.86]
["4.5","Codevasf","CPU-12","Transporte de Emulsão Asfáltica para imprimação - EAI (BDI = 15%)","t",277.95999999999998,0.15,656.75,755.26,209932.06]
["4.6","Codevasf","CPU-13","Transporte de Emulsão Asfáltica RR-1C (BDI=15%)","t",96.22,0.15,656.75,755.26,72671.11]
[{"$nulls":9},{"$f":"J11-J2","v":89343.13000000082}]

{"sheet":"Encargos SD","index":16,"n_rows":151,"n_cols":30,"rows_kept":151,"cut":false,"hidden":true,"merged":[[148,3,148,9],[149,1,150,1],[149,3,149,9],[150,3,150,9],[139,3,139,9],[140,3,140,9],[141,3,141,9],[142,3,142,9],[143,3,143,9],[144,1,148,1],[144,3,144,9],[145,3,145,9],[146,3,146,9],[147,3,147,9],[134,1,143,1],[134,3,134,9],[135,3,135,9],[136,3,136,9],[137,3,137,9],[138,3,138,9],[6,27,6,28],[6,29,7,29],[124,3,124,9],[124,13,130,28],[125,1,133,1],[125,3,125,9],[126,3,126,9],[127,3,127,9],[128,3,128,9],[129,3,129,9],[6,22,6,26],[130,3,130,9],[131,3,131,9],[132,3,132,9],[133,3,133,9],[6,0,7,0],[6,1,7,1],[6,2,7,2],[6,3,6,11],[6,12,6,21],[4,0,4,29],[0,0,1,0],[0,1,1,28],[0,29,1,29],[2,0,2,29],[3,0,3,29]]}
["CGCIT","SISTEMA DE CUSTOS REFERENCIAIS DE OBRAS - SICRO",{"$nulls":27},"DNIT"]
[]
[]
["Alagoas - Abril/2023"]
["Sem desoneração"]
[]
["Código","Descrição","Unid.","Encargos Sociais (%)",{"$nulls":8},"Encargos Trabalhistas (%)",{"$nulls":9},"Verbas Rescisórias (%)",{"$nulls":4},"Reincidências (%)",null,"Total (%)"]
[null,null,null,"A1","A2","A3","A4","A5","A6","A7","A8","A9","B1","B2","B3","B4","B5","B6","B7","B8","B9","B10","C1","C2","C3","C4","C5","D1","D2"]
["P9801","Ajudante","h",0.2,0.08,2.5000000000000001E-2,1.4999999999999999E-2,1.6E-2,2E-3,0.03,0,0,0.18599407413254601,5.14768459931964E-2,6.2992281890531798E-2,9.1512597665585702E-3,4.6041504131892798E-4,1.13428029830319E-3,9.2414790964694404E-2,7.4273153222795098E-3,1.41233518498324E-5,0,4.3990275980440197E-2,1.1108706044734599E-3,6.0227439395727403E-2,4.5154092376360901E-2,9.2841441528493801E-3,0.15127206232815099,3.92802246088145E-3,1.0940000000000001]
["P9802","Ajudante especializado","h",0.2,0.08,2.5000000000000001E-2,1.4999999999999999E-2,1.6E-2,2E-3,0.03,0,0,0.18599407413254601,5.14768459931964E-2,6.2992281890531798E-2,9.1512597665585702E-3,4.6041504131892798E-4,1.13428029830319E-3,9.2414790964694404E-2,7.4273153222795098E-3,1.41233518498324E-5,0,4.3990275980440197E-2,1.1108706044734599E-3,6.0227439395727403E-2,4.5154092376360901E-2,9.2841441528493801E-3,0.15127206232815099,3.92802246088145E-3,1.0940000000000001]
["P9803","Almoxarife","mês",0.2,0.08,2.5000000000000001E-2,1.4999999999999999E-2,1.6E-2,2E-3,0.03,1.11111111111111E-3,0,0,0,7.4777962322740504E-2,8.7416018348610396E-3,4.6021064012617902E-4,9.3578951605325701E-4,9.2373763431261399E-2,7.4240179666882501E-3,1.73456897961502E-4,0,3.5357726379298002E-2,8.9287593679208499E-4,4.8387055585607998E-2,3.7916377683510097E-2,9.2800224583603104E-3,6.8243773141044101E-2,3.15818853945754E-3,0.75719999999999998]
["P9804","Apontador","mês",0.2,0.08,2.5000000000000001E-2,1.4999999999999999E-2,1.6E-2,2E-3,0.03,0,0,0,0,7.8640334809774906E-2,9.1513675368646401E-3,4.6042046342158801E-4,1.0027034037531799E-3,9.2415879292483405E-2,7.4274027904604996E-3,1.5720693648121499E-4,0,3.2561574479424399E-2,8.2226571937509896E-4,4.4580837580202898E-2,3.8056170087463703E-2,9.2842534880756208E-3,6.9645956005832094E-2,2.9075197430839901E-3,0.75509999999999999]
["P9805","Armador","h",0.2,0.08,2.5000000000000001E-2,1.4999999999999999E-2,1.6E-2,2E-3,0.03,1.11111111111111E-3,0,0.18508349705450999,5.12214632207268E-2,5.67613698068241E-2,8.7402839760638597E-3,4.6014126009124901E-4,9.5091354464079498E-4,9.2359837427873598E-2,7.4228987430525004E-3,7.7185963318835905E-6,0,4.4473625608209298E-2,1.22517431851162E-3,6.6385080097007304E-2,4.4896259956163698E-2,9.2786234288156199E-3,0.14875477629991599,4.0101155026673703E-3,1.0911]
["P9806","Auxiliar administrativo","mês",0.2,0.08,2.5000000000000001E-2,1.4999999999999999E-2,1.6E-2,2E-3,0.03,0,0,0,0,6.8100723897950896E-2,9.1591321678983692E-3,4.6081111487389202E-4,6.5573773774054605E-4,9.2494291092847902E-2,7.4337046947359504E-3,1.35216409609102E-3,0,4.0301809886868503E-2,1.01772709792288E-3,5.52249975591797E-2,3.7749010073668397E-2,9.2921308684199393E-3,6.6113615847187002E-2,3.5986683629851001E-3,0.76100000000000001]
["P9807","Bombeiro hidráulico","h",0.2,0.08,2.5000000000000001E-2,1.4999999999999999E-2,1.6E-2,2E-3,0.03,1.11111111111111E-3,0,0.18706780781879201,5.1778977831291297E-2,7.2081143408337697E-2,8.7405559992157593E-3,4.60155581030504E-4,9.7417162267307404E-4,9.2362711935630407E-2,7.4231297653302502E-3,1.55975554197209E-5,0,3.7322062355058999E-2,9.42480606100203E-4,5.10691391725029E-2,4.5468936048567103E-2,9.2789122066628104E-3,0.15536043594909699,3.3336450521230399E-3,1.0928]
["P9808","Carpinteiro","h",0.2,0.08,2.5000000000000001E-2,1.4999999999999999E-2,1.6E-2,2E-3,0.03,0,0,0.18670515857421199,5.1676804511364097E-2,6.8783549804080996E-2,9.1493588617180006E-3,4.60319403646843E-4,9.1720027145496795E-4,9.2395594512187706E-2,7.4257725161513098E-3,2.3233679086813999E-5,0,3.9749881081580903E-2,1.00378943847676E-3,5.4410576212169298E-2,4.5361183748284899E-2,9.2822156451891295E-3,0.153653613105276,3.5493849998859202E-3,1.0925]
["P9809","Encarregado administrativo","mês",0.2,0.08,2.5000000000000001E-2,1.4999999999999999E-2,1.6E-2,2E-3,0.03,1.11111111111111E-3,0,0,0,8.2334418162499895E-2,8.7421228091724996E-3,4.60238067355867E-4,7.1860718486364101E-4,9.2379268641714696E-2,7.4244604167930999E-3,4.4998020075693402E-4,0,3.2326239516101703E-2,7.5352882177673601E-4,4.0837940026453003E-2,3.8160291055461003E-2,9.2805755209913708E-3,7.1057246132782997E-2,2.8642350219483998E-3,0.75690000000000002]
["P9810","Eletricista","h",0.2,0.08,2.5000000000000001E-2,1.4999999999999999E-2,1.6E-2,2E-3,0.03,0,0,0.18753838428356201,5.1910833084230397E-2,7.5083338684816203E-2,9.1503628820826903E-3,4.60369917574924E-4,1.05031648607477E-3,9.24057336989767E-2,7.4265873958540797E-3,0,0,3.5153561815383101E-2,8.8772024255118101E-4,4.81243062471527E-2,4.5600829645861499E-2,9.2832342448175998E-3,0.156409540927407,3.13896599448948E-3,1.0915999999999999]
["P9811","Encarregado especializado","mês",0.2,0.08,2.5000000000000001E-2,1.4999999999999999E-2,1.6E-2,2E-3,0.03,0,0,0,0,7.7577230883724896E-2,9.1481448883423203E-3,4.6025832663491401E-4,7.8545170345927797E-4,9.2383335096696106E-2,7.4247872350770103E-3,2.2181259129643599E-5,0,3.3318098668222898E-2,8.4136995239430102E-4,4.5600549245203299E-2,3.8009644460578099E-2,9.2809840438462608E-3,6.9110911296647606E-2,2.9750720359389398E-3,0.75490000000000002]
["P9812","Engenheiro","mês",0.2,0.08,2.5000000000000001E-2,1.4999999999999999E-2,1.6E-2,2E-3,0.03,1.11111111111111E-3,0,0,0,8.4231003895897605E-2,8.7419842513498207E-3,4.6023077283645602E-4,7.5393007086905497E-4,9.2377804481280995E-2,7.4243427431922599E-3,3.9883469716391198E-4,0,3.0823895339647099E-2,7.1850898482282396E-4,3.8939402079143801E-2,3.8220420189202901E-2,9.2804284289903297E-3,7.1750818987958306E-2,2.73112127690304E-3,0.75600000000000001]
["P9814","Operacional","mês",0.2,0.08,2.5000000000000001E-2,1.4999999999999999E-2,1.6E-2,2E-3,0.03,4.1481481481481499E-3,0,0,0,5.6595874335608802E-2,7.8130313761299395E-3,3.9655965524721298E-4,1.02619576340661E-3,9.2279868841032606E-2,7.4164717208827302E-3,4.8552222911132897E-5,0,4.4551639555878098E-2,1.22732347284438E-3,6.6443950785767994E-2,3.7298449725287001E-2,9.27058965110341E-3,6.1619007916300803E-2,4.0208773220680397E-3,0.76219999999999999]
["P9815","Jardineiro","h",0.2,0.08,2.5000000000000001E-2,1.4999999999999999E-2,1.6E-2,2E-3,0.03,4.1481481481481499E-3,0,0.18665007911508999,5.1661565720909401E-2,6.8774281130736498E-2,8.8074383673218196E-3,4.6017992016452797E-4,8.9926369499965903E-4,9.2367597301618296E-2,7.4235223989474203E-3,7.69230453968996E-5,0,3.9741423270264302E-2,1.00357585641208E-3,5.4382515271421197E-2,4.5347867222245902E-2,9.2794029986842698E-3,0.155230752140193,3.5527927581110899E-3,1.0978000000000001]
["P9819","Engenheiro supervisor","mês",0.2,0.08,2.5000000000000001E-2,1.4999999999999999E-2,1.6E-2,2E-3,0.03,1.11111111111111E-3,0,0,0,8.4231003895897605E-2,8.7419842513498207E-3,4.6023077283645602E-4,7.5393007086905497E-4,9.2377804481280995E-2,7.4243427431922599E-3,3.9883469716391198E-4,0,3.0823895339647099E-2,7.1850898482282396E-4,3.8939402079143801E-2,3.8220420189202901E-2,9.2804284289903297E-3,7.1750818987958306E-2,2.73112127690304E-3,0.75600000000000001]
["P9821","Pedreiro","h",0.2,0.08,2.5000000000000001E-2,1.4999999999999999E-2,1.6E-2,2E-3,0.03,0,0,0.18584229755742199,5.1434353146190201E-2,6.2085314093252499E-2,9.1494780581014307E-3,4.6032540061438599E-4,9.3445919937549995E-4,9.2396798227210503E-2,7.4258692579275897E-3,1.9021916110185199E-5,0,4.4643896956373302E-2,1.1273762596995E-3,6.1110416876361401E-2,4.5111933339398599E-2,9.2823365724094796E-3,0.150787233403083,3.9863862200792801E-3,1.0938000000000001]
["P9822","Pintor","h",0.2,0.08,2.5000000000000001E-2,1.4999999999999999E-2,1.6E-2,2E-3,0.03,1.11111111111111E-3,0,0.184810125053949,5.1144677022612897E-2,5.4687352242000199E-2,8.7400144431037906E-3,4.6012707025071102E-4,9.2074007471795998E-4,9.2356989234331902E-2,7.4226698356307302E-3,7.0262358162794701E-6,0,4.5861950751899298E-2,1.26342036408428E-3,6.8455300070442399E-2,4.4817591078797202E-2,9.2783372945384208E-3,0.14784735265196,4.1352985545395002E-3,1.0912999999999999]
["P9823","Serralheiro","h",0.2,0.08,2.5000000000000001E-2,1.4999999999999999E-2,1.6E-2,2E-3,0.03,1.11111111111111E-3,0,0.18622325148652899,5.1541664155104798E-2,6.5515043846266593E-2,8.7407307508166297E-3,4.60164781008679E-4,9.8105331621635601E-4,9.23645585609221E-2,7.4232781773775E-3,2.8702899441102599E-5,0,4.2121619715140599E-2,1.0636821004524899E-3,5.7637700901629597E-2,4.5224910335157797E-2,9.2790977217218802E-3,0.15254566712984099,3.7623464591782698E-3,1.0940000000000001]
["P9824","Servente","h",0.2,0.08,2.5000000000000001E-2,1.4999999999999999E-2,1.6E-2,2E-3,0.03,0,0,0.18599407413254601,5.14768459931964E-2,6.2992281890531798E-2,9.1512597665585702E-3,4.6041504131892798E-4,1.13428029830319E-3,9.2414790964694404E-2,7.4273153222795098E-3,1.41233518498324E-5,0,4.3990275980440197E-2,1.1108706044734599E-3,6.0227439395727403E-2,4.5154092376360901E-2,9.2841441528493801E-3,0.15127206232815099,3.92802246088145E-3,1.0940000000000001]
["P9825","Soldador","h",0.2,0.08,2.5000000000000001E-2,1.4999999999999999E-2,1.6E-2,2E-3,0.03,1.11111111111111E-3,0,0.18601379961610701,5.14828131228958E-2,6.3892431209004397E-2,8.7407372854799107E-3,4.6016512503276399E-4,9.69089435067086E-4,9.2364627613648498E-2,7.4232837270992204E-3,4.1391228617621101E-5,0,4.3307459597547102E-2,1.09362768814472E-3,5.92604056091936E-2,4.5164426827614498E-2,9.2791046588740298E-3,0.15184800667130299,3.8682668989167401E-3,1.0943000000000001]
["P9826","Chefe setor de finanças","mês",0.2,0.08,2.5000000000000001E-2,1.4999999999999999E-2,1.6E-2,2E-3,0.03,4.1481481481481499E-3,0,0,0,9.9092206470654295E-2,8.8152683270863192E-3,4.6058902779708198E-4,3.9155514484932001E-4,9.2449713637861794E-2,7.4301220343090798E-3,1.4734996879535501E-3,0,2.20626736745528E-2,4.4571260525028199E-4,2.4174078379828101E-2,3.8723614538576402E-2,9.2876525428863405E-3,7.8193146856036205E-2,1.9308850146144E-3,0.7571]
["P9827","Vigia","mês",0.2,0.08,2.5000000000000001E-2,1.4999999999999999E-2,1.6E-2,2E-3,0.03,0,0,0,0,8.5096183664630107E-2,9.15036587609519E-3,4.6037006820865301E-4,1.05064403124449E-3,9.2405763934271801E-2,7.4265898258446504E-3,0,0,3.01594125134634E-2,7.0301980425000398E-4,3.81115015810655E-2,3.8258877356809398E-2,9.2832372823058104E-3,7.1977089603308494E-2,2.6714642890410699E-3,0.75480000000000003]
["P9830","Montador","h",0.2,0.08,2.5000000000000001E-2,1.4999999999999999E-2,1.6E-2,2E-3,0.03,1.11111111111111E-3,0,0.18547922593129501,5.1332574608909602E-2,5.96879049633013E-2,8.7411554358815102E-3,4.6018713899171801E-4,1.0491277694319599E-3,9.2369046269062699E-2,7.4236388514978104E-3,9.3012359533390506E-6,0,4.2517026603843697E-2,1.17127327448854E-3,6.3470823395449003E-2,4.50096691905384E-2,9.2795485643722593E-3,0.15006292031586299,3.8336921080687099E-3,1.091]
["P9833","Auxiliar de laboratório","mês",0.2,0.08,2.5000000000000001E-2,1.4999999999999999E-2,1.6E-2,2E-3,0.03,1.11111111111111E-3,0,0,0,6.5481971092815505E-2,8.7409538244430894E-3,4.6017652494970601E-4,1.0060306880481E-3,9.2366915812005901E-2,7.4234676280802497E-3,2.92698868894329E-5,0,4.2147010540428499E-2,1.0643232858237399E-3,5.7673916656525603E-2,3.7616281134631398E-2,9.2793345351003097E-3,6.47822428098805E-2,3.7646143938461101E-3,0.76090000000000002]
["P9836","Geólogo","h",0.2,0.08,2.5000000000000001E-2,1.4999999999999999E-2,1.6E-2,2E-3,0.03,4.1481481481481499E-3,0,0.1879971202064,5.20394649922876E-2,7.8176037829769507E-2,8.8140111484137206E-3,4.6052334145821002E-4,7.2804497599620905E-4,9.2436529035424098E-2,7.4290623965748903E-3,9.9383656410944004E-4,0,3.29134498171475E-2,8.3115150061660603E-4,4.5072667550796003E-2,4.5730388175693901E-2,9.2863279957186105E-3,0.159679329154366,2.94238747715683E-3,1.0976999999999999]
["P9837","Oceanógrafo","mês",0.2,0.08,2.5000000000000001E-2,1.4999999999999999E-2,1.6E-2,2E-3,0.03,4.1481481481481499E-3,0,0,0,8.0863452140404898E-2,7.8173719862504199E-3,3.9677996805156202E-4,8.2795755455076798E-4,9.2331135873420497E-2,7.4205920181988601E-3,8.0171892343324001E-4,0,3.0883614526737199E-2,7.7989280069296302E-4,4.2244729024155797E-2,3.80946882708579E-2,9.2757400227485697E-3,7.0878967298125595E-2,2.7609248236709402E-3,0.75749999999999995]
["P9840","Encarregado geral","mês",0.2,0.08,2.5000000000000001E-2,1.4999999999999999E-2,1.6E-2,2E-3,0.03,0,0,0,0,7.7577230883724896E-2,9.1481448883423203E-3,4.6025832663491401E-4,7.8545170345927797E-4,9.2383335096696106E-2,7.4247872350770103E-3,2.2181259129643599E-5,0,3.3318098668222898E-2,8.4136995239430102E-4,4.5600549245203299E-2,3.8009644460578099E-2,9.2809840438462608E-3,6.9110911296647606E-2,2.9750720359389398E-3,0.75490000000000002]
["P9842","Faxineiro","mês",0.2,0.08,2.5000000000000001E-2,1.4999999999999999E-2,1.6E-2,2E-3,0.03,1.11111111111111E-3,0,0,0,6.8495559635068301E-2,8.7482660624810908E-3,4.6056148525924599E-4,4.3839079369071198E-4,9.2444185282685901E-2,7.4296777240782496E-3,1.43312633079096E-3,0,3.9986575562010497E-2,1.0097665989898599E-3,5.4763354075179599E-2,3.7742392554049702E-2,9.2870971550978194E-3,6.6236903001921005E-2,3.5716421162768799E-3,0.76119999999999999]
["P9843","Operador de equipamento leve","h",0.2,0.08,2.5000000000000001E-2,1.4999999999999999E-2,1.6E-2,2E-3,0.03,0,0,0.187788948822424,5.1981250202797397E-2,7.7049780830501999E-2,9.1501863495196799E-3,4.6036103592918699E-4,1.0310038117742901E-3,9.2403950969568299E-2,7.4264441190765003E-3,0,0,3.3716040802500902E-2,8.5141904186688102E-4,4.6155487128922403E-2,4.5673341636530897E-2,9.2830551488456304E-3,0.157243428820106,3.0106054716070902E-3,1.0911999999999999]
["P9844","Capitão fluvial","mês",0.2,0.08,2.5000000000000001E-2,1.4999999999999999E-2,1.6E-2,2E-3,0.03,4.1481481481481499E-3,0,0,0,8.6227539735521802E-2,7.8111160238971099E-3,3.9646243927756402E-4,5.2955379967680404E-4,9.2257246577749502E-2,7.41465358461955E-3,2.9956457671186099E-4,0,2.9154270238314801E-2,6.7958980788641703E-4,3.67821223681443E-2,3.82379563755985E-2,9.2683169807744395E-3,7.2545122293997802E-2,2.5852497075704701E-3,0.75629999999999997]
["P9845","Operador de equipamento pesado","h",0.2,0.08,2.5000000000000001E-2,1.4999999999999999E-2,1.6E-2,2E-3,0.03,0,0,0.187788948822424,5.1981250202797397E-2,7.7049780830501999E-2,9.1501863495196799E-3,4.6036103592918699E-4,1.0310038117742901E-3,9.2403950969568299E-2,7.4264441190765003E-3,0,0,3.3716040802500902E-2,8.5141904186688102E-4,4.6155487128922403E-2,4.5673341636530897E-2,9.2830551488456304E-3,0.157243428820106,3.0106054716070902E-3,1.0911999999999999]
["P9846","Operador de equipamento especial","h",0.2,0.08,2.5000000000000001E-2,1.4999999999999999E-2,1.6E-2,2E-3,0.03,0,0,0.187788948822424,5.1981250202797397E-2,7.7049780830501999E-2,9.1501863495196799E-3,4.6036103592918699E-4,1.0310038117742901E-3,9.2403950969568299E-2,7.4264441190765003E-3,0,0,3.3716040802500902E-2,8.5141904186688102E-4,4.6155487128922403E-2,4.5673341636530897E-2,9.2830551488456304E-3,0.157243428820106,3.0106054716070902E-3,1.0911999999999999]
["P9847","Perfurador de tubulão","h",0.2,0.08,2.5000000000000001E-2,1.4999999999999999E-2,1.6E-2,2E-3,0.03,0,0,0.18599407413254601,5.14768459931964E-2,6.2992281890531798E-2,9.1512597665585702E-3,4.6041504131892798E-4,1.13428029830319E-3,9.2414790964694404E-2,7.4273153222795098E-3,1.41233518498324E-5,0,4.3990275980440197E-2,1.1108706044734599E-3,6.0227439395727403E-2,4.5154092376360901E-2,9.2841441528493801E-3,0.15127206232815099,3.92802246088145E-3,1.0940000000000001]
["P9848","Desenhista","mês",0.2,0.08,2.5000000000000001E-2,1.4999999999999999E-2,1.6E-2,2E-3,0.03,1.11111111111111E-3,0,0,0,7.4769654098380406E-2,8.7457807682996894E-3,4.6043064438502901E-4,7.5974030173713697E-4,9.2417922821742493E-2,7.4275670275487397E-3,8.2715474085712204E-4,0,3.53899038460826E-2,8.9368850277810801E-4,4.8454242997276298E-2,3.7933064012894403E-2,9.2844587844359196E-3,6.8436245315400199E-2,3.1610626639342601E-3,0.7581]
["P9849","Condutor maquinista fluvial","mês",0.2,0.08,2.5000000000000001E-2,1.4999999999999999E-2,1.6E-2,2E-3,0.03,4.1481481481481499E-3,0,0,0,7.9527518793611598E-2,7.8108087540942504E-3,3.9644684343502501E-4,7.5327525819031199E-4,9.2253617408001906E-2,7.4143619106592203E-3,3.6735024566758397E-5,0,3.1811414344570098E-2,8.0332219551932597E-4,4.3477304417057702E-2,3.8022168447761899E-2,9.2679523883240304E-3,7.0035588614712402E-2,2.84386801499443E-3,0.75660000000000005]
["P9850","Copeiro","mês",0.2,0.08,2.5000000000000001E-2,1.4999999999999999E-2,1.6E-2,2E-3,0.03,1.11111111111111E-3,0,0,0,8.4735729183141095E-2,8.7474267233180296E-3,4.6051729738375003E-4,1.8336940225518699E-4,9.2435315865072004E-2,7.4289648948800803E-3,1.5926976458049899E-3,0,3.04660948466716E-2,7.1016860908042797E-4,3.8511358636954998E-2,3.8258688672379401E-2,9.2862061186001002E-3,7.2192235311264799E-2,2.6994187121076401E-3,0.75680000000000003]
["P9851","Médico do trabalho","mês",0.2,0.08,2.5000000000000001E-2,1.4999999999999999E-2,1.6E-2,2E-3,0.03,4.1481481481481499E-3,0,0,0,7.5127053881813802E-2,8.8071467803249402E-3,4.60164685033114E-4,4.2596706636568798E-4,9.2364539296647605E-2,7.4232766291205598E-3,5.1677839612025603E-4,0,3.5097153348693302E-2,8.8629577984681099E-4,4.8025665180383002E-2,3.7923997655533601E-2,9.2790957864007009E-3,6.8893898660650404E-2,3.1376056010769802E-3,0.76049999999999995]
["P9852","Blaster","h",0.2,0.08,2.5000000000000001E-2,1.4999999999999999E-2,1.6E-2,2E-3,0.03,4.1481481481481499E-3,0,0.18769948012891599,5.1956444485409398E-2,7.6942376426887699E-2,8.80715937803421E-3,4.6016534325093002E-4,9.4461767659208002E-4,9.2364671414533403E-2,7.4232872473472301E-3,0,0,3.3770596167597901E-2,8.5279670886377504E-4,4.62105187924901E-2,4.56511424672311E-2,9.2791090591840299E-3,0.15875773091520601,3.0190144093583198E-3,1.0963000000000001]
["P9853","Pré-marcador","h",0.2,0.08,2.5000000000000001E-2,1.4999999999999999E-2,1.6E-2,2E-3,0.03,0,0,0.18599407413254601,5.14768459931964E-2,6.2992281890531798E-2,9.1512597665585702E-3,4.6041504131892798E-4,1.13428029830319E-3,9.2414790964694404E-2,7.4273153222795098E-3,1.41233518498324E-5,0,4.3990275980440197E-2,1.1108706044734599E-3,6.0227439395727403E-2,4.5154092376360901E-2,9.2841441528493801E-3,0.15127206232815099,3.92802246088145E-3,1.0940000000000001]
["P9854","Recepcionista","mês",0.2,0.08,2.5000000000000001E-2,1.4999999999999999E-2,1.6E-2,2E-3,0.03,1.11111111111111E-3,0,0,0,7.0678505086725199E-2,8.7520644208701603E-3,4.60761453752285E-4,2.7252665199865102E-4,9.2484323081900105E-2,7.4329035723217501E-3,2.0341354668193699E-3,0,3.8415050958105199E-2,9.7008145385775099E-4,5.2633925689141603E-2,3.7827687031500398E-2,9.2911294654021894E-3,6.7220751106404006E-2,3.43127191995013E-3,0.76100000000000001]
["P9855","Marinheiro de máquinas","mês",0.2,0.08,2.5000000000000001E-2,1.4999999999999999E-2,1.6E-2,2E-3,0.03,4.1481481481481499E-3,0,0,0,8.2994641233818001E-2,7.8117573607434099E-3,3.9649499108830501E-4,8.6274545167415104E-4,9.2264821419985599E-2,7.4152623696551101E-3,4.8779882434606901E-5,0,3.1722133129189298E-2,7.3944702380790005E-4,4.0025120659496101E-2,3.8137424086700802E-2,9.2690779620688904E-3,7.1375969008297901E-2,2.81295449089891E-3,0.75800000000000001]
["P9856","Marinheiro de convés","h",0.2,0.08,2.5000000000000001E-2,1.4999999999999999E-2,1.6E-2,2E-3,0.03,4.1481481481481499E-3,0,0.18874929518062999,5.2252221669447797E-2,8.6489788355569794E-2,7.8121440890183197E-3,3.9651461993964101E-4,9.1416811587438304E-4,9.2269389075325406E-2,7.4156294690786804E-3,4.6906678634686398E-5,0,2.89554281015354E-2,6.7495477197473096E-4,3.6536063744864102E-2,4.5963073832112601E-2,9.26953683634835E-3,0.16238537715864301,2.5676174165969899E-3,1.0948]
["P9857","Marinheiro de convés - mensalista","mês",0.2,0.08,2.5000000000000001E-2,1.4999999999999999E-2,1.6E-2,2E-3,0.03,4.1481481481481499E-3,0,0,0,8.6489788355569794E-2,7.8121440890183197E-3,3.9651461993964101E-4,9.1416811587438304E-4,9.2269389075325406E-2,7.4156294690786804E-3,4.6906678634686398E-5,0,2.89554281015354E-2,6.7495477197473096E-4,3.6536063744864102E-2,3.82510252929101E-2,9.26953683634835E-3,7.2697108961991705E-2,2.5676174165969899E-3,0.75639999999999996]
["P9858","Laboratorista","mês",0.2,0.08,2.5000000000000001E-2,1.4999999999999999E-2,1.6E-2,2E-3,0.03,1.11111111111111E-3,0,0,0,6.5481971092815505E-2,8.7409538244430894E-3,4.6017652494970601E-4,1.0060306880481E-3,9.2366915812005901E-2,7.4234676280802497E-3,2.92698868894329E-5,0,4.2147010540428499E-2,1.0643232858237399E-3,5.7673916656525603E-2,3.7616281134631398E-2,9.2793345351003097E-3,6.47822428098805E-2,3.7646143938461101E-3,0.76090000000000002]
["P9859","Trabalhador de via","h",0.2,0.08,2.5000000000000001E-2,1.4999999999999999E-2,1.6E-2,2E-3,0.03,0,0,0.18599407413254601,5.14768459931964E-2,6.2992281890531798E-2,9.1512597665585702E-3,4.6041504131892798E-4,1.13428029830319E-3,9.2414790964694404E-2,7.4273153222795098E-3,1.41233518498324E-5,0,4.3990275980440197E-2,1.1108706044734599E-3,6.0227439395727403E-2,4.5154092376360901E-2,9.2841441528493801E-3,0.15127206232815099,3.92802246088145E-3,1.0940000000000001]
["P9861","Selecionador de material pétreo","h",0.2,0.08,2.5000000000000001E-2,1.4999999999999999E-2,1.6E-2,2E-3,0.03,0,0,0.18599407413254601,5.14768459931964E-2,6.2992281890531798E-2,9.1512597665585702E-3,4.6041504131892798E-4,1.13428029830319E-3,9.2414790964694404E-2,7.4273153222795098E-3,1.41233518498324E-5,0,4.3990275980440197E-2,1.1108706044734599E-3,6.0227439395727403E-2,4.5154092376360901E-2,9.2841441528493801E-3,0.15127206232815099,3.92802246088145E-3,1.0940000000000001]
["P9864","Engenheiro de segurança do trabalho","mês",0.2,0.08,2.5000000000000001E-2,1.4999999999999999E-2,1.6E-2,2E-3,0.03,4.1481481481481499E-3,0,0,0,7.7204579116238695E-2,8.8093448053365008E-3,4.6027952966013901E-4,6.5390435841621605E-4,9.2387590980992002E-2,7.4251292776690101E-3,5.3838532430340298E-4,0,3.3592975690660699E-2,8.4831132289643596E-4,4.5978875525083999E-2,3.7999334828563699E-2,9.2814115970862605E-3,6.9770042080333494E-2,3.0031355431218701E-3,0.7601]
["P9865","Técnico em enfermagem","mês",0.2,0.08,2.5000000000000001E-2,1.4999999999999999E-2,1.6E-2,2E-3,0.03,4.1481481481481499E-3,0,0,0,6.5462668492031903E-2,8.8189826253883604E-3,4.6078309619981302E-4,2.65274197649405E-4,9.24886671673118E-2,7.4332527035787998E-3,2.0219962522247401E-3,0,4.2224091247647901E-2,1.0662697771769601E-3,5.7855554397717203E-2,3.76624519851003E-2,9.2915658794735009E-3,6.5852219382277796E-2,3.7747376228145801E-3,0.76680000000000004]
["P9866","Motorista de caminhão","h",0.2,0.08,2.5000000000000001E-2,1.4999999999999999E-2,1.6E-2,2E-3,0.03,0,0,0.18849234115572699,5.2178920412952898E-2,8.25579843226283E-2,9.1497708797671305E-3,4.6034013295755599E-4,9.8555139282185608E-4,9.2399755312214699E-2,7.4261069168838198E-3,0,0,3.2163759842293298E-2,7.4974139957730099E-4,4.0641689426991298E-2,4.5876824656830503E-2,9.2826336461047793E-3,0.15958348355355101,2.8490056224279099E-3,1.0928]
["P9867","Técnico especializado - mensalista","mês",0.2,0.08,2.5000000000000001E-2,1.4999999999999999E-2,1.6E-2,2E-3,0.03,1.11111111111111E-3,0,0,0,7.0254492088485804E-2,8.7455085736697202E-3,4.6041631441813498E-4,7.5303559000972303E-4,9.24150465019523E-2,7.4273358596390702E-3,8.02734985831904E-4,0,3.8686080941672099E-2,9.7692567647206805E-4,5.2965569914117397E-2,3.7787474237248202E-2,9.2841698245488408E-3,6.6756907694925594E-2,3.4554805972493502E-3,0.75990000000000002]
["P9869","Encarregado de obras de artes especiais","mês",0.2,0.08,2.5000000000000001E-2,1.4999999999999999E-2,1.6E-2,2E-3,0.03,0,0,0,0,7.7577230883724896E-2,9.1481448883423203E-3,4.6025832663491401E-4,7.8545170345927797E-4,9.2383335096696106E-2,7.4247872350770103E-3,2.2181259129643599E-5,0,3.3318098668222898E-2,8.4136995239430102E-4,4.5600549245203299E-2,3.8009644460578099E-2,9.2809840438462608E-3,6.9110911296647606E-2,2.9750720359389398E-3,0.75490000000000002]
["P9870","Motorista de veículo leve","h",0.2,0.08,2.5000000000000001E-2,1.4999999999999999E-2,1.6E-2,2E-3,0.03,1.11111111111111E-3,0,0.18722282417663499,5.1822576369956297E-2,7.33570046707296E-2,8.7400750912952404E-3,4.6013026313727E-4,8.9891712939405097E-4,9.2357630112490804E-2,7.4227213425823698E-3,3.5743413912434898E-5,0,3.6386694751226897E-2,9.1886010469812405E-4,4.9786502145924803E-2,4.5514163922244298E-2,9.2784016782279707E-3,0.15588212690866499,3.2500970542989499E-3,1.0924]
["P9871","Motorista de veículo especial","h",0.2,0.08,2.5000000000000001E-2,1.4999999999999999E-2,1.6E-2,2E-3,0.03,0,0,0.18849234115572699,5.2178920412952898E-2,8.25579843226283E-2,9.1497708797671305E-3,4.6034013295755599E-4,9.8555139282185608E-4,9.2399755312214699E-2,7.4261069168838198E-3,0,0,3.2163759842293298E-2,7.4974139957730099E-4,4.0641689426991298E-2,4.5876824656830503E-2,9.2826336461047793E-3,0.15958348355355101,2.8490056224279099E-3,1.0928]
["P9875","Encarregado de turma","mês",0.2,0.08,2.5000000000000001E-2,1.4999999999999999E-2,1.6E-2,2E-3,0.03,0,0,0,0,7.7577230883724896E-2,9.1481448883423203E-3,4.6025832663491401E-4,7.8545170345927797E-4,9.2383335096696106E-2,7.4247872350770103E-3,2.2181259129643599E-5,0,3.3318098668222898E-2,8.4136995239430102E-4,4.5600549245203299E-2,3.8009644460578099E-2,9.2809840438462608E-3,6.9110911296647606E-2,2.9750720359389398E-3,0.75490000000000002]
["P9876","Técnico de segurança do trabalho","mês",0.2,0.08,2.5000000000000001E-2,1.4999999999999999E-2,1.6E-2,2E-3,0.03,1.11111111111111E-3,0,0,0,6.4407787137053196E-2,8.7461705077576998E-3,4.6045116262057099E-4,6.68660365666297E-4,9.2422041254630993E-2,7.4278980232624896E-3,9.6283776011826003E-4,0,4.29600777830337E-2,1.0848553802273299E-3,5.8821601202454797E-2,3.7603067078755499E-2,9.2848725290781108E-3,6.4629822345922905E-2,3.8372383974332701E-3,0.76239999999999997]
["P9878","Secretária","mês",0.2,0.08,2.5000000000000001E-2,1.4999999999999999E-2,1.6E-2,2E-3,0.03,4.1481481481481499E-3,0,0,0,8.40142094041441E-2,8.8198002425944402E-3,4.6082581588798201E-4,2.15348368534346E-4,9.2497241889460097E-2,7.4339418482982896E-3,2.16498572556413E-3,0,3.1081381053286401E-2,7.2451101009168796E-4,3.93154464484693E-2,3.8259403305423503E-2,9.2924273103728704E-3,7.27945421445544E-2,2.7561359149814802E-3,0.76200000000000001]
["P9880","Piloto fluvial","mês",0.2,0.08,2.5000000000000001E-2,1.4999999999999999E-2,1.6E-2,2E-3,0.03,4.1481481481481499E-3,0,0,0,8.6227539735521802E-2,7.8111160238971099E-3,3.9646243927756402E-4,5.2955379967680404E-4,9.2257246577749502E-2,7.41465358461955E-3,2.9956457671186099E-4,0,2.9154270238314801E-2,6.7958980788641703E-4,3.67821223681443E-2,3.82379563755985E-2,9.2683169807744395E-3,7.2545122293997802E-2,2.5852497075704701E-3,0.75629999999999997]
["P9882","Técnico especializado","h",0.2,0.08,2.5000000000000001E-2,1.4999999999999999E-2,1.6E-2,2E-3,0.03,1.11111111111111E-3,0,0.186932589332203,5.1740541829864102E-2,7.0254492088485804E-2,8.7455085736697202E-3,4.6041631441813498E-4,7.5303559000972303E-4,9.24150465019523E-2,7.4273358596390702E-3,8.02734985831904E-4,0,3.8686080941672099E-2,9.7692567647206805E-4,5.2965569914117397E-2,4.5425014434434398E-2,9.2841698245488408E-3,0.154853812330524,3.4554805972493502E-3,1.0943000000000001]
["P9883","Chefe do setor administrativo","mês",0.2,0.08,2.5000000000000001E-2,1.4999999999999999E-2,1.6E-2,2E-3,0.03,1.11111111111111E-3,0,0,0,8.2334418162499895E-2,8.7421228091724996E-3,4.60238067355867E-4,7.1860718486364101E-4,9.2379268641714696E-2,7.4244604167930999E-3,4.4998020075693402E-4,0,3.2326239516101703E-2,7.5352882177673601E-4,4.0837940026453003E-2,3.8160291055461003E-2,9.2805755209913708E-3,7.1057246132782997E-2,2.8642350219483998E-3,0.75690000000000002]
["P9884","Encarregado de terraplenagem","mês",0.2,0.08,2.5000000000000001E-2,1.4999999999999999E-2,1.6E-2,2E-3,0.03,0,0,0,0,7.7577230883724896E-2,9.1481448883423203E-3,4.6025832663491401E-4,7.8545170345927797E-4,9.2383335096696106E-2,7.4247872350770103E-3,2.2181259129643599E-5,0,3.3318098668222898E-2,8.4136995239430102E-4,4.5600549245203299E-2,3.8009644460578099E-2,9.2809840438462608E-3,6.9110911296647606E-2,2.9750720359389398E-3,0.75490000000000002]
["P9885","Frentista de túnel","h",0.2,0.08,2.5000000000000001E-2,1.4999999999999999E-2,1.6E-2,2E-3,0.03,0,0,0.18599407413254601,5.14768459931964E-2,6.2992281890531798E-2,9.1512597665585702E-3,4.6041504131892798E-4,1.13428029830319E-3,9.2414790964694404E-2,7.4273153222795098E-3,1.41233518498324E-5,0,4.3990275980440197E-2,1.1108706044734599E-3,6.0227439395727403E-2,4.5154092376360901E-2,9.2841441528493801E-3,0.15127206232815099,3.92802246088145E-3,1.0940000000000001]
["P9889","Técnico da qualidade","mês",0.2,0.08,2.5000000000000001E-2,1.4999999999999999E-2,1.6E-2,2E-3,0.03,1.11111111111111E-3,0,0,0,7.0444966984353097E-2,8.7454105182107802E-3,4.6041115218741602E-4,7.4005108307081502E-4,9.2414010335819502E-2,7.4272525836557102E-3,8.0450818495309895E-4,0,3.8546381071823399E-2,9.7339788594552601E-4,5.2773713463406299E-2,3.7793171546951998E-2,9.2840657295696401E-3,6.6822624579772893E-2,3.4430024609804302E-3,0.75980000000000003]
["P9891","Engenheiro mecânico","mês",0.2,0.08,2.5000000000000001E-2,1.4999999999999999E-2,1.6E-2,2E-3,0.03,4.1481481481481499E-3,0,0,0,8.3805022439158799E-2,8.8067451740776199E-3,4.60143701504974E-4,7.5725383380982299E-4,9.2360327469941703E-2,7.4229381274077801E-3,1.4007680532718899E-4,0,3.1148543333089598E-2,7.2607657151564295E-4,3.9342080854096802E-2,3.8200080241639303E-2,9.2786726592597301E-3,7.2104636884249507E-2,2.76209151815047E-3,0.75949999999999995]
["P9892","Auxiliar de blaster","h",0.2,0.08,2.5000000000000001E-2,1.4999999999999999E-2,1.6E-2,2E-3,0.03,4.1481481481481499E-3,0,0.18769948012891599,5.1956444485409398E-2,7.6942376426887699E-2,8.80715937803421E-3,4.6016534325093002E-4,9.4461767659208002E-4,9.2364671414533403E-2,7.4232872473472301E-3,0,0,3.3770596167597901E-2,8.5279670886377504E-4,4.62105187924901E-2,4.56511424672311E-2,9.2791090591840299E-3,0.15875773091520601,3.0190144093583198E-3,1.0963000000000001]
["P9893","Encarregado de pavimentação","mês",0.2,0.08,2.5000000000000001E-2,1.4999999999999999E-2,1.6E-2,2E-3,0.03,0,0,0,0,7.7577230883724896E-2,9.1481448883423203E-3,4.6025832663491401E-4,7.8545170345927797E-4,9.2383335096696106E-2,7.4247872350770103E-3,2.2181259129643599E-5,0,3.3318098668222898E-2,8.4136995239430102E-4,4.5600549245203299E-2,3.8009644460578099E-2,9.2809840438462608E-3,6.9110911296647606E-2,2.9750720359389398E-3,0.75490000000000002]
["P9896","Porteiro","mês",0.2,0.08,2.5000000000000001E-2,1.4999999999999999E-2,1.6E-2,2E-3,0.03,1.11111111111111E-3,0,0,0,6.1344000599168703E-2,8.7421010549740396E-3,4.6023692208366299E-4,7.1811878158315205E-4,9.2379038761971899E-2,7.4244419415109703E-3,4.4798057437087498E-4,0,4.1412107249203599E-2,1.14083458641626E-3,6.1828051083460497E-2,3.7488509396341199E-2,9.2805524268887093E-3,6.3308431300852605E-2,3.7340633017223799E-3,0.75880000000000003]
["P9897","Técnico de meio ambiente","mês",0.2,0.08,2.5000000000000001E-2,1.4999999999999999E-2,1.6E-2,2E-3,0.03,4.1481481481481499E-3,0,0,0,6.4734580186079804E-2,8.8151184016583804E-3,4.6058119434215598E-4,5.79432937898971E-4,9.2448141301959302E-2,7.4299956667177201E-3,1.2682665632783299E-3,0,4.2734753765484502E-2,1.0791653539204101E-3,5.8529608216532601E-2,3.7623555720061902E-2,9.2874945833971503E-3,6.5399870225905196E-2,3.82038968924588E-3,0.76639999999999997]
["P9900","Comprador","mês",0.2,0.08,2.5000000000000001E-2,1.4999999999999999E-2,1.6E-2,2E-3,0.03,1.11111111111111E-3,0,0,0,8.3784864623734703E-2,8.7443470918624495E-3,4.6035516701104499E-4,7.2758181276756997E-4,9.2402772956700296E-2,7.4263494429653203E-3,6.9537035166499503E-4,0,3.1194974408597202E-2,7.2715888588764503E-4,3.9418832651865798E-2,3.82157325262946E-2,9.2829368037066502E-3,7.16967480984399E-2,2.7640003770120799E-3,0.75670000000000004]
["P9901","Encarregado de superestrutura ferroviária","mês",0.2,0.08,2.5000000000000001E-2,1.4999999999999999E-2,1.6E-2,2E-3,0.03,0,0,0,0,7.7577230883724896E-2,9.1481448883423203E-3,4.6025832663491401E-4,7.8545170345927797E-4,9.2383335096696106E-2,7.4247872350770103E-3,2.2181259129643599E-5,0,3.3318098668222898E-2,8.4136995239430102E-4,4.5600549245203299E-2,3.8009644460578099E-2,9.2809840438462608E-3,6.9110911296647606E-2,2.9750720359389398E-3,0.75490000000000002]
["P9903","Auxiliar técnico","mês",0.2,0.08,2.5000000000000001E-2,1.4999999999999999E-2,1.6E-2,2E-3,0.03,1.11111111111111E-3,0,0,0,7.0254492088485804E-2,8.7455085736697202E-3,4.6041631441813498E-4,7.5303559000972303E-4,9.24150465019523E-2,7.4273358596390702E-3,8.02734985831904E-4,0,3.8686080941672099E-2,9.7692567647206805E-4,5.2965569914117397E-2,3.7787474237248202E-2,9.2841698245488408E-3,6.6756907694925594E-2,3.4554805972493502E-3,0.75990000000000002]
["P9907","Comandante de longo curso","mês",0.2,0.08,2.5000000000000001E-2,1.4999999999999999E-2,1.6E-2,2E-3,0.03,4.1481481481481499E-3,0,0,0,8.6227539735521802E-2,7.8111160238971099E-3,3.9646243927756402E-4,5.2955379967680404E-4,9.2257246577749502E-2,7.41465358461955E-3,2.9956457671186099E-4,0,2.9154270238314801E-2,6.7958980788641703E-4,3.67821223681443E-2,3.82379563755985E-2,9.2683169807744395E-3,7.2545122293997802E-2,2.5852497075704701E-3,0.75629999999999997]
["P9908","Imediato","mês",0.2,0.08,2.5000000000000001E-2,1.4999999999999999E-2,1.6E-2,2E-3,0.03,4.1481481481481499E-3,0,0,0,8.6227539735521802E-2,7.8111160238971099E-3,3.9646243927756402E-4,5.2955379967680404E-4,9.2257246577749502E-2,7.41465358461955E-3,2.9956457671186099E-4,0,2.9154270238314801E-2,6.7958980788641703E-4,3.67821223681443E-2,3.82379563755985E-2,9.2683169807744395E-3,7.2545122293997802E-2,2.5852497075704701E-3,0.75629999999999997]
["P9909","Oficial de náutica","mês",0.2,0.08,2.5000000000000001E-2,1.4999999999999999E-2,1.6E-2,2E-3,0.03,4.1481481481481499E-3,0,0,0,8.1259718437966297E-2,7.8153523010213496E-3,3.96677456537197E-4,8.3368583478416597E-4,9.2307281331045599E-2,7.4186748444841502E-3,5.3764226236383298E-4,0,3.0578566333336998E-2,7.7218952847101299E-4,4.1816656670094501E-2,3.8098209038982499E-2,9.2733435556051902E-3,7.0919912527425896E-2,2.7336542097068399E-3,0.75690000000000002]
["P9910","Oficial de máquinas","mês",0.2,0.08,2.5000000000000001E-2,1.4999999999999999E-2,1.6E-2,2E-3,0.03,4.1481481481481499E-3,0,0,0,8.6054842268257506E-2,7.8123960072753297E-3,3.9652740634895398E-4,8.0735876765906803E-4,9.2272364486865002E-2,7.4158686009263798E-3,1.8577969901366101E-4,0,2.9302329160405299E-2,6.8304108049920605E-4,3.6974977047562502E-2,3.8238244391563099E-2,9.2698357511579697E-3,7.2548471812992704E-2,2.5983788060493099E-3,0.75670000000000004]
["P9911","Condutor de máquinas","mês",0.2,0.08,2.5000000000000001E-2,1.4999999999999999E-2,1.6E-2,2E-3,0.03,4.1481481481481499E-3,0,0,0,7.9527518793611598E-2,7.8108087540942504E-3,3.9644684343502501E-4,7.5327525819031199E-4,9.2253617408001906E-2,7.4143619106592203E-3,3.6735024566758397E-5,0,3.1811414344570098E-2,8.0332219551932597E-4,4.3477304417057702E-2,3.8022168447761899E-2,9.2679523883240304E-3,7.0035588614712402E-2,2.84386801499443E-3,0.75660000000000005]
["P9912","Capitão fluvial com periculosidade","h",0.2,0.08,2.5000000000000001E-2,1.4999999999999999E-2,1.6E-2,2E-3,0.03,4.1481481481481499E-3,0,0.188692052889296,5.2236240920561901E-2,8.6227539735521802E-2,7.8111160238971099E-3,3.9646243927756402E-4,5.2955379967680404E-4,9.2257246577749502E-2,7.41465358461955E-3,2.9956457671186099E-4,0,2.9154270238314801E-2,6.7958980788641703E-4,3.67821223681443E-2,4.5947661777513998E-2,9.2683169807744395E-3,0.16220614067182901,2.5852497075704701E-3,1.0946]
["P9913","Draguista","mês",0.2,0.08,2.5000000000000001E-2,1.4999999999999999E-2,1.6E-2,2E-3,0.03,4.1481481481481499E-3,0,0,0,8.6227539735521802E-2,7.8111160238971099E-3,3.9646243927756402E-4,5.2955379967680404E-4,9.2257246577749502E-2,7.41465358461955E-3,2.9956457671186099E-4,0,2.9154270238314801E-2,6.7958980788641703E-4,3.67821223681443E-2,3.82379563755985E-2,9.2683169807744395E-3,7.2545122293997802E-2,2.5852497075704701E-3,0.75629999999999997]
["P9915","Maquinista","h",0.2,0.08,2.5000000000000001E-2,1.4999999999999999E-2,1.6E-2,2E-3,0.03,4.1481481481481499E-3,0,0.17236122500913401,4.7647242473901001E-2,0,8.8021728369743705E-3,4.59904801425815E-4,3.7789108287093602E-4,9.2312375298757798E-2,7.4190842432832601E-3,0,0,0.1,3.0303168044703201E-3,0.12308316706501,4.2540156663883097E-2,9.2738553041040693E-3,0.12257811823923299,9.1277267870858506E-3,1.1112]
["P9916","Encarregado de conservação rodoviária","mês",0.2,0.08,2.5000000000000001E-2,1.4999999999999999E-2,1.6E-2,2E-3,0.03,0,0,0,0,7.7577230883724896E-2,9.1481448883423203E-3,4.6025832663491401E-4,7.8545170345927797E-4,9.2383335096696106E-2,7.4247872350770103E-3,2.2181259129643599E-5,0,3.3318098668222898E-2,8.4136995239430102E-4,4.5600549245203299E-2,3.8009644460578099E-2,9.2809840438462608E-3,6.9110911296647606E-2,2.9750720359389398E-3,0.75490000000000002]
["P9920","Mestre fluvial","mês",0.2,0.08,2.5000000000000001E-2,1.4999999999999999E-2,1.6E-2,2E-3,0.03,4.1481481481481499E-3,0,0,0,8.6227539735521802E-2,7.8111160238971099E-3,3.9646243927756402E-4,5.2955379967680404E-4,9.2257246577749502E-2,7.41465358461955E-3,2.9956457671186099E-4,0,2.9154270238314801E-2,6.7958980788641703E-4,3.67821223681443E-2,3.82379563755985E-2,9.2683169807744395E-3,7.2545122293997802E-2,2.5852497075704701E-3,0.75629999999999997]
["P9921","Mergulhador raso autônomo de emergência","h",0.2,0.08,2.5000000000000001E-2,1.4999999999999999E-2,1.6E-2,2E-3,0.03,4.1481481481481499E-3,0.12,0.18824757880885201,5.2111181610385401E-2,8.24805542649137E-2,7.8128539725600896E-3,3.9655065091904503E-4,9.8620348563010205E-4,9.2277773523943896E-2,7.4163033216410497E-3,6.5783863433166101E-5,0,3.21387510199646E-2,7.4915844069604897E-4,4.0556477100344698E-2,4.5817433072072901E-2,9.2703791520513095E-3,0.21250700308067699,2.9397970208552798E-3,1.2679]
["P9922","Mergulhador raso dependente de emergência","h",0.2,0.08,2.5000000000000001E-2,1.4999999999999999E-2,1.6E-2,2E-3,0.03,4.1481481481481499E-3,0,0.18824757880885201,5.2111181610385401E-2,8.24805542649137E-2,7.8128539725600896E-3,3.9655065091904503E-4,9.8620348563010205E-4,9.2277773523943896E-2,7.4163033216410497E-3,6.5783863433166101E-5,0,3.21387510199646E-2,7.4915844069604897E-4,4.0556477100344698E-2,4.5817433072072901E-2,9.2703791520513095E-3,0.16069162906040399,2.84989800797175E-3,1.0960000000000001]
["P9924","Mergulhador raso dependente","h",0.2,0.08,2.5000000000000001E-2,1.4999999999999999E-2,1.6E-2,2E-3,0.03,4.1481481481481499E-3,0,0.18824757880885201,5.2111181610385401E-2,8.24805542649137E-2,7.8128539725600896E-3,3.9655065091904503E-4,9.8620348563010205E-4,9.2277773523943896E-2,7.4163033216410497E-3,6.5783863433166101E-5,0,3.21387510199646E-2,7.4915844069604897E-4,4.0556477100344698E-2,4.5817433072072901E-2,9.2703791520513095E-3,0.16069162906040399,2.84989800797175E-3,1.0960000000000001]
["P9925","Mergulhador raso autônomo","h",0.2,0.08,2.5000000000000001E-2,1.4999999999999999E-2,1.6E-2,2E-3,0.03,4.1481481481481499E-3,0.12,0.18824757880885201,5.2111181610385401E-2,8.24805542649137E-2,7.8128539725600896E-3,3.9655065091904503E-4,9.8620348563010205E-4,9.2277773523943896E-2,7.4163033216410497E-3,6.5783863433166101E-5,0,3.21387510199646E-2,7.4915844069604897E-4,4.0556477100344698E-2,4.5817433072072901E-2,9.2703791520513095E-3,0.21250700308067699,2.9397970208552798E-3,1.2679]
["P9926","Mergulhador raso auxiliar de superfície","h",0.2,0.08,2.5000000000000001E-2,1.4999999999999999E-2,1.6E-2,2E-3,0.03,4.1481481481481499E-3,0.12,0.18824757880885201,5.2111181610385401E-2,8.24805542649137E-2,7.8128539725600896E-3,3.9655065091904503E-4,9.8620348563010205E-4,9.2277773523943896E-2,7.4163033216410497E-3,6.5783863433166101E-5,0,3.21387510199646E-2,7.4915844069604897E-4,4.0556477100344698E-2,4.5817433072072901E-2,9.2703791520513095E-3,0.21250700308067699,2.9397970208552798E-3,1.2679]
["P9927","Frentista de túnel com periculosidade","h",0.2,0.08,2.5000000000000001E-2,1.4999999999999999E-2,1.6E-2,2E-3,0.03,0,0,0.18599407413254601,5.14768459931964E-2,6.2992281890531798E-2,9.1512597665585702E-3,4.6041504131892798E-4,1.13428029830319E-3,9.2414790964694404E-2,7.4273153222795098E-3,1.41233518498324E-5,0,4.3990275980440197E-2,1.1108706044734599E-3,6.0227439395727403E-2,4.5154092376360901E-2,9.2841441528493801E-3,0.15127206232815099,3.92802246088145E-3,1.0940000000000001]
["P9928","Servente com periculosidade","h",0.2,0.08,2.5000000000000001E-2,1.4999999999999999E-2,1.6E-2,2E-3,0.03,0,0,0.18599407413254601,5.14768459931964E-2,6.2992281890531798E-2,9.1512597665585702E-3,4.6041504131892798E-4,1.13428029830319E-3,9.2414790964694404E-2,7.4273153222795098E-3,1.41233518498324E-5,0,4.3990275980440197E-2,1.1108706044734599E-3,6.0227439395727403E-2,4.5154092376360901E-2,9.2841441528493801E-3,0.15127206232815099,3.92802246088145E-3,1.0940000000000001]
["P9929","Bombeiro hidráulico com periculosidade","h",0.2,0.08,2.5000000000000001E-2,1.4999999999999999E-2,1.6E-2,2E-3,0.03,1.11111111111111E-3,0,0.18706780781879201,5.1778977831291297E-2,7.2081143408337697E-2,8.7405559992157593E-3,4.60155581030504E-4,9.7417162267307404E-4,9.2362711935630407E-2,7.4231297653302502E-3,1.55975554197209E-5,0,3.7322062355058999E-2,9.42480606100203E-4,5.10691391725029E-2,4.5468936048567103E-2,9.2789122066628104E-3,0.15536043594909699,3.3336450521230399E-3,1.0928]
["P9930","Eletricista com periculosidade","h",0.2,0.08,2.5000000000000001E-2,1.4999999999999999E-2,1.6E-2,2E-3,0.03,0,0,0.18753838428356201,5.1910833084230397E-2,7.5083338684816203E-2,9.1503628820826903E-3,4.60369917574924E-4,1.05031648607477E-3,9.24057336989767E-2,7.4265873958540797E-3,0,0,3.5153561815383101E-2,8.8772024255118101E-4,4.81243062471527E-2,4.5600829645861499E-2,9.2832342448175998E-3,0.156409540927407,3.13896599448948E-3,1.0915999999999999]
["P9931","Operador de equipamento de mergulho","h",0.2,0.08,2.5000000000000001E-2,1.4999999999999999E-2,1.6E-2,2E-3,0.03,4.1481481481481499E-3,0.12,0.18824757880885201,5.2111181610385401E-2,8.24805542649137E-2,7.8128539725600896E-3,3.9655065091904503E-4,9.8620348563010205E-4,9.2277773523943896E-2,7.4163033216410497E-3,6.5783863433166101E-5,0,3.21387510199646E-2,7.4915844069604897E-4,4.0556477100344698E-2,4.5817433072072901E-2,9.2703791520513095E-3,0.21250700308067699,2.9397970208552798E-3,1.2679]
["P9932","Operador de equipamento pesado com periculosidade","h",0.2,0.08,2.5000000000000001E-2,1.4999999999999999E-2,1.6E-2,2E-3,0.03,0,0,0.187788948822424,5.1981250202797397E-2,7.7049780830501999E-2,9.1501863495196799E-3,4.6036103592918699E-4,1.0310038117742901E-3,9.2403950969568299E-2,7.4264441190765003E-3,0,0,3.3716040802500902E-2,8.5141904186688102E-4,4.6155487128922403E-2,4.5673341636530897E-2,9.2830551488456304E-3,0.157243428820106,3.0106054716070902E-3,1.0911999999999999]
["P9933","Supervisor de mergulho raso","mês",0.2,0.08,2.5000000000000001E-2,1.4999999999999999E-2,1.6E-2,2E-3,0.03,4.1481481481481499E-3,0.12,0,0,8.24805542649137E-2,7.8128539725600896E-3,3.9655065091904503E-4,9.8620348563010205E-4,9.2277773523943896E-2,7.4163033216410497E-3,6.5783863433166101E-5,0,3.21387510199646E-2,7.4915844069604897E-4,4.0556477100344698E-2,3.81259527386573E-2,9.2703791520513095E-3,9.4214884249164799E-2,2.9397970208552798E-3,0.90159999999999996]
["P9934","Motorista de veículo especial com periculosidade","h",0.2,0.08,2.5000000000000001E-2,1.4999999999999999E-2,1.6E-2,2E-3,0.03,0,0,0.18849234115572699,5.2178920412952898E-2,8.25579843226283E-2,9.1497708797671305E-3,4.6034013295755599E-4,9.8555139282185608E-4,9.2399755312214699E-2,7.4261069168838198E-3,0,0,3.2163759842293298E-2,7.4974139957730099E-4,4.0641689426991298E-2,4.5876824656830503E-2,9.2826336461047793E-3,0.15958348355355101,2.8490056224279099E-3,1.0928]
["P9938","Operador de equipamento leve com periculosidade","h",0.2,0.08,2.5000000000000001E-2,1.4999999999999999E-2,1.6E-2,2E-3,0.03,0,0,0.187788948822424,5.1981250202797397E-2,7.7049780830501999E-2,9.1501863495196799E-3,4.6036103592918699E-4,1.0310038117742901E-3,9.2403950969568299E-2,7.4264441190765003E-3,0,0,3.3716040802500902E-2,8.5141904186688102E-4,4.6155487128922403E-2,4.5673341636530897E-2,9.2830551488456304E-3,0.157243428820106,3.0106054716070902E-3,1.0911999999999999]
["P9939","Operador de equipamento leve com insalubridade","h",0.2,0.08,2.5000000000000001E-2,1.4999999999999999E-2,1.6E-2,2E-3,0.03,0,0.12,0.187788948822424,5.1981250202797397E-2,7.7049780830501999E-2,9.1501863495196799E-3,4.6036103592918699E-4,1.0310038117742901E-3,9.2403950969568299E-2,7.4264441190765003E-3,0,0,3.3716040802500902E-2,8.5141904186688102E-4,4.6155487128922403E-2,4.5673341636530897E-2,9.2830551488456304E-3,0.208518459957097,3.1127757566311101E-3,1.2625999999999999]
["P9940","Piloto fluvial com periculosidade","h",0.2,0.08,2.5000000000000001E-2,1.4999999999999999E-2,1.6E-2,2E-3,0.03,4.1481481481481499E-3,0,0.188692052889296,5.2236240920561901E-2,8.6227539735521802E-2,7.8111160238971099E-3,3.9646243927756402E-4,5.2955379967680404E-4,9.2257246577749502E-2,7.41465358461955E-3,2.9956457671186099E-4,0,2.9154270238314801E-2,6.7958980788641703E-4,3.67821223681443E-2,4.5947661777513998E-2,9.2683169807744395E-3,0.16220614067182901,2.5852497075704701E-3,1.0946]
["P9941","Mestre fluvial com periculosidade","h",0.2,0.08,2.5000000000000001E-2,1.4999999999999999E-2,1.6E-2,2E-3,0.03,4.1481481481481499E-3,0,0.188692052889296,5.2236240920561901E-2,8.6227539735521802E-2,7.8111160238971099E-3,3.9646243927756402E-4,5.2955379967680404E-4,9.2257246577749502E-2,7.41465358461955E-3,2.9956457671186099E-4,0,2.9154270238314801E-2,6.7958980788641703E-4,3.67821223681443E-2,4.5947661777513998E-2,9.2683169807744395E-3,0.16220614067182901,2.5852497075704701E-3,1.0946]
["P9942","Marinheiro de convés com periculosidade","h",0.2,0.08,2.5000000000000001E-2,1.4999999999999999E-2,1.6E-2,2E-3,0.03,4.1481481481481499E-3,0,0.18874929518062999,5.2252221669447797E-2,8.6489788355569794E-2,7.8121440890183197E-3,3.9651461993964101E-4,9.1416811587438304E-4,9.2269389075325406E-2,7.4156294690786804E-3,4.6906678634686398E-5,0,2.89554281015354E-2,6.7495477197473096E-4,3.6536063744864102E-2,4.5963073832112601E-2,9.26953683634835E-3,0.16238537715864301,2.5676174165969899E-3,1.0948]
["P9943","Técnico de batimetria com periculosidade","h",0.2,0.08,2.5000000000000001E-2,1.4999999999999999E-2,1.6E-2,2E-3,0.03,4.1481481481481499E-3,0,0.18799624195933501,5.2040625062949597E-2,8.0644620439093997E-2,7.81222934313088E-3,3.96518947113034E-4,9.3482030654603199E-4,9.2270396013342998E-2,7.4157103960178399E-3,3.7194229452979501E-5,0,3.1004784688995202E-2,7.8295266718372001E-4,4.2382574245363298E-2,4.5745547414303402E-2,9.2696379950222996E-3,0.15985562548486201,2.7717571602996899E-3,1.0934999999999999]
["P9944","Operador de equipamento especial com periculosidade","h",0.2,0.08,2.5000000000000001E-2,1.4999999999999999E-2,1.6E-2,2E-3,0.03,0,0,0.187788948822424,5.1981250202797397E-2,7.7049780830501999E-2,9.1501863495196799E-3,4.6036103592918699E-4,1.0310038117742901E-3,9.2403950969568299E-2,7.4264441190765003E-3,0,0,3.3716040802500902E-2,8.5141904186688102E-4,4.6155487128922403E-2,4.5673341636530897E-2,9.2830551488456304E-3,0.157243428820106,3.0106054716070902E-3,1.0911999999999999]
["P9945","Draguista com periculosidade","h",0.2,0.08,2.5000000000000001E-2,1.4999999999999999E-2,1.6E-2,2E-3,0.03,4.1481481481481499E-3,0,0.188692052889296,5.2236240920561901E-2,8.6227539735521802E-2,7.8111160238971099E-3,3.9646243927756402E-4,5.2955379967680404E-4,9.2257246577749502E-2,7.41465358461955E-3,2.9956457671186099E-4,0,2.9154270238314801E-2,6.7958980788641703E-4,3.67821223681443E-2,4.5947661777513998E-2,9.2683169807744395E-3,0.16220614067182901,2.5852497075704701E-3,1.0946]
["P9946","Engenheiro auxiliar","mês",0.2,0.08,2.5000000000000001E-2,1.4999999999999999E-2,1.6E-2,2E-3,0.03,1.11111111111111E-3,0,0,0,8.4231003895897605E-2,8.7419842513498207E-3,4.6023077283645602E-4,7.5393007086905497E-4,9.2377804481280995E-2,7.4243427431922599E-3,3.9883469716391198E-4,0,3.0823895339647099E-2,7.1850898482282396E-4,3.8939402079143801E-2,3.8220420189202901E-2,9.2804284289903297E-3,7.1750818987958306E-2,2.73112127690304E-3,0.75600000000000001]
["P9947","Técnico florestal","mês",0.2,0.08,2.5000000000000001E-2,1.4999999999999999E-2,1.6E-2,2E-3,0.03,4.1481481481481499E-3,0,0,0,6.4734580186079804E-2,8.8151184016583804E-3,4.6058119434215598E-4,5.79432937898971E-4,9.2448141301959302E-2,7.4299956667177201E-3,1.2682665632783299E-3,0,4.2734753765484502E-2,1.0791653539204101E-3,5.8529608216532601E-2,3.7623555720061902E-2,9.2874945833971503E-3,6.5399870225905196E-2,3.82038968924588E-3,0.76639999999999997]
["P9948","Motorista de veículo leve - mensalista","mês",0.2,0.08,2.5000000000000001E-2,1.4999999999999999E-2,1.6E-2,2E-3,0.03,1.11111111111111E-3,0,0,0,7.33570046707296E-2,8.7400750912952404E-3,4.6013026313727E-4,8.9891712939405097E-4,9.2357630112490804E-2,7.4227213425823698E-3,3.5743413912434898E-5,0,3.6386694751226897E-2,9.1886010469812405E-4,4.9786502145924803E-2,3.7864711104753299E-2,9.2784016782279707E-3,6.7647813506911805E-2,3.2500970542989499E-3,0.75749999999999995]
["P9949","Topógrafo","mês",0.2,0.08,2.5000000000000001E-2,1.4999999999999999E-2,1.6E-2,2E-3,0.03,1.11111111111111E-3,0,0,0,5.9859198823988199E-2,8.7405750078875296E-3,4.6015658176162502E-4,9.7461205675712203E-4,9.2362912802998007E-2,7.4231459089070702E-3,1.7330647168104302E-5,0,4.2399619719290099E-2,1.16803891035015E-3,6.3291351580009203E-2,3.7434813818543002E-2,9.2789323861338403E-3,6.2689067726388006E-2,3.82310571756357E-3,0.75900000000000001]
["P9950","Auxiliar de topografia","mês",0.2,0.08,2.5000000000000001E-2,1.4999999999999999E-2,1.6E-2,2E-3,0.03,1.11111111111111E-3,0,0,0,5.9859198823988199E-2,8.7405750078875296E-3,4.6015658176162502E-4,9.7461205675712203E-4,9.2362912802998007E-2,7.4231459089070702E-3,1.7330647168104302E-5,0,4.2399619719290099E-2,1.16803891035015E-3,6.3291351580009203E-2,3.7434813818543002E-2,9.2789323861338403E-3,6.2689067726388006E-2,3.82310571756357E-3,0.75900000000000001]
["P9951","Médico de câmara hiperbárica","mês",0.2,0.08,2.5000000000000001E-2,1.4999999999999999E-2,1.6E-2,2E-3,0.03,4.1481481481481499E-3,0.12,0,0,7.5127053881813802E-2,8.8071467803249402E-3,4.60164685033114E-4,4.2596706636568798E-4,9.2364539296647605E-2,7.4232766291205598E-3,5.1677839612025603E-4,0,3.5097153348693302E-2,8.8629577984681099E-4,4.8025665180383002E-2,3.7923997655533601E-2,9.2790957864007009E-3,9.1108889868901505E-2,3.2439610946585901E-3,0.90280000000000005]
["P9952","Pedreiro - mensalista","mês",0.2,0.08,2.5000000000000001E-2,1.4999999999999999E-2,1.6E-2,2E-3,0.03,0,0,0,0,6.2085314093252499E-2,9.1494780581014307E-3,4.6032540061438599E-4,9.3445919937549995E-4,9.2396798227210503E-2,7.4258692579275897E-3,1.9021916110185199E-5,0,4.4643896956373302E-2,1.1273762596995E-3,6.1110416876361401E-2,3.7519080516882901E-2,9.2823365724094796E-3,6.3469425944153904E-2,3.9863862200792801E-3,0.76160000000000005]
["P9953","Eletricista - mensalista","mês",0.2,0.08,2.5000000000000001E-2,1.4999999999999999E-2,1.6E-2,2E-3,0.03,0,0,0,0,7.5083338684816203E-2,9.1503628820826903E-3,4.60369917574924E-4,1.05031648607477E-3,9.24057336989767E-2,7.4265873958540797E-3,0,0,3.5153561815383101E-2,8.8772024255118101E-4,4.81243062471527E-2,3.7938454690092098E-2,9.2832342448175998E-3,6.8292228936059601E-2,3.13896599448948E-3,0.75639999999999996]
["P9954","Servente - mensalista","mês",0.2,0.08,2.5000000000000001E-2,1.4999999999999999E-2,1.6E-2,2E-3,0.03,0,0,0,0,6.2992281890531798E-2,9.1512597665585702E-3,4.6041504131892798E-4,1.13428029830319E-3,9.2414790964694404E-2,7.4273153222795098E-3,1.41233518498324E-5,0,4.3990275980440197E-2,1.1108706044734599E-3,6.0227439395727403E-2,3.7555022932337201E-2,9.2841441528493801E-3,6.38827637218774E-2,3.92802246088145E-3,0.76160000000000005]
["P9955","Engenheiro chefe","mês",0.2,0.08,2.5000000000000001E-2,1.4999999999999999E-2,1.6E-2,2E-3,0.03,1.11111111111111E-3,0,0,0,8.4231003895897605E-2,8.7419842513498207E-3,4.6023077283645602E-4,7.5393007086905497E-4,9.2377804481280995E-2,7.4243427431922599E-3,3.9883469716391198E-4,0,3.0823895339647099E-2,7.1850898482282396E-4,3.8939402079143801E-2,3.8220420189202901E-2,9.2804284289903297E-3,7.1750818987958306E-2,2.73112127690304E-3,0.75600000000000001]
["P9956","Motorista de caminhão com periculosidade","h",0.2,0.08,2.5000000000000001E-2,1.4999999999999999E-2,1.6E-2,2E-3,0.03,0,0,0.18849234115572699,5.2178920412952898E-2,8.25579843226283E-2,9.1497708797671305E-3,4.6034013295755599E-4,9.8555139282185608E-4,9.2399755312214699E-2,7.4261069168838198E-3,0,0,3.2163759842293298E-2,7.4974139957730099E-4,4.0641689426991298E-2,4.5876824656830503E-2,9.2826336461047793E-3,0.15958348355355101,2.8490056224279099E-3,1.0928]
["P9972","Técnico de batimetria","mês",0.2,0.08,2.5000000000000001E-2,1.4999999999999999E-2,1.6E-2,2E-3,0.03,4.1481481481481499E-3,0,0,0,8.0644620439093997E-2,7.81222934313088E-3,3.96518947113034E-4,9.3482030654603199E-4,9.2270396013342998E-2,7.4157103960178399E-3,3.7194229452979501E-5,0,3.1004784688995202E-2,7.8295266718372001E-4,4.2382574245363298E-2,3.8064367669590302E-2,9.2696379950222996E-3,7.0526349935235697E-2,2.7717571602996899E-3,0.75649999999999995]
[]
[null,"Legenda:",{"$nulls":11},"CONSIDERAÇÕES SOBRE O USO DOS DADOS DESTA PLANILHA:"]
[]
[null,"Classificação","Parcela","Descrição",{"$nulls":9},"1.     Para fins de apresentação dos valores percentuais obtidos para cada parcela dos encargos sociais e trabalhistas adotou-se apenas quatro casas decimais em porcentagem, o que pode promover pequenas diferenças entre o valor divulgado na coluna Total (%) em relação a uma eventual soma dos valores visíveis das parcelas.\r\n\r\n2.     Sobre os encargos sociais e trabalhistas apresentados na presente tabela, não está aplicada a média móvel. A média móvel é parte da metodologia de cálculo dos salários e encargos sociais das categorias do SICRO, tendo por objetivo estabilizar os resultados e realizar o abrandamento das variações decorrentes de eventuais flutuações no número de amostras. Isso implica dizer que, após a obtenção dos valores totais dos encargos sociais (última coluna), deve ser aplicada a média aritmética simples sobre o resultado da referência atual juntamente com os resultados das duas referências anteriores, obtendo desta forma, os percentuais efetivamente utilizados no cálculo dos custos da Mão de Obra."]
[null,"Grupo A - Encargos Sociais (%)","A1","Previdência Social"]
[null,null,"A2","FGTS"]
[null,null,"A3","Salário Educação"]
[null,null,"A4","SESC ou SESI"]
[null,null,"A5","SENAI / SEBRAE"]
[null,null,"A6","INCRA"]
[null,null,"A7","Seguro Contra Risco e Acidente de Trabalho"]
[null,null,"A8","SECONCI"]
[null,null,"A9","FAE - Financiamento de Aposentadoria Especial"]
[null,"Grupo B - Encargos Trabalhistas (%)","B1","Repouso Semanal Remunerado - Domingos"]
[null,null,"B2","Feriados"]
[null,null,"B3","Férias Gozadas + 1/3"]
[null,null,"B4","Auxílio Enfermidade"]
[null,null,"B5","Auxílio Acidente de Trabalho"]
[null,null,"B6","Licença Paternidade"]
[null,null,"B7","13° Salário"]
[null,null,"B8","Faltas Justificadas"]
[null,null,"B9","Férias sobre Licença Maternidade"]
[null,null,"B10","Reciclagem Tecnológica"]
[null,"Grupo C - Verbas Rescisórias (%)","C1","Aviso Prévio Indenizado"]
[null,null,"C2","Aviso Prévio Trabalhado"]
[null,null,"C3","Féria Indenizadas + 1/3"]
[null,null,"C4","Depósito por Rescisão Sem Justa Causa"]
[null,null,"C5","Indenização Adicional"]
[null,"Grupo D - Reincidências (%)","D1","Reincidência de A sobre B"]
[null,null,"D2","Reincidência de A sobre Aviso Prévio Trabalhado + Reincidência de FGTS sobre Aviso Prévio Indenizado"]

{"sheet":"EQUIP D","index":17,"n_rows":533,"n_cols":11,"rows_kept":533,"cut":false,"hidden":true,"merged":[[524,2,524,8],[527,2,527,8],[530,2,530,8],[501,2,501,8],[506,2,506,8],[509,2,509,8],[513,2,513,8],[516,2,516,8],[521,2,521,8],[498,2,498,8],[464,2,464,8],[467,2,467,8],[470,2,470,8],[473,2,473,8],[476,2,476,8],[480,2,480,8],[483,2,483,8],[486,2,486,8],[489,2,489,8],[492,2,492,8],[495,2,495,8],[461,2,461,8],[426,2,426,8],[431,2,431,8],[434,2,434,8],[437,2,437,8],[440,2,440,8],[443,2,443,8],[446,2,446,8],[449,2,449,8],[452,2,452,8],[455,2,455,8],[458,2,458,8],[421,2,421,8],[387,2,387,8],[391,2,391,8],[396,2,396,8],[399,2,399,8],[402,2,402,8],[405,2,405,8],[407,2,407,8],[409,2,409,8],[411,2,411,8],[414,2,414,8],[417,2,417,8],[384,2,384,8],[0,1,0,9],[1,1,1,9],[374,2,374,8],[377,2,377,8],[381,2,381,8]]}
["CGCIT","SISTEMA DE CUSTOS REFERENCIAIS DE OBRAS - SICRO",{"$nulls":8},"DNIT"]
[null,"Alagoas - Abril/2023 - Com desoneração"]
["Código","Descrição","Valor de Aquisição (R$)","Depreciação (R$/h)","Oportunidade de Capital (R$/h)","Seguros e Impostos (R$/h)","Manutenção (R$/h)","Operação (R$/h)","Mão de Obra de Operação (R$/h)","Custo Produtivo (R$/h)","Custo Improdutivo (R$/h)"]
["E9001","Conjunto vibratório para tubos de concreto com encaixe PB e 3 jogos de fôrmas - D = 0,60 m - 2,20 kW",76710.856599999999,10.2281,2.3664999999999998,0,7.6711,0,0,20.265699999999999,12.5946]
["E9002","Conjunto vibratório para tubos de concreto com encaixe PB e 3 jogos de fôrmas - D = 0,80 m - 2,20 kW",83255.5723,11.1007,2.5684,0,8.3255999999999997,0,0,21.994700000000002,13.6691]
["E9003","Conjunto vibratório para tubos de concreto com encaixe PB e 3 jogos de fôrmas - D = 1,00 m - 2,20 kW",91563.191800000001,12.208399999999999,2.8247,0,9.1562999999999999,0,0,24.189399999999999,15.033099999999999]
["E9004","Conjunto vibratório para tubos de concreto com encaixe PB e 3 jogos de fôrmas - D = 1,20 m - 2,20 kW",92067.672300000006,12.275700000000001,2.8403,0,9.2067999999999994,0,0,24.322800000000001,15.116]
["E9005","Conjunto vibratório para tubos de concreto com encaixe PB e 3 jogos de fôrmas - D = 1,50 m - 2,20 kW",94050.433900000004,12.540100000000001,2.9015,0,9.4049999999999994,0,0,24.846599999999999,15.441599999999999]
["E9006","Equipamento para sondagem manual",2421.8281000000002,0.41170000000000001,8.9700000000000002E-2,0,0.2422,0,0,0.74360000000000004,0.50139999999999996]
["E9007","Bomba de pistão triplex com capacidade de 7,80 m³/h (130 l/min) - 8,20 kW",126847.17939999999,10.1478,2.3479000000000001,0,8.8793000000000006,8.2433999999999994,0,29.618400000000001,12.495699999999999]
["E9008","Transportador manual de tubos de concreto com capacidade de 1 t",2311.2347,2.0800999999999998,0.1426,0,1.1556,0,0,3.3782999999999999,2.2227000000000001]
["E9009","Embarcação rebocadora - 268 kW",653919.23640000005,8.5145999999999997,3.7942,0,18.921299999999999,269.41770000000002,123.2719,423.91969999999998,135.58070000000001]
["E9010","Balança plataforma digital à bateria, com mesa de 75 x 75 cm e capacidade de 500 kg",5508.6417000000001,0.82630000000000003,0.1133,0,0.45910000000000001,0,0,1.3987000000000001,0.93959999999999999]
["E9011","Carro manual modelo plataforma de 200 x 80 cm com capacidade de 800 kg",2100.3564000000001,0.37809999999999999,7.7799999999999994E-2,0,0.21,0,0,0.66590000000000005,0.45590000000000003]
["E9014","Deflectômetro de impacto (FWD) instalado em picape com reboque e faixa de carga de 7 a 120 kN - 147 kW",2217849.4029000001,177.428,41.052399999999999,0,110.8925,0,22.709800000000001,352.08269999999999,241.1902]
["E9015","Elevador de obra com capacidade de 1.000 kg - 9 kW",56711.879000000001,4.5369999999999999,1.0497000000000001,0,3.9698000000000002,0,20.2517,29.808199999999999,25.8384]
["E9016","Usina misturadora móvel de reciclagem a frio com sistema de espuma de asfalto - 129 kW",9247269.4000000004,539.42399999999998,166.41229999999999,67.427999999999997,693.54520000000002,95.555499999999995,33.672499999999999,1596.0374999999999,806.93679999999995]
["E9017","Escavadeira hidráulica sobre esteira com capacidade de 0,4 m³ - 64 kW",926616.21539999999,64.863100000000003,17.151700000000002,0,64.863100000000003,44.021099999999997,25.232399999999998,216.13140000000001,107.24720000000001]
["E9020","Recicladora a frio - 455 kW",5002228.5833999999,291.79669999999999,90.019300000000001,0,416.85239999999999,481.48099999999999,33.672499999999999,1313.8218999999999,415.48849999999999]
["E9021","Grupo gerador - 456 kVA",348021.8063,17.4011,6.1351000000000004,0,12.429399999999999,366.93090000000001,0,402.8965,23.536200000000001]
["E9022","Pórtico metálico rolante com capacidade de 25 t - 30 kW",890693.89650000003,40.081200000000003,15.1128,0,31.174299999999999,0,20.2517,106.62,75.445700000000002]
["E9023","Guindaste móvel sobre esteiras com dragline com capacidade de 1,9 a 2,3 m³ - 270 kW",3685304.0907999999,128.98560000000001,62.5304,0,184.26519999999999,71.4285,33.672499999999999,480.88220000000001,225.1885]
["E9024","Misturador de nata cimento - 1,50 kW",7565.9021000000002,0.60529999999999995,0.14000000000000001,0,0.52959999999999996,0,20.2517,21.526599999999998,20.997]
["E9025","Conjunto bomba e macaco hidráulico para protensão com capacidade de 7.000 kN - 15 kW",102576.0202,5.8615000000000004,1.8083,0,5.8615000000000004,0,33.672499999999999,47.203800000000001,41.342300000000002]
["E9026","Bomba para injeção de nata de cimento com capacidade de 2 MPa - 2,20 kW",29575.640100000001,2.3660999999999999,0.5474,0,2.0703,0,0,4.9837999999999996,2.9135]
["E9028","Bomba de alta pressão para hidrojateamento com capacidade de 18 MPa - 5,20 kW",4909.9530999999997,0.39279999999999998,9.0899999999999995E-2,0,0.44190000000000002,8.5356000000000005,20.2517,29.712900000000001,20.735399999999998]
["E9029","Conjunto bomba e macaco hidráulico para protensão com capacidade de 8.000 kN - 20 kW",130406.59970000001,7.4518000000000004,2.2989000000000002,0,7.4518000000000004,0,33.672499999999999,50.875,43.423200000000001]
["E9030","Bomba de protensão com leitura digital para tensionamento de estais - 3 kW",13714.5672,0.78369999999999995,0.24179999999999999,0,0.78369999999999995,0,0,1.8091999999999999,1.0255000000000001]
["E9031","Elevador de cremalheira com cabine simples, com capacidade de 1.500 kg e altura de até 100 m - 15 kW",265439.15149999998,21.235099999999999,4.9132999999999996,0,18.5807,0,20.2517,64.980800000000002,46.400100000000002]
["E9032","Equipamento para regulagem final de estais com até 37 cordoalhas - D = 15,7 mm - 20 kW",86759.652900000001,4.9577,1.5294000000000001,0,4.9577,0,33.672499999999999,45.1173,40.159599999999998]
["E9033","Equipamento para regulagem final de estais de 38 a 55 cordoalhas - D = 15,7 mm - 30 kW",123942.3613,7.0823999999999998,2.1848999999999998,0,7.0823999999999998,0,33.672499999999999,50.022199999999998,42.939799999999998]
["E9034","Equipamento para regulagem final de estais de 56 a 73 cordoalhas - D = 15,7 mm - 40 kW",185913.54199999999,10.6236,3.2774000000000001,0,10.6236,0,33.672499999999999,58.197099999999999,47.573500000000003]
["E9035","Equipamento para regulagem final de estais de 74 a 91 cordoalhas - D = 15,7 mm - 50 kW",247884.72270000001,14.1648,4.3699000000000003,0,14.1648,0,33.672499999999999,66.372,52.2072]
["E9036","Grua fixa para alturas de 60 a 102 m, com alcance de 60 m com capacidade de 1.500 kg na ponta da lança - 37 kW",3378859.821,168.94300000000001,59.564500000000002,0,193.07769999999999,0,33.672499999999999,455.2577,262.18]
["E9038","Macaco hidráulico monocordoalha para tensionamento de estais - 3 kW",17722.508900000001,1.0126999999999999,0.31240000000000001,0,1.0126999999999999,0,33.672499999999999,36.010300000000001,34.997599999999998]
["E9039","Máquina de solda por termofusão para tubos PEAD com gerador de 4 kW",116584.82739999999,6.6619999999999999,2.0552000000000001,0,6.6619999999999999,4.0212000000000003,33.672499999999999,53.072899999999997,42.389699999999998]
["E9040","Serra mármore - 1,45 kW",465.66860000000003,4.19E-2,8.6E-3,0,2.3300000000000001E-2,0,0,7.3800000000000004E-2,5.0500000000000003E-2]
["E9042","Trator sobre esteiras com lâmina - 97 kW",1051227.6137999999,40.881100000000004,18.0169,0,58.401499999999999,71.851799999999997,25.232399999999998,214.3837,84.130399999999995]
["E9043","Embarcação de alumínio com comprimento de 6 m e motor de popa - 18,60 kW",23176.960800000001,0.36209999999999998,0.13650000000000001,0,0.40239999999999998,34.892899999999997,33.040799999999997,68.834699999999998,33.539400000000001]
["E9044","Central de concreto com capacidade de 150 m³/h - dosadora e misturadora",3405044.1107999999,194.57390000000001,60.0261,0,170.25219999999999,0,33.672499999999999,458.5247,288.27249999999998]
["E9045","Conjunto bomba e macaco hidráulico para elevação com capacidade de 496 kN",64316.993900000001,5.1454000000000004,1.1904999999999999,0,5.1454000000000004,5.4028,33.672499999999999,50.556600000000003,40.008400000000002]
["E9046","Conjunto bomba e macaco hidráulico para elevação com capacidade de 929 kN",78098.918000000005,6.2478999999999996,1.4456,0,6.2478999999999996,5.4028,33.672499999999999,53.0167,41.366]
["E9047","Conjunto bomba e macaco hidráulico para elevação com capacidade de 1.390 kN",113459.76330000001,9.0768000000000004,2.1000999999999999,0,9.0768000000000004,5.4028,33.672499999999999,59.329000000000001,44.849400000000003]
["E9048","Conjunto bomba e macaco hidráulico para elevação com capacidade de 1.859 kN",131711.7193,10.536899999999999,2.4380000000000002,0,10.536899999999999,5.4028,33.672499999999999,62.5871,46.647399999999998]
["E9049","Bomba de alta pressão para hidrojateamento com capacidade de 250 MPa - 72 kW",485993.69099999999,38.8795,8.9956999999999994,0,43.739400000000003,57.142800000000001,20.2517,169.00909999999999,68.126900000000006]
["E9050","Guindaste móvel sobre pneus com 2 eixos com capacidade de 18 t - 97 kW",2822148.8903000001,141.10740000000001,49.750500000000002,0,181.4239,25.6614,22.709800000000001,420.65300000000002,213.5677]
["E9051","Máquina levantadora e posicionadora de via - 7,40 kW",776854.64009999996,62.148400000000002,14.3796,0,54.379800000000003,9.7174999999999994,20.2517,160.87700000000001,96.779700000000005]
["E9052","Empilhadeira a diesel com capacidade de 10 t - 82 kW",844867.88630000001,67.589399999999998,15.638500000000001,0,59.140799999999999,65.079300000000003,20.2517,227.69970000000001,103.4796]
["E9053","Perfuratriz hidráulica montada em flutuante - 32 kW",370236.27600000001,11.569900000000001,2.3795000000000002,0,10.2843,16.9312,24.566800000000001,65.731700000000004,38.516199999999998]
["E9054","Equipamento sobre forma-trilho para execução e acabamento de pavimento de concreto - 13,40 kW",1400158.8677000001,112.0127,25.916899999999998,0,70.007900000000006,17.596499999999999,20.2517,245.78569999999999,158.18129999999999]
["E9055","Guincho pneumático com capacidade de 2,5 t",525835.54009999998,47.325200000000002,9.7332000000000001,0,26.291799999999999,0,0,83.350200000000001,57.058399999999999]
["E9056","Plataforma autoelevatória de 12 x 24 m com capacidade de 150 t",914407.44149999996,7.1437999999999997,5.1424000000000003,0,15.8751,0,83.018199999999993,111.1795,95.304400000000001]
["E9057","Batelão sem propulsão com capacidade de 66 m³",244526.3983,1.9104000000000001,1.3751,0,3.1839,0,21.9147,28.3841,25.200199999999999]
["E9058","Plataforma flutuante de 12 x 24 x 1,8 m com capacidade de 150 t",731336.85589999997,5.7135999999999996,4.1128,0,9.5226000000000006,0,21.9147,41.2637,31.741099999999999]
["E9059","Plataforma autoelevatória de 12 x 24 m montada na obra com capacidade de 150 t",914407.44149999996,7.1437999999999997,5.1424000000000003,0,15.8751,0,83.018199999999993,111.1795,95.304400000000001]
["E9060","Perfuratriz pneumática rotopercussiva montada em flutuante com pressão de 0,70 MPa e capacidade de 2.500 gpm",21929.120900000002,0.68530000000000002,0.1409,0,0.60909999999999997,0,49.133600000000001,50.568899999999999,49.959800000000001]
["E9061","Lixadeira elétrica manual angular - 2 kW",1386.4929999999999,0.1109,2.5700000000000001E-2,0,6.93E-2,0,0,0.2059,0.1366]
["E9062","Soprador de ar quente manual - 1,60 kW",4764.5671000000002,0.63529999999999998,9.8000000000000004E-2,0,0.39700000000000002,0,0,1.1303000000000001,0.73329999999999995]
["E9063","Equipamento de estabilização dinâmica da via - 300 kW",25177007.8462,1007.0803,427.1909,0,1007.0803,190.476,33.672499999999999,2665.5,1467.9437]
["E9064","Transportador manual gerica com capacidade de 180 l",1086.3978,1.0864,6.7000000000000004E-2,0,0.54320000000000002,0,0,1.6966000000000001,1.1534]
["E9065","Carro controle ferroviário - 186 kW",30347707.0847,1213.9083000000001,514.92470000000003,0,1062.1696999999999,118.0951,33.672499999999999,2942.7703000000001,1762.5055]
["E9066","Grupo gerador - 14 kVA",69415.720799999996,3.4708000000000001,1.2237,0,2.4790999999999999,11.058199999999999,0,18.2318,4.6944999999999997]
["E9067","Veículo ferroviário para capina química com capacidade de 12.000 l - 115 kW",1690203.3981000001,67.608099999999993,28.6785,0,42.255099999999999,73.015799999999999,20.2517,231.8092,116.53830000000001]
["E9068","Perfuratriz hidráulica rotopercussiva para CCPH - 123 kW",2702176.2486999999,180.14510000000001,48.627899999999997,0,180.14510000000001,97.619,25.232399999999998,531.76949999999999,254.00540000000001]
["E9069","Vibrador de imersão para concreto - 4,10 kW",3882.4276,0.62119999999999997,0.14369999999999999,0,0.38819999999999999,6.73,0,7.8830999999999998,0.76490000000000002]
["E9070","Ponte rolante com capacidade de 5 t e vão de até 15 m - 10 kW",360741.6532,14.4297,6.1208999999999998,0,9.0184999999999995,0,20.2517,49.820799999999998,40.802300000000002]
["E9071","Transportador manual carrinho de mão com capacidade de 80 l",513.36770000000001,0.51339999999999997,3.1699999999999999E-2,0,0.25669999999999998,0,0,0.80179999999999996,0.54510000000000003]
["E9072","Martelo hidráulico vibratório com unidade hidráulica - 486 kW",2968801.9103000001,197.92009999999999,53.426099999999998,0,173.18010000000001,385.71390000000002,33.672499999999999,843.91269999999997,285.01870000000002]
["E9073","Bomba de concreto rebocável com capacidade de 30 m³/h - 74 kW",478010.60629999998,38.2408,8.8480000000000008,0,38.2408,74.391499999999994,20.2517,179.97280000000001,67.340500000000006]
["E9074","Tanque de estocagem de asfalto com agitadores de 60.000 l",818448.53960000002,34.101999999999997,11.8355,0,21.313800000000001,0,0,67.251300000000001,45.9375]
["E9075","Trado cavadeira de 12\"",138.46520000000001,6.9199999999999998E-2,6.4000000000000003E-3,0,3.4599999999999999E-2,0,0,0.11020000000000001,7.5600000000000001E-2]
["E9076","Equipamento para pintura eletrostática com cabine dupla de 7,00 kW e estufa de 80.000 kCal",163807.8823,10.5305,2.8877000000000002,0,5.8502999999999998,0,20.2517,39.520200000000003,33.669899999999998]
["E9077","Perfuratriz de circulação reversa tipo Wirth ou similar com unidade hidráulica (Power Pack) - 273 kW",4920564.818,328.03769999999997,88.549700000000001,0,328.03769999999997,144.4443,25.232399999999998,914.30179999999996,441.81979999999999]
["E9078","Treliça lançadeira com capacidade de carga de 100 a 120 t e vão máximo de 45 m - 110 kW",3536515.4673000001,94.307100000000005,58.1875,0,58.941899999999997,0,33.672499999999999,245.10900000000001,186.1671]
["E9079","Bomba submersível com capacidade de 360 m³/h - 23 kW",179684.5153,14.3748,3.3260000000000001,0,12.5779,0,0,30.278700000000001,17.700800000000001]
["E9080","Carrelone com capacidade máxima de 70 t",1765067.9987999999,79.428100000000001,29.948799999999999,0,44.1267,0,20.2517,173.75530000000001,129.62860000000001]
["E9081","Fischietti simples com capacidade de 70 t",103956.8224,4.6780999999999997,1.7639,0,2.5989,0,20.2517,29.2926,26.6937]
["E9083","Vagão fechado FLT com capacidade de 99 t",800000,12.666700000000001,12.751300000000001,0,6.6666999999999996,0,0,32.084699999999998,25.417999999999999]
["E9084","Vagão tanque convencional TCT com capacidade de 97 t e 103.000 l",1195000,18.9208,19.0473,0,9.9582999999999995,0,0,47.926400000000001,37.9681]
["E9085","Vagão gôndola GDE com capacidade de 93,5 t / 29 m³",620000,9.8167000000000009,9.8823000000000008,0,5.1666999999999996,0,0,24.8657,19.699000000000002]
["E9086","Bomba de concreto rebocável com capacidade de 41 m³/h - 74 kW",528160.60629999998,42.252800000000001,9.7763000000000009,0,42.252800000000001,74.391499999999994,20.2517,188.92509999999999,72.280799999999999]
["E9089","Roçadeira costal - 1,40 kW",2654.7031999999999,0.3982,5.4600000000000003E-2,0,0.30969999999999998,7.2224000000000004,0,7.9848999999999997,0.45279999999999998]
["E9091","Embarcação empurradora fluvial - 372 kW",1103879.4609000001,14.3734,6.4050000000000002,0,31.940999999999999,373.96789999999999,123.2719,549.95920000000001,144.05029999999999]
["E9093","Veículo leve - 53 kW (sem motorista)",74272.066099999996,4.4562999999999997,1.3748,0.55700000000000005,4.4562999999999997,22.370799999999999,0,33.215200000000003,6.3880999999999997]
["E9094","Guindaste móvel sobre pneus com 6 eixos com capacidade máxima de 350 t - 450 kW",16954702.856199998,847.73509999999999,298.88720000000001,121.105,1089.9452000000001,119.0475,22.709800000000001,2499.4297999999999,1290.4371000000001]
["E9095","Guindaste móvel sobre pneus com 8 eixos com capacidade máxima de 500 t - 500 kW",29740596.207400002,1487.0298,524.28420000000006,212.43279999999999,1911.8955000000001,132.27500000000001,22.709800000000001,4290.6270999999997,2246.4566]
["E9096","Minicarregadeira de pneus - 45,50 kW",365935.69089999999,25.615500000000001,6.7735000000000003,0,25.615500000000001,60.185099999999998,25.232399999999998,143.422,57.621400000000001]
["E9101","Removedora de faixas de sinalização viária - 9,69 kW",50557.211900000002,4.0446,0.93579999999999997,0,3.5390000000000001,15.905799999999999,0,24.4252,4.9804000000000004]
["E9102","Extrusora para sarjeta de concreto - 10,44 kW",66472.362099999998,5.3178000000000001,1.2303999999999999,0,4.6531000000000002,8.2857000000000003,20.2517,39.738700000000001,26.799900000000001]
["E9103","Extrusora para meio-fio de concreto - 10,44 kW",55844.837500000001,4.4676,1.0337000000000001,0,3.9091,8.2857000000000003,20.2517,37.947800000000001,25.753]
["E9105","Embarcação empurradora multipropósito - 2 x 186 kW",5302261.7895999998,69.039900000000003,30.764900000000001,0,153.42189999999999,373.96789999999999,123.2719,750.4665,223.07669999999999]
["E9106","Balsa de convés com capacidade de 200 t",2093591.2275,16.356200000000001,11.7737,0,27.260300000000001,0,21.9147,77.304900000000004,50.044600000000003]
["E9107","Compactador manual com soquete vibratório - 2,24 kW",9486.5939999999991,0.63239999999999996,0.17069999999999999,0,0.63239999999999996,3.6768999999999998,0,5.1124000000000001,0.80310000000000004]
["E9108","Soldadora de trilho por caldeamento na via - 400 kW",8953553.8560000006,143.2569,143.63290000000001,0,179.0711,253.96799999999999,67.344999999999999,787.27390000000003,354.23480000000001]
["E9110","Escavadeira hidráulica sobre esteiras para rocha com caçamba com capacidade de 1,56 m³ - 118 kW",1362317.0708000001,136.23169999999999,27.017700000000001,0,136.23169999999999,118.6242,25.232399999999998,443.33769999999998,188.48179999999999]
["E9111","Jateador abrasivo úmido com capacidade de 350 kg de abrasivo",210622.5496,18.956,3.8986000000000001,0,18.956,0,20.2517,62.0623,43.106299999999997]
["E9112","Sinalizador direcional móvel com sistema fotovoltaico de energia e montado em chassi sobre pneus",22544.144700000001,2.0289999999999999,0.4173,0,1.1272,0,0,3.5735000000000001,2.4462999999999999]
["E9113","Painel de Mensagem Variável - PMV móvel, com sistema fotovoltaico de energia e montado em chassi sobre pneus",167080.60630000001,15.0373,3.0926999999999998,0,8.3539999999999992,0,0,26.484000000000002,18.13]
["E9116","Semáforo móvel com 3 lentes e bateria - D = 200 mm",7661.8557000000001,0.68959999999999999,0.14180000000000001,0,0.3831,0,0,1.2144999999999999,0.83140000000000003]
["E9117","Carregadeira de pneus para rocha com capacidade de 2,50 m³ - 105 kW",710591.35160000005,71.059100000000001,14.092499999999999,0,71.059100000000001,105.55549999999999,25.232399999999998,286.99860000000001,110.384]
["E9118","Cortadora de pavimento com disco diamantado de 450 a 1.500 mm - 55,40 kW",488138.10609999998,39.051000000000002,9.0353999999999992,0,39.051000000000002,43.968200000000003,20.2517,151.35730000000001,68.338099999999997]
["E9119","Minicarregadeira sobre pneus com valetadeira - 55,40 kW",495873.01799999998,34.711100000000002,9.1785999999999994,0,34.711100000000002,73.2804,25.232399999999998,177.11359999999999,69.122100000000003]
["E9120","Equipamento de cravação sobre esteira para geodreno com haste para profundidade de até 20 m - 258 kW",3916185.7713000001,274.13299999999998,72.488600000000005,0,274.13299999999998,177.46010000000001,20.2517,818.46640000000002,366.87329999999997]
["E9122","Perfuratriz tipo Bottom Feed para coluna de brita - 194 kW",4457731.3508000001,297.18209999999999,80.220600000000005,0,297.18209999999999,102.6454,25.232399999999998,802.46259999999995,402.63510000000002]
["E9125","Veículo tipo van furgão com capacidade de 1,54 t - 93 kW",210722.08799999999,10.536099999999999,3.7921,1.5365,10.536099999999999,24.603200000000001,24.187100000000001,75.191100000000006,40.0518]
["E9126","Draga backhoe com capacidade de 7 m³ - 1.000 kW",86279801.5854,970.64779999999996,698.70460000000003,0,2156.9949999999999,1005.29,57.604199999999999,4889.2416000000003,1726.9566]
["E9127","Escavadeira hidráulica com martelo hidráulico de 520 kg - 75 kW",1507765.8700999999,172.31610000000001,29.902200000000001,0,215.39510000000001,51.587299999999999,25.232399999999998,494.43310000000002,227.45070000000001]
["E9134","Miniônibus com capacidade para 30 passageiros - 111 kW",600323.61340000003,25.728200000000001,10.582800000000001,4.2880000000000003,38.592199999999998,111.5872,20.778600000000001,211.55699999999999,61.377600000000001]
["E9141","Rebarbador hidráulico com bomba manual com capacidade de força de 9.000 kgf",89819.543699999995,7.1856,1.6626000000000001,0,4.4909999999999997,0,0,13.3392,8.8482000000000003]
["E9144","Pórtico metálico rolante com talha com capacidade de 5 t - 10 kW",289547.10749999998,11.581899999999999,4.9128999999999996,0,7.2386999999999997,0,20.2517,43.985199999999999,36.746499999999997]
["E9148","Macaco de protensão de fios com bomba - 3,72 kW",95161.423699999999,5.4378000000000002,1.6776,0,5.4378000000000002,0,33.672499999999999,46.225700000000003,40.7879]
["E9149","Máquina de aplicação e extração de grampo elástico tipo Pandrol - 6,70 kW",265191.26530000003,21.215299999999999,4.9086999999999996,0,21.215299999999999,8.7982999999999993,0,56.137599999999999,26.123999999999999]
["E9151","Britador de mandíbulas móvel sobre esteiras, sem peneira, com capacidade de 140 m³/h - 170 kW",3284099.7672999999,187.6628,57.893999999999998,0,187.6628,161.90459999999999,33.672499999999999,628.79669999999999,279.22930000000002]
["E9152","Ferramenta de fixação à pólvora de ação direta",1088.9548,9.2600000000000002E-2,2.0199999999999999E-2,0,8.7099999999999997E-2,0,0,0.19989999999999999,0.1128]
["E9153","Ferramenta de fixação à pólvora e sistema à pistão",1012.0698,8.5999999999999993E-2,1.8700000000000001E-2,0,8.1000000000000003E-2,0,0,0.1857,0.1047]
["E9154","Equipamento para selagem com material asfáltico rebocável com capacidade de 370 l - 35 kW",430049.22279999999,27.646000000000001,7.5811999999999999,0,9.2152999999999992,27.777799999999999,20.2517,92.471999999999994,55.478900000000003]
["E9155","Caldeira de asfalto rebocável com capacidade de 600 l - 5,20 kW",119542.08470000001,7.6848000000000001,2.1074000000000002,0,2.5615999999999999,3.8517999999999999,0,16.2056,9.7921999999999993]
["E9156","Soprador de ar costal - 2,6 kW",2304.9148,0.36880000000000002,8.5300000000000001E-2,0,0.32269999999999999,4.2678000000000003,0,5.0446,0.4541]
["E9157","Locomotiva diesel-elétrica CC - bitola métrica - 2.237 kW",8250000,132,132.34649999999999,0,165,1420.316,28.8978,1878.5603000000001,293.24430000000001]
["E9158","Locomotiva diesel-elétrica CC - bitola larga - 2.237 kW",8250000,132,132.34649999999999,0,165,1420.316,28.8978,1878.5603000000001,293.24430000000001]
["E9159","Vagão plataforma PNE com capacidade de 82 t - bitola métrica",667000,10.5608,10.631399999999999,0,5.5583,0,0,26.750499999999999,21.1922]
["E9160","Vagão plataforma PNT com capacidade de 98 t - bitola larga",746000,11.8117,11.890599999999999,0,6.2167000000000003,0,0,29.919,23.702300000000001]
["E9161","Vagão fechado com porta para carga e descarga de paletes FLD com capacidade de 64 t - bitola métrica",730000,11.558299999999999,11.6356,0,6.0833000000000004,0,0,29.277200000000001,23.193899999999999]
["E9162","Vagão fechado com porta para carga e descarga de paletes FLT com capacidade de 99 t - bitola larga",800000,12.666700000000001,12.751300000000001,0,6.6666999999999996,0,0,32.084699999999998,25.417999999999999]
["E9163","Vagão hopper aberto com descarga automática HNE com capacidade de 45 m³ - bitola métrica",880000,13.933299999999999,14.0265,0,7.3333000000000004,0,0,35.293100000000003,27.959800000000001]
["E9164","Vagão hopper aberto com descarga automática HNT com capacidade de 63 m³ - bitola larga",915000,14.487500000000001,14.584300000000001,0,7.625,0,0,36.696800000000003,29.0718]
["E9167","Equipamento para carga e descarga de TLS de até 250 m - 90 kW",2632822.1236999999,42.1252,42.235700000000001,0,52.656399999999998,57.142800000000001,33.672499999999999,227.83260000000001,118.0334]
["E9168","Carregadeira de pneus com implemento de garfo - 195 kW",1872905.7374,131.10339999999999,34.667499999999997,0,131.10339999999999,82.539599999999993,25.232399999999998,404.6463,191.0033]
["E9200","Carregadeira de pneus para rocha com capacidade de 2,50 m³ - 105 kW com periculosidade",710591.35160000005,71.059100000000001,14.092499999999999,0,71.059100000000001,105.55549999999999,31.042899999999999,292.8091,116.19450000000001]
["E9203","Escavadeira hidráulica com martelo hidráulico de 1.700 kg - 103 kW com periculosidade",2274140.7423999999,259.90179999999998,45.101100000000002,0,324.87720000000002,70.846500000000006,31.042899999999999,731.76949999999999,336.04579999999999]
["E9204","Perfuratriz sobre esteiras - 145 kW com periculosidade",1962850.2349,130.85669999999999,35.323099999999997,0,130.85669999999999,115.0793,31.042899999999999,443.15870000000001,197.2227]
["E9205","Equipamento de corte a plasma CNC - 12.000 x 5.500 mm - 19,5 kW",1072789.0952999999,85.823099999999997,19.857299999999999,0,64.3673,0,0,170.04769999999999,105.68040000000001]
["E9206","Equipamento de solda MIG automática com acessórios - 14,6 kVA",87338.822400000005,6.9870999999999999,1.6166,0,6.9870999999999999,0,0,15.5908,8.6036999999999999]
["E9207","Máquina de solda elétrica retificadora 425 A - 18,70 kW",4516.4601000000002,0.36130000000000001,8.3599999999999994E-2,0,0.36130000000000001,0,0,0.80620000000000003,0.44490000000000002]
["E9209","Martelete perfurador/rompedor a ar comprimido de 25 kg para rocha, com insalubridade, com capacidade de 2.040 gpm",20057.2906,1.6046,0.37130000000000002,0,1.6046,0,26.299700000000001,29.880199999999999,28.275600000000001]
["E9213","Jumbo eletro-hidráulico com 3 braços - 155 kW/237 kW com periculosidade",12060003.819800001,804.00030000000004,217.02979999999999,0,1005.0003,172.22210000000001,42.306800000000003,2240.5592999999999,1063.3369]
["E9242","Estação transmissora de superfície para televisionamento",11361.6811,0.73040000000000005,0.20030000000000001,0,0.40579999999999999,0,0,1.3365,0.93069999999999997]
["E9243","Câmara hiperbárica com filtro, serpentina e reservatório de ar para mergulho raso - D = 1,80 m e H = 2,22 m.",297535.15149999998,5.2069000000000001,4.819,0,7.4383999999999997,0,43.895600000000002,61.359900000000003,53.921500000000002]
["E9244","Estação transmissora de superfície para comunicação sem fio",37767.894800000002,2.4279000000000002,0.66579999999999995,0,1.3489,0,0,4.4425999999999997,3.0937000000000001]
["E9245","Estação transmissora de superfície para comunicação com fio",6330.0793999999996,0.40689999999999998,0.1116,0,0.2261,0,0,0.74460000000000004,0.51849999999999996]
["E9246","Painel de controle de ar com manômetros e pneufatômetros",12147.5394,0.78090000000000004,0.21410000000000001,0,0.43380000000000002,0,0,1.4288000000000001,0.995]
["E9247","Sistema de Sino aberto (sinete) para mergulho até 50 m  - 33,50 kW",550469.58550000004,14.6792,9.0571000000000002,0,14.6792,0,43.895600000000002,82.311099999999996,67.631900000000002]
["E9248","Sistema de ar comprimido para mergulho até 30 m com pressão de trabalho de 1,4 MPa - 7,46 kW",50363.042200000004,3.3574999999999999,0.90629999999999999,0,3.3574999999999999,6.71,0,14.331300000000001,4.2637999999999998]
["E9249","Sistema de ar comprimido para mergulho até 50 m com pressão de trabalho de 1,7 MPa - 16,18 kW",77065.741899999994,5.1376999999999997,1.3869,0,5.1376999999999997,14.5534,0,26.215699999999998,6.5246000000000004]
["E9251","Fonte de plasma para corte manual - 65A - 15 kW",32631.680199999999,2.6105,0.60399999999999998,0,2.6105,0,0,5.8250000000000002,3.2145000000000001]
["E9252","Serra de esquadria com braço telescópico - D = 250 mm (10\") - 1,80 kW",5225.3927000000003,0.4703,9.6699999999999994E-2,0,0.26129999999999998,0,0,0.82830000000000004,0.56699999999999995]
["E9253","Rebordeadeira diâmetro máximo 3,00 m - 4,85 kW",76420.022400000002,3.0568,1.2967,0,2.6747000000000001,0,0,7.0282,4.3535000000000004]
["E9254","Dobradeira viradeira manual comprimento máximo de dobra de até 2.000 mm",18395.629700000001,0.73580000000000001,0.31209999999999999,0,0.64380000000000004,0,0,1.6917,1.0479000000000001]
["E9255","Fonte de plasma para corte manual - 45A - 10 kW",21886.5592,1.7508999999999999,0.40510000000000002,0,1.7508999999999999,0,0,3.9068999999999998,2.1560000000000001]
["E9256","Equipamento para pintura com cal rebocável com dois bicos aplicadores e capacidade de 2.200 l",65811.198600000003,3.7606000000000002,1.1601999999999999,0,3.7606000000000002,0,20.2517,28.9331,25.172499999999999]
["E9501","Ventilador axial para ventilação forçada com velocidade de saída de 32,8 m/s - D = 1.000 mm - 30 kW",441254.76890000002,39.712899999999998,8.1676000000000002,0,26.475300000000001,0,0,74.355800000000002,47.880499999999998]
["E9502","Bate-estaca de gravidade para 6 t - 119 kW",965788.61979999999,55.187899999999999,17.025500000000001,0,41.390900000000002,81.851799999999997,25.232399999999998,220.6885,97.445800000000006]
["E9503","Guilhotina hidráulica 16 x 6.100 mm - 30 kW",1327340.2875999999,53.093600000000002,22.521599999999999,0,46.456899999999997,0,20.2517,142.32380000000001,95.866900000000001]
["E9505","Prensa dobradeira capacidade 320 t - comprimento até 3.100 mm - 30 kW",839022.99170000001,33.560899999999997,14.2361,0,29.3658,0,20.2517,97.414500000000004,68.048699999999997]
["E9507","Plotadora de recorte com computador e programa computacional",87460.936400000006,13.1191,1.7988,0,8.7461000000000002,0,0,23.664000000000001,14.917899999999999]
["E9510","Ventilador centrífugo baixa pressão com capacidade de 58 m³/min - 3,68 kW",12907.1353,1.1616,0.2389,0,0.77439999999999998,0,0,2.1749000000000001,1.4005000000000001]
["E9511","Carregadeira de pneus com capacidade de 3,40 m³ - 195 kW",1866235.7618,130.63650000000001,34.543999999999997,0,130.63650000000001,82.539599999999993,25.232399999999998,403.589,190.41290000000001]
["E9512","Veículo leve - 53 kW",74272.066099999996,4.4562999999999997,1.3748,0.55700000000000005,4.4562999999999997,22.370799999999999,24.187100000000001,57.402299999999997,30.575199999999999]
["E9513","Compressor de ar portátil de 160,46 l/s (340 PCM) - 81 kW",288158.48190000001,19.210599999999999,5.1856999999999998,0,19.210599999999999,72.857100000000003,0,116.464,24.3963]
["E9514","Distribuidor de agregados sobre pneus autopropelido - 130 kW",907148.16830000002,51.837000000000003,15.9917,0,45.357399999999998,130.68770000000001,25.232399999999998,269.1062,93.061099999999996]
["E9515","Escavadeira hidráulica sobre esteiras com caçamba com capacidade de 1,56 m³ - 118 kW",1362317.0708000001,95.362200000000001,25.2165,0,95.362200000000001,81.163899999999998,25.232399999999998,322.3372,145.81110000000001]
["E9516","Perfuratriz hidráulica sobre esteiras - 283 kW",4918678.6040000003,327.9119,88.515699999999995,0,327.9119,149.7353,25.232399999999998,919.30719999999997,441.66]
["E9518","Grade de 24 discos rebocável de D = 60 cm (24\")",41526.743499999997,2.6696,0.73209999999999997,0,1.4831000000000001,0,0,4.8848000000000003,3.4016999999999999]
["E9519","Betoneira com motor a gasolina com capacidade de 600 l - 10 kW",37893.218999999997,3.0314999999999999,0.70140000000000002,0,2.2736000000000001,16.4147,20.2517,42.672899999999998,23.9846]
["E9521","Grupo gerador - 3,2 kVA",4000.2930000000001,0.2,7.0499999999999993E-2,0,0.1429,3.9020000000000001,0,4.3154000000000003,0.27050000000000002]
["E9522","Caldeira de asfalto rebocável com capacidade de 1.500 l - 6,5 kW",192155.60630000001,12.3529,3.3874,0,4.1176000000000004,4.8148,0,24.672699999999999,15.7403]
["E9523","Motoscraper - 304 kW",5797584.3909999998,272.82749999999999,99.948599999999999,0,306.93090000000001,257.35419999999999,25.232399999999998,962.29359999999997,398.00850000000003]
["E9524","Motoniveladora - 93 kW",1381068.6691000001,69.053399999999996,24.346299999999999,0,88.783000000000001,73.8095,25.232399999999998,281.22460000000001,118.63209999999999]
["E9525","Ponte rolante com capacidade de 15 t e vão de até 15 m - 20 kW",3187571.2513000001,127.5029,54.085099999999997,0,79.689300000000003,0,40.503399999999999,301.78070000000002,222.09139999999999]
["E9526","Retroescavadeira de pneus - capacidade da caçamba da pá-carregadeira de 0,76 m³ e da retroescavadeira de 0,29 m³ - 58 kW ",519980.72769999999,36.398699999999998,9.6248000000000005,0,36.398699999999998,39.894100000000002,25.232399999999998,147.5487,71.255899999999997]
["E9527","Martelete perfurador/rompedor a ar comprimido de 25 kg para rocha com capacidade de 2.040 gpm",20057.2906,1.6046,0.37130000000000002,0,1.6046,0,20.2517,23.8322,22.227599999999999]
["E9528","Empilhadeira a diesel com capacidade de 4 t - 60 kW",503667.22830000002,40.293399999999998,9.3229000000000006,0,35.256700000000002,47.619,20.2517,152.74369999999999,69.867999999999995]
["E9529","Jateador para estruturas metálicas com transportador a roletes - 22 kW",4043645.9978,269.57639999999998,72.768799999999999,0,202.1823,0,20.2517,564.77919999999995,362.59690000000001]
["E9530","Rolo compactador liso vibratório autopropelido por pneus de 11 t - 97 kW",698560.85710000002,46.570700000000002,12.571199999999999,0,46.570700000000002,82.116299999999995,25.232399999999998,213.06129999999999,84.374300000000005]
["E9532","Equipamento de solda MIG com acessórios - 14,6 kVA",72523.882700000002,5.8018999999999998,1.3424,0,5.8018999999999998,0,0,12.946199999999999,7.1443000000000003]
["E9535","Serra circular com bancada - D = 30 cm - 4 kW",7126.6947,0.64139999999999997,0.13189999999999999,0,0.35630000000000001,0,20.2517,21.3813,21.024999999999999]
["E9536","Embarcação de transporte de pessoal e apoio logístico - 30 kW",115360.7329,1.8025,0.67959999999999998,0,2.0028000000000001,56.278799999999997,33.040799999999997,93.804500000000004,35.5229]
["E9538","Conjunto vibratório para meio tubo de concreto com encaixe PB e 3 jogos de fôrmas - D = 0,30 m - 2,20 kW",16967.3923,2.2623000000000002,0.52339999999999998,0,1.6967000000000001,0,0,4.4824000000000002,2.7856999999999998]
["E9539","Equipamento de batimetria monofeixe",98040.315300000002,6.3026,1.7282999999999999,0,3.5013999999999998,0,27.181100000000001,38.7134,35.212000000000003]
["E9540","Trator sobre esteiras com lâmina - 127 kW",1055375.5212999999,41.042400000000001,18.088000000000001,0,58.631999999999998,94.073999999999998,25.232399999999998,237.06880000000001,84.362799999999993]
["E9541","Trator sobre esteiras com lâmina - 259 kW",4835525.6463000001,188.04820000000001,82.875500000000002,0,268.64030000000002,191.85169999999999,25.232399999999998,756.6481,296.15609999999998]
["E9543","Compressor de ar respirável para recarga de cilindros de mergulho com capacidade de até 35 MPa e 3,58 l/s - 5,52 kW",50734.763400000003,3.3822999999999999,0.91300000000000003,0,3.3822999999999999,0,0,7.6776,4.2953000000000001]
["E9544","Vassoura mecânica rebocável com largura de 2,44 m",73447.835399999996,6.6102999999999996,1.3594999999999999,0,4.4069000000000003,0,0,12.3767,7.9698000000000002]
["E9545","Vibroacabadora de asfalto sobre esteiras - 82 kW",1977609.9304,98.880499999999998,34.862400000000001,0,127.13209999999999,82.433800000000005,33.672499999999999,376.98129999999998,167.41540000000001]
["E9547","Máquina de solda elétrica transformadora 250 A - 9,20 kW",927.63570000000004,7.4200000000000002E-2,1.72E-2,0,7.4200000000000002E-2,0,0,0.1656,9.1399999999999995E-2]
["E9548","Bomba centrífuga com capacidade de 7,1 a 22 m³/h - 1,50 kW",2446.4767999999999,0.19570000000000001,4.53E-2,0,0.17130000000000001,0,0,0.4123,0.24099999999999999]
["E9551","Obturador mecânico simples com extensão de 12 m",5067.2129999999997,0.45600000000000002,9.3799999999999994E-2,0,0.25340000000000001,0,0,0.80320000000000003,0.54979999999999996]
["E9552","Nível ótico com capacidade de aumento de 32x",14214.053400000001,1.1371,0.2631,0,0.7107,0,0,2.1109,1.4001999999999999]
["E9553","Estação total eletrônica com alcance máximo de 3.000 m",32005.1675,2.8805000000000001,0.59240000000000004,0,1.6003000000000001,0,0,5.0731999999999999,3.4729000000000001]
["E9556","Compactador manual de placa vibratória - 3,00 kW",10349.074500000001,0.68989999999999996,0.1862,0,0.68989999999999996,4.9244000000000003,0,6.4904000000000002,0.87609999999999999]
["E9558","Tanque de estocagem de asfalto com capacidade de 30.000 l",698315.88879999996,29.096499999999999,10.0983,0,18.185300000000002,0,0,57.380099999999999,39.194800000000001]
["E9559","Aquecedor de fluido térmico - 12 kW",686511.59050000005,30.893000000000001,9.5305,0,20.595300000000002,9.5237999999999996,0,70.542599999999993,40.423499999999997]
["E9560","Ônibus com capacidade para 80 passageiros - 175 kW",1007612.1309,43.183399999999999,17.762799999999999,7.1971999999999996,64.775099999999995,175.92580000000001,20.778600000000001,329.62290000000002,88.921999999999997]
["E9561","GPS geodésico de simples frequência (L1)",27839.730299999999,2.2271999999999998,0.51529999999999998,0,1.3919999999999999,0,0,4.1345000000000001,2.7425000000000002]
["E9562","GPS geodésico de dupla frequência (L1/L2)",60182.544399999999,4.8146000000000004,1.1140000000000001,0,3.0091000000000001,0,0,8.9376999999999995,5.9286000000000003]
["E9563","Perfuratriz hidráulica sobre esteiras com clamshell - 220 kW",2873451.5586000001,191.5634,51.7102,0,191.5634,116.402,25.232399999999998,576.47140000000002,268.50599999999997]
["E9565","Trator sobre esteiras com lâmina e escarificador - 259 kW",4846312.2103000004,188.46770000000001,83.060400000000001,0,269.2396,191.85169999999999,25.232399999999998,757.85180000000003,296.76049999999998]
["E9566","Guindaste móvel sobre esteiras com clamshell de 1,9 m³ - 220 kW",4068836.7245999998,142.4093,69.037999999999997,0,203.4418,58.201000000000001,33.672499999999999,506.76260000000002,245.1198]
["E9567","Fresadora de piso de concreto - 6,7 kW",18851.728899999998,1.5081,0.34889999999999999,0,1.5081,10.9978,0,14.3629,1.857]
["E9568","Furadeira de impacto de 12,5 mm - 0,80 kW",1383.9978000000001,0.11070000000000001,2.5600000000000001E-2,0,6.9199999999999998E-2,0,0,0.20549999999999999,0.1363]
["E9569","Guindaste móvel sobre esteiras com clamshell de 4,6 m³ - 403 kW",6068489.8501000004,73.748999999999995,35.752499999999998,0,105.3557,106.61369999999999,67.344999999999999,388.8159,176.84649999999999]
["E9570","Furadeira com base magnética - 1,20 kW",6706.8353999999999,0.38319999999999999,0.1182,0,0.28739999999999999,0,0,0.78879999999999995,0.50139999999999996]
["E9574","Perfuratriz sobre esteiras - 145 kW",1962850.2349,130.85669999999999,35.323099999999997,0,130.85669999999999,115.0793,25.232399999999998,437.34820000000002,191.41220000000001]
["E9576","Escavadeira hidráulica de longo alcance sobre esteiras - 103 kW",1304940.4044999999,91.345799999999997,24.154399999999999,0,91.345799999999997,70.846500000000006,25.232399999999998,302.92489999999998,140.73259999999999]
["E9577","Trator agrícola sobre pneus - 77 kW",207206.18640000001,13.813700000000001,3.7288000000000001,0,12.087,73.333299999999994,20.2517,123.2145,37.794199999999996]
["E9578","Conjunto vibratório para meio tubo de concreto com encaixe PB e 3 jogos de fôrmas - D = 0,40 m - 2,20 kW",18148.112400000002,2.4197000000000002,0.55989999999999995,0,1.8148,0,0,4.7944000000000004,2.9796]
["E9580","Fresadora e distribuidora com controle de greide - 287 kW",2750784.6376,160.4624,49.502699999999997,0,229.2321,273.3331,33.672499999999999,746.20280000000002,243.63759999999999]
["E9581","Carregadeira de pneus para rocha com capacidade de 1,72 m³ - 113 kW",731052.51139999996,73.1053,14.4983,0,73.1053,113.59780000000001,25.232399999999998,299.53910000000002,112.836]
["E9583","Distribuidor de agregados rebocável com capacidade de 1,9 m³",82583.453800000003,7.4325000000000001,1.5286,0,4.9550000000000001,0,0,13.9161,8.9611000000000001]
["E9584","Carregadeira de pneus com capacidade de 1,72 m³ - 113 kW",731052.51139999996,51.173699999999997,13.5318,0,51.173699999999997,47.830599999999997,25.232399999999998,188.94220000000001,89.937899999999999]
["E9585","Motosserra com motor a gasolina - 2,30 kW",1840.8096,1.3806,0.1893,0,1.3806,3.7753999999999999,20.2517,26.977599999999999,21.8216]
["E9586","Régua vibratória dupla com 4 m - 4,10 kW",4805.4706999999999,0.4325,8.8900000000000007E-2,0,0.33639999999999998,6.73,0,7.5877999999999997,0.52139999999999997]
["E9587","Serra para corte de concreto - 4 kW",11794.1122,0.94350000000000001,0.21829999999999999,0,0.8256,6.5659000000000001,0,8.5533000000000001,1.1617999999999999]
["E9588","Vibroacabadora de concreto sobre esteiras com fôrmas deslizantes - 205 kW",4423019.1912000002,221.15100000000001,77.971500000000006,0,284.33690000000001,206.08449999999999,33.672499999999999,823.21640000000002,332.79500000000002]
["E9589","Máquina texturizadora e aplicadora de cura química em pavimento de concreto - 44,80 kW",1132493.1342,56.624699999999997,19.964200000000002,0,56.624699999999997,35.555500000000002,25.232399999999998,194.00149999999999,101.82129999999999]
["E9590","Central de concreto com capacidade de 40 m³/h - dosadora fixa",427477.84499999997,24.427299999999999,7.5358000000000001,0,21.373899999999999,0,33.672499999999999,87.009500000000003,65.635599999999997]
["E9591","Serra para corte de concreto e asfalto - 10 kW",18281.9948,1.4625999999999999,0.33839999999999998,0,1.2797000000000001,16.4147,0,19.4954,1.8009999999999999]
["E9593","Draga hopper com capacidade de 750 m³",118589703.78910001,926.48209999999995,666.91269999999997,0,2058.8490000000002,634.91999999999996,149.98670000000001,4437.1504999999997,1743.3815]
["E9594","Draga hopper com capacidade de 1.000 m³",130762798.697,1021.5844,735.37049999999999,0,2270.1875,761.904,171.9014,4960.9477999999999,1928.8562999999999]
["E9595","Draga hopper com capacidade de 2.000 m³",179455178.32870001,1401.9936,1009.2017,0,3115.5412999999999,1333.3320000000001,171.9014,7031.97,2583.0967000000001]
["E9596","Draga hopper com capacidade de 3.000 m³",228147557.96039999,1782.4028000000001,1283.0328999999999,0,3960.8951000000002,1904.76,306.8999,9237.9907000000003,3372.3355999999999]
["E9597","Draga hopper com capacidade de 4.000 m³",276839937.59200001,2162.8119999999999,1556.8642,0,4806.2488999999996,2476.1880000000001,352.53269999999998,11354.6458,4072.2089000000001]
["E9598","Draga hopper com capacidade de 5.000 m³",325532317.22350001,2543.2212,1830.6954000000001,0,5651.6027000000004,3047.616,352.53269999999998,13425.668,4726.4493000000002]
["E9599","Central de concreto com capacidade de 30 m³/h - dosadora RS",279679.51329999999,15.9817,4.9303999999999997,0,13.984,0,33.672499999999999,68.568600000000004,54.584600000000002]
["E9601","Embarcação de transporte de pessoal e apoio logístico - 130 kW",520299.04350000003,8.1296999999999997,3.0653000000000001,0,9.0329999999999995,243.87479999999999,33.040799999999997,297.14359999999999,44.235799999999998]
["E9603","Embarcação empurradora multipropósito com guindaste hidráulico de 74 kN.m - 165 kW",2163220.2790999999,28.166899999999998,12.551500000000001,0,62.593200000000003,165.87289999999999,123.2719,392.45639999999997,163.99029999999999]
["E9606","Embarcação rebocadora - 2 x 268 kW",1136713.9790000001,14.801,6.5955000000000004,0,32.890999999999998,539.84069999999997,123.2719,717.40009999999995,144.66839999999999]
["E9607","Conjunto de britagem para rachão com capacidade de 80 m³/h - 224 kW",2539275.9062999999,145.10149999999999,44.763800000000003,0,108.8261,0,33.672499999999999,332.3639,223.5378]
["E9609","Draga de sucção para extração de areia com tubo de descarga de 150 mm - 100 kW",648289.03419999999,5.0648,3.6457999999999999,0,11.255000000000001,79.364999999999995,35.689500000000002,135.02010000000001,44.400100000000002]
["E9610","Compressor de ar portátil de 42,48 l/s (90 PCM) - 18,50 kW",114629.46769999999,7.6420000000000003,2.0629,0,7.6420000000000003,16.6402,0,33.987099999999998,9.7049000000000003]
["E9611","Conjunto de britagem com capacidade de 80 m³/h - 313 kW",9041925.5063000005,516.68150000000003,159.39619999999999,0,387.5111,0,33.672499999999999,1097.2612999999999,709.75019999999995]
["E9612","Plataforma flutuante montada na obra de 12 x 24 x 1,8 m com capacidade de 150 t",731336.85589999997,5.7135999999999996,4.1128,0,9.5226000000000006,0,43.8294,63.178400000000003,53.655799999999999]
["E9613","Guindaste móvel sobre esteiras com pinça com capacidade de 40 t - 186 kW",7206338.1469999999,252.2218,122.2735,0,360.31689999999998,49.206299999999999,33.672499999999999,817.69100000000003,408.1678]
["E9614","Bomba com capacidade de 136 m³/h e câmara de vácuo - 5,60 kW",9785.5702999999994,0.78280000000000005,0.18110000000000001,0,0.68500000000000005,0,0,1.6489,0.96389999999999998]
["E9615","Usina misturadora de solos com capacidade de 300 t/h - 44 kW",1486578.2241,84.947299999999998,26.206299999999999,0,74.328900000000004,0,25.232399999999998,210.7149,136.386]
["E9617","Usina misturadora de pré-misturado a frio com capacidade de 60 t/h - 23,50 kW",230627.6691,13.178699999999999,4.0655999999999999,0,11.5314,0,25.232399999999998,54.008099999999999,42.476700000000001]
["E9618","Batelão autopropelido com capacidade de 300 m³ - 224 kW",21928803.1019,171.31880000000001,123.321,0,380.70839999999998,71.111000000000004,99.553799999999995,846.01300000000003,394.1936]
["E9619","Batelão autopropelido com capacidade de 500 m³ - 373 kW",26901506.600200001,210.16800000000001,151.2859,0,467.04,118.4126,99.553799999999995,1046.4603,461.0077]
["E9620","Pontão flutuante de 15 x 30 x 1,8 m com capacidade de 500 t",3609501.5441999999,28.199200000000001,20.2987,0,46.998699999999999,0,21.9147,117.4113,70.412599999999998]
["E9621","Bomba de injeção de argamassa e nata com capacidade de 1,08 m³/h (18 l/min) e misturador com tambor de 0,100 m³ - 6,20 kW",45175.7739,3.6141000000000001,0.83620000000000005,0,3.6141000000000001,0,20.2517,28.316099999999999,24.702000000000002]
["E9622","Máquina de bancada universal para corte de chapa - 1,50 kW",94988.0717,5.4279000000000002,1.6745000000000001,0,4.0709,0,0,11.173299999999999,7.1024000000000003]
["E9623","Máquina de bancada guilhotina - 4,00 kW",127704.5757,7.2973999999999997,2.2511999999999999,0,5.4730999999999996,0,0,15.021699999999999,9.5486000000000004]
["E9624","Draga hopper com capacidade de 10.000 m³",568994215.38170004,4445.2673000000004,3199.8516,0,9878.3718000000008,5206.3440000000001,474.00119999999998,23203.835899999998,8119.1201000000001]
["E9625","Draga hopper com capacidade de 15.000 m³",812456113.53980005,6347.3134,4569.0078000000003,0,14105.1409,7492.0559999999996,496.50240000000002,33010.020499999999,11412.8236]
["E9626","Draga hopper com capacidade de 20.000 m³",1055918011.6978,8249.3595000000005,5938.1638999999996,0,18331.909899999999,9841.26,518.4171,42879.110399999998,14705.940500000001]
["E9627","Embarcação hotel com capacidade para 15 pessoas - 199 kW",2371026.6025999999,24.6982,11.005800000000001,0,54.884900000000002,200.05269999999999,45.632800000000003,336.27440000000001,81.336799999999997]
["E9628","Fábrica de pré-moldado de concreto para balizador - 2,20 kW",14573.084199999999,1.9431,0.4496,0,1.4573,0,0,3.85,2.3927]
["E9629","Compressor de ar portátil de 185,95 l/s (394 PCM) - 81,50 kW",302304.09960000002,20.153600000000001,5.4401999999999999,0,20.153600000000001,73.306799999999996,0,119.05419999999999,25.593800000000002]
["E9630","Bomba submersível com capacidade de 75 m³/h - 3,6 kW",4480.4700999999995,0.3584,8.2900000000000001E-2,0,0.31359999999999999,0,0,0.75490000000000002,0.44130000000000003]
["E9631","Bomba para concreto projetado via seca com capacidade de 6 m³/h - 7,5 kW",230990.97210000001,18.479299999999999,4.2755999999999998,0,16.1694,0,33.672499999999999,72.596800000000002,56.427399999999999]
["E9632","Conjunto vibratório para tubos de concreto com encaixe PB e 3 jogos de fôrmas - D = 0,20 m - 2,20 kW",51294.257299999997,6.8391999999999999,1.5824,0,5.1294000000000004,0,0,13.551,8.4215999999999998]
["E9633","Conjunto vibratório para tubos de concreto com encaixe PB e 3 jogos de fôrmas - D = 0,30 m - 2,20 kW",58867.152199999997,7.8490000000000002,1.8161,0,5.8867000000000003,0,0,15.5518,9.6651000000000007]
["E9634","Conjunto vibratório para tubos de concreto com encaixe PB e 3 jogos de fôrmas - D = 0,40 m - 2,20 kW",64770.752999999997,8.6361000000000008,1.9982,0,6.4771000000000001,0,0,17.1114,10.6343]
["E9635","Draga de sucção e recalque com potência da bomba de 294 kW e cortador de 30 kW",4412897.8015999999,34.4758,24.816800000000001,0,76.612799999999993,233.3331,57.604199999999999,426.84269999999998,116.8968]
["E9636","Draga de sucção e recalque com potência da bomba de 483 kW e cortador de 55 kW",7433577.9988000002,58.074800000000003,41.804200000000002,0,129.05520000000001,383.33300000000003,57.604199999999999,669.87139999999999,157.48320000000001]
["E9637","Draga de sucção e recalque com potência da bomba de 746 kW e cortador de 110 kW",13983419.3641,109.24550000000001,78.638499999999993,0,242.76769999999999,592.06290000000001,79.518900000000002,1102.2335,267.40289999999999]
["E9638","Draga de sucção e recalque com potência da bomba de 1.350 kW e cortador de 170 kW",21371219.2141,166.96270000000001,120.1853,0,371.02809999999999,1071.4275,79.518900000000002,1809.1224999999999,366.6669]
["E9639","Embarcação hotel com capacidade para 30 pessoas - 2 x 112 kW",3784124.216,39.417999999999999,17.565100000000001,0,87.595500000000001,225.185,123.2719,493.03550000000001,180.255]
["E9640","Compressor de ar portátil de 33,51 l/s (71 PCM) - 14 kW",92178.998500000002,6.1452999999999998,1.6588000000000001,0,6.1452999999999998,12.592599999999999,0,26.542000000000002,7.8041]
["E9641","Compressor de ar portátil de 75,04 l/s (159 PCM) - 33 kW",138446.6807,9.2297999999999991,2.4914999999999998,0,9.2297999999999991,29.682500000000001,0,50.633600000000001,11.721299999999999]
["E9642","Perfuratriz hidráulica sobre esteiras para estaca raiz - 56 kW",1477714.551,98.514300000000006,26.592700000000001,0,98.514300000000006,29.6296,25.232399999999998,278.48329999999999,150.33940000000001]
["E9643","Equipamento para pintura a ar comprimido de pistola com caneca com capacidade de 1.000 ml e compressor de 1,50 kW",3037.6826000000001,0.27339999999999998,5.62E-2,0,0.15190000000000001,0,0,0.48149999999999998,0.3296]
["E9646","Compressor de ar portátil de 58,52 l/s (124 PCM) - 27 kW",134455.4773,8.9636999999999993,2.4196,0,8.9636999999999993,24.285699999999999,0,44.6327,11.3833]
["E9647","Compactador manual com soquete vibratório - 4,10 kW",13505.653,0.90039999999999998,0.24299999999999999,0,0.90039999999999998,6.73,0,8.7737999999999996,1.1434]
["E9648","Compressor de ar portátil de 422,86 l/s (896 PCM) - 213 kW",658062.04559999995,43.870800000000003,11.8424,0,43.870800000000003,191.58709999999999,0,291.17110000000002,55.713200000000001]
["E9649","Compressor de ar portátil de 94,39 l/s (200 PCM) - 36 kW",163167.47010000001,10.877800000000001,2.9363000000000001,0,10.877800000000001,32.380899999999997,0,57.072800000000001,13.8141]
["E9651","Guindaste móvel sobre esteiras com Hammer Grab - 186 kW",4097237.4150999999,143.4033,69.519900000000007,0,204.86189999999999,49.206299999999999,33.672499999999999,500.66390000000001,246.59569999999999]
["E9652","Compressor de ar portátil de 540,85 l/s (1.146 PCM) - 331,10 kW",913864.25630000001,60.924300000000002,16.445699999999999,0,60.924300000000002,297.81450000000001,0,436.10879999999997,77.37]
["E9653","Guindaste móvel sobre esteiras com trado para escavação em solos - 186 kW",5510898.5789999999,192.88149999999999,93.506200000000007,0,275.54489999999998,49.206299999999999,33.672499999999999,644.81140000000005,320.06020000000001]
["E9654","Guindaste móvel sobre esteiras com trado com bits escavação em rocha - 186 kW",5510898.5789999999,192.88149999999999,93.506200000000007,0,275.54489999999998,49.206299999999999,33.672499999999999,644.81140000000005,320.06020000000001]
["E9656","Guindaste móvel sobre esteiras com caçamba para escavação em solos - 186 kW",5493890.0307999998,192.28620000000001,93.217600000000004,0,274.69450000000001,49.206299999999999,33.672499999999999,643.07709999999997,319.17630000000003]
["E9657","Guindaste móvel sobre esteiras com caçamba para escavação em rocha - 186 kW",5493890.0307999998,192.28620000000001,93.217600000000004,0,274.69450000000001,49.206299999999999,33.672499999999999,643.07709999999997,319.17630000000003]
["E9660","Guindaste móvel sobre esteiras com capacidade de 40 t - 186 kW",3570745.0583000001,124.9761,60.586599999999997,0,178.53729999999999,49.206299999999999,33.672499999999999,446.97879999999998,219.23519999999999]
["E9661","Compressor de ar portátil de 89,67 l/s (190 PCM) - 36 kW",146022.6845,9.7347999999999999,2.6278000000000001,0,9.7347999999999999,32.380899999999997,0,54.478299999999997,12.3626]
["E9662","Equipamento para solda e corte com oxiacetileno",5947.2030000000004,0.4758,0.1101,0,0.4758,0,0,1.0617000000000001,0.58589999999999998]
["E9664","Guindaste móvel sobre esteiras com capacidade de 80 t - 212 kW",6111867.2423,213.91540000000001,103.70310000000001,0,305.59339999999997,56.084600000000002,33.672499999999999,712.96900000000005,351.291]
["E9668","Mesa vibratória - 2,20 kW",13691.5015,1.8254999999999999,0.4224,0,1.3692,0,0,3.6171000000000002,2.2479]
["E9671","Compressor de ar portátil de 363,87 l/s (771 PCM) - 158,13 kW",560677.86629999999,37.378500000000003,10.0899,0,37.378500000000003,142.23320000000001,0,227.08009999999999,47.468400000000003]
["E9673","Equipamento de batimetria multifeixe",1906349.0153000001,61.275500000000001,16.803100000000001,0,68.0839,0,54.362200000000001,200.5247,132.4408]
["E9674","Equipamento de medição de descarga líquida com ADCP",391819.01530000003,12.594200000000001,3.4535999999999998,0,13.993499999999999,0,54.362200000000001,84.403499999999994,70.41]
["E9675","Martelete perfurador/rompedor elétrico - 1,50 kW",5211.4501,0.41689999999999999,9.6500000000000002E-2,0,0.41689999999999999,0,0,0.93030000000000002,0.51339999999999997]
["E9676","Embarcação de transporte de pessoal e apoio logístico - 90 kW",493768.73930000002,7.7150999999999996,2.9089999999999998,0,8.5724,168.8364,33.040799999999997,221.0737,43.664900000000003]
["E9677","Martelete perfurador/rompedor a ar comprimido de 10 kg com capacidade de 1.800 gpm",13023.657300000001,1.0419,0.24110000000000001,0,1.0419,0,20.2517,22.576599999999999,21.534700000000001]
["E9678","Fresadora a frio - 410 kW",5749789.2873999998,335.40440000000001,103.4722,0,479.14909999999998,390.47579999999999,33.672499999999999,1342.174,472.54910000000001]
["E9681","Rolo compactador liso tandem vibratório autopropelido de 10,4 t - 82 kW",780294.62829999998,52.019599999999997,14.0421,0,52.019599999999997,117.1427,25.232399999999998,260.45639999999997,91.2941]
["E9682","Rolo compactador liso tandem vibratório autopropelido de 1,6 t - 18 kW",263891.26380000002,17.5928,4.7488999999999999,0,17.5928,25.714300000000001,25.232399999999998,90.881200000000007,47.574100000000001]
["E9683","Martelete perfurador/rompedor elétrico - 0,90 kW",4979.9799999999996,0.39839999999999998,9.2200000000000004E-2,0,0.39839999999999998,0,0,0.88900000000000001,0.49059999999999998]
["E9684","Veículo leve picape 4 x 4 com capacidade de 1,10 t - 147 kW",327457.07709999999,19.647400000000001,6.0612000000000004,2.4559000000000002,19.647400000000001,38.8889,24.187100000000001,110.8879,52.351599999999998]
["E9685","Rolo compactador pé de carneiro vibratório autopropelido por pneus de 11,6 t - 82 kW",638477.58050000004,42.565199999999997,11.4899,0,42.565199999999997,69.417900000000003,25.232399999999998,191.2706,79.287499999999994]
["E9689","Usina de asfalto a quente gravimétrica com capacidade de 100/140 t/h - 260 kW",8097863.9133000001,404.89319999999998,142.75380000000001,0,520.577,0,33.672499999999999,1101.8965000000001,581.31949999999995]
["E9691","Guincho tracionador de cordoalhas - 7,50 kW",391507.9106,31.320599999999999,7.2468000000000004,0,19.575399999999998,0,20.2517,78.394499999999994,58.819099999999999]
["E9692","Caldeira para aquecimento e injeção de cera - 1 kW",108544.43799999999,6.9779,1.9135,0,2.3260000000000001,0,20.2517,31.469100000000001,29.1431]
["E9694","Misturador de argamassa de alta turbulência com capacidade de 220 l - 13 kW",25170.1623,2.0135999999999998,0.46589999999999998,0,1.7619,0,20.2517,24.493099999999998,22.731200000000001]
["E9697","Minicarregadeira de pneus com vassoura de 1,8 m - 45,50 kW",380203.57209999999,26.6143,7.0376000000000003,0,26.6143,60.185099999999998,25.232399999999998,145.68369999999999,58.884300000000003]
["E9699","Trituradora de galhos e troncos rebocável com capacidade de até 350 mm de diâmetro com guincho - 96,94 kW",389161.76520000002,43.780700000000003,13.5063,0,48.645200000000003,76.936400000000006,20.2517,203.12029999999999,77.538700000000006]
["E9700","Fresadora a frio - 155 kW",2922494.9174000002,170.47890000000001,52.592700000000001,0,243.5412,147.6189,33.672499999999999,647.90419999999995,256.7441]
["E9701","Jateador pressurizado multiabrasivo com capacidade de 280 l",24481.330699999999,2.2033,0.4531,0,2.2033,0,20.2517,25.1114,22.908100000000001]
["E9703","Fábrica de pré-moldado de concreto para mourão - 2,20 kW",14573.084199999999,1.9431,0.4496,0,1.4573,0,0,3.85,2.3927]
["E9704","Batelão sem propulsão montado na obra com capacidade de 66 m³",244526.3983,1.9104000000000001,1.3751,0,3.1839,0,21.9147,28.3841,25.200199999999999]
["E9705","Misturador de lama bentonítica - 4 kW",15772.052299999999,1.2618,0.29189999999999999,0,1.1040000000000001,0,20.2517,22.909400000000002,21.805399999999999]
["E9706","Martelete perfurador/rompedor a ar comprimido de 28 kg para concreto com capacidade de 1.230 gpm",17975.615300000001,1.4379999999999999,0.3327,0,1.4379999999999999,0,20.2517,23.4604,22.022400000000001]
["E9707","Desarenador - 15 kW",14614.7192,1.1692,0.27050000000000002,0,1.1692,0,20.2517,22.860600000000002,21.691400000000002]
["E9708","Microtrator com roçadeira - 10 kW",51044.307999999997,3.403,0.91859999999999997,0,2.9775999999999998,7.9364999999999997,20.2517,35.487400000000001,24.5733]
["E9710","Socadora automática de linha - 253 kW",31911376.857299998,1276.4550999999999,541.45630000000006,0,1276.4550999999999,160.63480000000001,67.344999999999999,3322.3463000000002,1885.2564]
["E9712","Reguladora e distribuidora de lastro - 300 kW",15967078.826300001,638.68320000000006,270.92140000000001,0,638.68320000000006,190.476,67.344999999999999,1806.1088,976.94960000000003]
["E9714","Bate-estaca com martelo hidráulico - 450 kW",3259431.0003999998,186.25319999999999,57.459099999999999,0,139.68989999999999,309.52350000000001,25.232399999999998,718.15809999999999,268.94470000000001]
["E9716","Conjunto bomba e macaco hidráulico para protensão com capacidade de 590 kN - 3,70 kW",15413.19,0.88080000000000003,0.2717,0,0.88080000000000003,0,33.672499999999999,35.705800000000004,34.825000000000003]
["E9717","Máquina policorte - 2,20 kW",958.79600000000005,8.6300000000000002E-2,1.77E-2,0,4.7899999999999998E-2,0,0,0.15190000000000001,0.104]
["E9718","Pórtico duplo de descarga e posicionamento de dormente - 89 kW",9743695.2733999994,389.74779999999998,165.3261,0,292.3109,56.507899999999999,67.344999999999999,971.23770000000002,622.41890000000001]
["E9719","Talha manual com capacidade de 3 t",6640.6422000000002,0.2656,0.11269999999999999,0,0.16600000000000001,0,0,0.54430000000000001,0.37830000000000003]
["E9720","Conjunto bomba e macaco hidráulico para protensão com capacidade de 250 kN - 3,70 kW",12184.551600000001,0.69630000000000003,0.21479999999999999,0,0.69630000000000003,0,33.672499999999999,35.279899999999998,34.583599999999997]
["E9721","Conjunto bomba e macaco hidráulico para protensão com capacidade de 1.150 kN - 5 kW",25317.885999999999,1.4467000000000001,0.44629999999999997,0,1.4467000000000001,0,33.672499999999999,37.0122,35.5655]
["E9722","Conjunto bomba e macaco hidráulico para protensão com capacidade de 2.000 kN - 5 kW",40392.463000000003,2.3081,0.71209999999999996,0,2.3081,0,33.672499999999999,39.000799999999998,36.692700000000002]
["E9723","Conjunto bomba e macaco hidráulico para protensão com capacidade de 2.500 kN - 7 kW",47766.433700000001,2.7294999999999998,0.84209999999999996,0,2.7294999999999998,0,33.672499999999999,39.973599999999998,37.244100000000003]
["E9724","Conjunto bomba e macaco hidráulico para protensão com capacidade de 4.000 kN - 10 kW",51073.646399999998,2.9184999999999999,0.90039999999999998,0,2.9184999999999999,0,33.672499999999999,40.4099,37.491399999999999]
["E9725","Conjunto bomba e macaco hidráulico para protensão com capacidade de 5.400 kN - 10 kW",54804.71,3.1316999999999999,0.96609999999999996,0,3.1316999999999999,0,33.672499999999999,40.902000000000001,37.770299999999999]
["E9726","Bate-estaca Strauss - 15 kW",143153.7335,8.1801999999999992,2.5236000000000001,0,6.1352000000000002,10.317500000000001,25.232399999999998,52.3889,35.936199999999999]
["E9727","Posicionadora de trilhos - 7,40 kW",556626.61410000001,31.807200000000002,9.8125,0,27.831299999999999,4.6984000000000004,0,74.1494,41.619700000000002]
["E9728","Tirefonadora/parafusadora portátil - 3,10 kW",51320.1731,4.1055999999999999,0.94989999999999997,0,4.1055999999999999,4.0708000000000002,0,13.2319,5.0555000000000003]
["E9729","Equipamento para pintura eletrostática com cabine simples de 5,50 kW e estufa de 2x120.000 kCal",151157.98509999999,11.5168,3.1088,0,11.5168,0,0,26.142399999999999,14.6256]
["E9730","Grupo vibrador com gerador - 2,80 kW",70224.706300000005,3.5112000000000001,1.238,0,2.508,3.6768999999999998,0,10.934100000000001,4.7492000000000001]
["E9731","Máquina de furar dormente portátil - 1,50 kW",67884.240099999995,5.4306999999999999,1.2565,0,5.4306999999999999,1.9698,0,14.0877,6.6871999999999998]
["E9732","Máquina para furar dormente - 6,70 kW",77850.701700000005,6.2281000000000004,1.4410000000000001,0,6.2281000000000004,8.7982999999999993,0,22.695499999999999,7.6691000000000003]
["E9733","Máquina tirefonadora e parafusadora - 6,70 kW",80969.405700000003,6.4775999999999998,1.4986999999999999,0,6.4775999999999998,8.7982999999999993,0,23.252199999999998,7.9763000000000002]
["E9734","Bomba projetora de argamassa com capacidade de 2 m³/h - 5,50 kW",176512.42980000001,14.121,3.2671999999999999,0,12.3559,0,20.2517,49.995800000000003,37.639899999999997]
["E9735","Máquina para serrar trilho - 5,00 kW",25389.744699999999,2.0312000000000001,0.47,0,2.0312000000000001,6.5659000000000001,0,11.0983,2.5011999999999999]
["E9736","Máquina para furar trilho - 1,20 kW",42883.550999999999,3.4306999999999999,0.79379999999999995,0,3.4306999999999999,1.5758000000000001,0,9.2309999999999999,4.2244999999999999]
["E9737","Conjunto para pré-aquecimento de trilho em solda aluminotérmica",3730.5823999999998,0.2984,6.9099999999999995E-2,0,0.2984,0,0,0.66590000000000005,0.36749999999999999]
["E9738","Máquina de esmerilhar topo e lateral de boleto - 5,20 kW",83674.587299999999,6.694,1.5488,0,6.694,6.8285,0,21.7653,8.2428000000000008]
["E9742","Trator agrícola sobre pneus com roçadeira articulada e capacidade de 1,12 m - 77 kW",470015.63919999998,31.334399999999999,8.4582999999999995,0,27.4176,73.333299999999994,20.2517,160.7953,60.044400000000003]
["E9745","Trator agrícola sobre pneus com roçadeira de arraste e capacidade de 1,50 m - 77 kW",229223.8579,15.281599999999999,4.1250999999999998,0,13.3714,73.333299999999994,20.2517,126.3631,39.6584]
["E9746","Conjunto bomba e prensa para luva de emenda de 25 mm",25557.0131,2.0446,0.47310000000000002,0,1.2779,0,20.2517,24.0473,22.769400000000001]
["E9747","Conjunto bomba e prensa para luva de emenda de 32 mm",26834.8547,2.1467999999999998,0.49669999999999997,0,1.3416999999999999,0,20.2517,24.236899999999999,22.895199999999999]
["E9748","Rosqueadeira para rosca cônica - 0,75 kW",6214.5235000000002,0.35510000000000003,0.1096,0,0.35510000000000003,0,20.2517,21.0715,20.7164]
["E9749","Jateador portátil multiabrasivo com capacidade de 300 kg",7635.3765999999996,0.68720000000000003,0.14130000000000001,0,0.68720000000000003,0,20.2517,21.767399999999999,21.080200000000001]
["E9750","Bomba de injeção de argamassa com capacidade de 50 l/min",37993.174500000001,3.0394999999999999,0.70330000000000004,0,2.6595,0,0,6.4023000000000003,3.7427999999999999]
["E9753","Grupo gerador - 23 kVA",80810.572199999995,4.0404999999999998,1.4246000000000001,0,2.8860999999999999,18.095199999999998,0,26.446400000000001,5.4650999999999996]
["E9754","Grupo gerador - 68 kVA",111700,5.585,1.9691000000000001,0,3.9893000000000001,54.285699999999999,0,65.829099999999997,7.5541]
["E9755","Bomba de alta pressão para jet grouting de até 45 MPa - 150 kW",1534311.3345999999,122.7449,28.400099999999998,0,122.7449,150.79349999999999,20.2517,444.93509999999998,171.39670000000001]
["E9756","Calandra para chapas de aço até 25 mm - 22 kW",825129.28780000005,33.005200000000002,14.000400000000001,0,28.8795,0,20.2517,96.136799999999994,67.257300000000001]
["E9758","Vibroacabadora de asfalto sobre pneus - 82 kW",1541825.1534,88.104299999999995,27.180199999999999,0,99.1173,82.433800000000005,33.672499999999999,330.50810000000001,148.95699999999999]
["E9760","Perfuratriz manual para coroa diamantada - 1,60 kW",16232.326499999999,1.2986,0.30049999999999999,0,1.2986,0,0,2.8976999999999999,1.5991]
["E9761","Guincho de coluna com capacidade de 200 kg - 0,92 kW",3898.0511000000001,0.31180000000000002,7.22E-2,0,0.2339,0,0,0.6179,0.38400000000000001]
["E9762","Rolo compactador de pneus autopropelido de 27 t - 85 kW",1037732.3983999999,69.182199999999995,18.674900000000001,0,69.182199999999995,58.465600000000002,25.232399999999998,240.7373,113.0895]
["E9763","Grupo gerador - 40 kVA",106425.8585,5.3212999999999999,1.8761000000000001,0,3.8008999999999999,32.1693,0,43.1676,7.1974]
["E9764","Grupo gerador - 7,2 kVA",7572.8838999999998,0.37859999999999999,0.13350000000000001,0,0.27050000000000002,8.7795000000000005,0,9.5620999999999992,0.5121]
["E9765","Grupo gerador - 569 kVA",454540.40629999997,22.727,8.0129000000000001,0,16.233599999999999,457.40699999999998,0,504.38049999999998,30.739899999999999]
["E9766","Prensa hidráulica para fabricação de blocos pré-moldados - 20 kW",382489.58669999999,25.954699999999999,6.7427000000000001,0,21.8565,0,20.2517,74.805599999999998,52.949100000000001]
["E9767","Compressor de ar portátil de 9,44 l/s (20 PCM) a gasolina - 5,22 kW",9443.2091,0.62949999999999995,0.1699,0,0.62949999999999995,8.5684000000000005,0,9.9972999999999992,0.7994]
["E9768","Compressor de ar portátil de 373,78 l/s (792 PCM) - 213,30 kW",562091.18319999997,37.472700000000003,10.1153,0,37.472700000000003,191.857,0,276.91770000000002,47.588000000000001]
["E9769","Cunha hidráulica com três cilindros e acessórios com capacidade de 3.000 kN - 5,60 kW",251983.58129999999,20.1587,4.6642000000000001,0,20.1587,5.6295999999999999,20.2517,70.862899999999996,45.074599999999997]
["E9770","Retroescavadeira de pneus com caçamba de escavação trapezoidal ou triangular com seção de corte inferior a 0,10 m² - 58 kW",519980.72769999999,36.398699999999998,9.6248000000000005,0,36.398699999999998,39.894100000000002,25.232399999999998,147.5487,71.255899999999997]
["E9771","Retroescavadeira de pneus com caçamba de escavação trapezoidal ou triangular com seção de corte de 0,10 a 0,15 m² - 58 kW",519980.72769999999,36.398699999999998,9.6248000000000005,0,36.398699999999998,39.894100000000002,25.232399999999998,147.5487,71.255899999999997]
["E9772","Retroescavadeira de pneus com caçamba de escavação trapezoidal ou triangular com seção de corte de 0,15 a 0,20 m² - 58 kW",519980.72769999999,36.398699999999998,9.6248000000000005,0,36.398699999999998,39.894100000000002,25.232399999999998,147.5487,71.255899999999997]
["E9773","Retroescavadeira de pneus com caçamba de escavação trapezoidal ou triangular com seção de corte de 0,20 a 0,30 m² - 58 kW",519980.72769999999,36.398699999999998,9.6248000000000005,0,36.398699999999998,39.894100000000002,25.232399999999998,147.5487,71.255899999999997]
["E9774","Retroescavadeira de pneus com caçamba de escavação trapezoidal ou triangular com seção de corte de 0,30 a 0,50 m² - 58 kW",519980.72769999999,36.398699999999998,9.6248000000000005,0,36.398699999999998,39.894100000000002,25.232399999999998,147.5487,71.255899999999997]
["E9775","Escavadeira hidráulica com martelo hidráulico de 1.700 kg - 103 kW",2274140.7423999999,259.90179999999998,45.101100000000002,0,324.87720000000002,70.846500000000006,25.232399999999998,725.95899999999995,330.2353]
["E9776","Grupo gerador - 174 kVA",189188.47570000001,9.4594000000000005,3.3351000000000002,0,6.7567000000000004,139.7353,0,159.28649999999999,12.794499999999999]
["E9777","Extrusora de barreira de concreto - 74 kW",4605957.4062999999,322.41699999999997,85.256299999999996,0,414.53620000000001,58.7301,25.232399999999998,906.17200000000003,432.90570000000002]
["E9778","Grupo gerador - 338 kVA",259621.75150000001,12.9811,4.5768000000000004,0,9.2721999999999998,271.42829999999998,0,298.25839999999999,17.5579]
["E9779","Grupo gerador - 113 kVA",125420.3515,6.2709999999999999,2.2109999999999999,0,4.4793000000000003,90.476100000000002,0,103.4374,8.4819999999999993]
["E9780","Misturador automático para grauteamento com capacidade de 20 m³/h - 7 kW",246106.54310000001,19.688500000000001,4.5553999999999997,0,19.688500000000001,7.0369999999999999,20.2517,71.221100000000007,44.495600000000003]
["E9781","Misturador com bomba para grauteamento tipo Flex E ou similar - 25 kW",462754.26799999998,37.020299999999999,8.5655999999999999,0,37.020299999999999,0,20.2517,102.8579,65.837599999999995]
["E9782","Perfuratriz pneumática com avanço de coluna de 33,5 kg com capacidade de 2.280 gpm",37986.982000000004,3.0390000000000001,0.70309999999999995,0,3.0390000000000001,0,20.2517,27.032800000000002,23.9938]
["E9784","Plataforma autopropelida com alcance de 12 m com capacidade de 700 kg - 24 kW",579120.8297,38.6081,10.421799999999999,0,38.6081,19.047599999999999,20.2517,126.93729999999999,69.281599999999997]
["E9785","Guindaste móvel sobre pneus com 2 eixos com capacidade máxima de 55 t - 186 kW",2267772.8333000001,113.3886,39.977600000000002,16.198399999999999,145.78540000000001,49.206299999999999,22.709800000000001,387.26609999999999,192.27440000000001]
["E9788","Misturador de argamassa com capacidade de 0,250 m³ - 3,70 kW",17232.8478,1.3786,0.31900000000000001,0,1.3786,3.7195999999999998,20.2517,27.047499999999999,21.949300000000001]
["E9789","Carro manual modelo plataforma de 150 x 80 cm com capacidade de 800 kg",2195.1839,0.39510000000000001,8.1299999999999997E-2,0,0.2195,0,0,0.69589999999999996,0.47639999999999999]
["E9790","Bomba para concreto projetado via úmida com capacidade de 10 m³/h - 14,70 kW",280696.1777,22.4557,5.1957000000000004,0,22.4557,14.777799999999999,33.672499999999999,98.557400000000001,61.323900000000002]
["E9791","Bomba pneumática para injeção de resina com capacidade de 0,18 m³/h",47618.468500000003,3.8094999999999999,0.88139999999999996,0,3.3332999999999999,0,0,8.0242000000000004,4.6909000000000001]
["E9793","Robot para concreto projetado com capacidade de 30 m³/h - 70 kW - com compressor diesel",7248260.6063000001,579.86080000000004,134.1653,0,579.86080000000004,70.3703,33.672499999999999,1397.9296999999999,747.69860000000006]
["E9795","Perfuratriz de superfície sobre pneus com martelo de topo e controle remoto via rádio - 60 kW",1430894.6928000001,95.393000000000001,25.7501,0,95.393000000000001,47.619,25.232399999999998,289.38749999999999,146.37549999999999]
["E9797","Jumbo eletro-hidráulico com 3 braços - 155 kW/237 kW",12060003.819800001,804.00030000000004,217.02979999999999,0,1005.0003,172.22210000000001,33.672499999999999,2231.9250000000002,1054.7026000000001]
["E9798","Perfuratriz hidráulica rotopercussiva - 123 kW",1538847.7978999999,102.5899,27.692799999999998,0,102.5899,97.619,25.232399999999998,355.72399999999999,155.51509999999999]
["E9013","Caminhão tanque de asfalto com capacidade de 31.000 l - 265 kW",{"$nulls":7},431.59410000000003,96.421300000000002]
["A9335","Cavalo mecânico estradeiro 6 x 2, PBT 23.000 kg - 265 kW - condição de trabalho severa - motorista de caminhão",896018.97089999996,38.400799999999997,15.795500000000001,6.4001000000000001,57.601199999999999,266.40190000000001,20.778600000000001,405.37810000000002,81.375]
["A9364","Tanque isotérmico de asfalto com capacidade de 31.000 l",279242.22100000002,11.169700000000001,3.8765999999999998,0,11.169700000000001,0,0,26.216000000000001,15.0463]
["E9018","Cavalo mecânico com dolly intermediário e semirreboque de 4 eixos com capacidade de 53 t - 323 kW",{"$nulls":7},521.58699999999999,162.22020000000001]
["A9324","Cavalo mecânico estradeiro 6 x 4, PBT 23.000 kg - 323 kW - motorista de veículo especial",1143870.2224000001,49.023000000000003,20.1648,8.1705000000000005,73.534499999999994,239.25899999999999,22.709800000000001,412.86160000000001,100.0681]
["A9355","Semirreboque com 4 eixos",516545,34.436300000000003,17.263400000000001,0,38.740900000000003,0,0,90.440600000000003,51.6997]
["A9382","Dolly intermediário com 2 eixos para semirreboque",104432.36,6.9622000000000002,3.4902000000000002,0,7.8323999999999998,0,0,18.284800000000001,10.452400000000001]
["E9027","Caminhão distribuidor de cimento e cal com capacidade de 17 m³ - 210 kW",{"$nulls":7},429.73570000000001,123.286]
["A9333","Caminhão plataforma 8 x 2, PBTC 36.000 kg e distância entre eixos 4,8 m - 210 kW - motorista de caminhão",832118.87710000004,35.662199999999999,14.6691,5.9436999999999998,53.493400000000001,211.11089999999999,20.778600000000001,341.65789999999998,77.053600000000003]
["A9365","Distribuidor de cimento montado sobre chassi com capacidade de 17 m³",492846.11599999998,37.195900000000002,9.0365000000000002,0,41.845399999999998,0,0,88.077799999999996,46.232399999999998]
["E9037","Plataforma de inspeção sob pontes montada em caminhão com capacidade de 500 kg e alcance de 15 m - 188 kW",{"$nulls":7},641.94939999999997,260.74610000000001]
["A9334","Caminhão plataforma 8 x 2, PBT 29.000 kg e distância entre eixos 4,8 m - 188 kW - condição de trabalho severa - motorista de veículo especial",808594.47710000002,34.654000000000003,14.2544,5.7756999999999996,51.981099999999998,188.99449999999999,22.709800000000001,318.36950000000002,77.393900000000002]
["A9378","Plataforma telescópica para inspeção de pontes montada sobre chassi com capacidade de 500 kg",2181320.3879999998,124.6469,38.453600000000002,0,140.2277,0,20.2517,323.57990000000001,183.35220000000001]
["E9041","Caminhão carroceria com guindauto com capacidade de 45 t.m - 188 kW",{"$nulls":7},384.47590000000002,123.81870000000001]
["A9313","Caminhão plataforma 6 x 2, PBT 23.000 kg e distância entre eixos 5,4 m - 188 kW - motorista de veículo especial",710149.1004,30.434999999999999,12.5189,5.0724999999999998,45.6524,188.99449999999999,22.709800000000001,305.38310000000001,70.736199999999997]
["A9351","Carroceria de madeira com capacidade de 11 t",40141.785100000001,2.7684000000000002,0.72589999999999999,0,2.7684000000000002,0,0,6.2626999999999997,3.4943]
["A9373","Guindaste articulado montado sobre chassi com capacidade de 45 t.m",337008,23.241900000000001,6.0945999999999998,0,23.241900000000001,0,20.2517,72.830100000000002,49.588200000000001]
["E9082","Bate-estaca hidráulico para defensas montado em caminhão guindauto com capacidade de 20 t.m e carroceria de 4 t - 136 kW",{"$nulls":7},333.04640000000001,134.44829999999999]
["A9323","Caminhão plataforma 4 x 2, PBT 14.300 kg e distância entre eixos 4,8 m - 136 kW - condição de trabalho severa - motorista de caminhão",547568.23950000003,23.467199999999998,9.6527999999999992,3.9112,35.200800000000001,136.71940000000001,20.778600000000001,229.73,57.809800000000003]
["A9347","Carroceria de madeira com capacidade de 4 t",17692.919999999998,1.2202,0.32,0,1.2202,0,0,2.7604000000000002,1.5402]
["A9372","Guindaste articulado montado sobre chassi com capacidade de 20 t.m",210128.5,14.4916,3.8001,0,14.4916,0,20.2517,53.034999999999997,38.543399999999998]
["A9379","Bate-estaca hidráulico para defensas metálicas montada sobre chassi",205615,11.6515,4.6516999999999999,0,10.966100000000001,0,20.2517,47.521000000000001,36.554900000000004]
["E9097","Caminhão de resgate de veículos leves com plataforma com capacidade de 4 t - 115 kW",{"$nulls":7},206.43459999999999,57.892899999999997]
["A9326","Caminhão plataforma 4 x 2 PBT 9.600 kg e distância entre eixos 3,7 m - 115 kW - motorista de veículo especial",437070.08960000001,18.7316,7.7049000000000003,3.1219000000000001,28.0974,115.6084,22.709800000000001,195.97399999999999,52.2682]
["A9374","Plataforma hidráulica para resgate de veículos montada sobre chassi com capacidade de 4 t",75225,4.2986000000000004,1.3261000000000001,0,4.8358999999999996,0,0,10.460599999999999,5.6246999999999998]
["E9098","Caminhão de resgate de veículos de porte médio com capacidade do guincho de 20 t - 136 kW",{"$nulls":7},276.86919999999998,93.328199999999995]
["A9306","Caminhão plataforma 4 x 2, PBT 16.000 kg e distância entre eixos 3,6 m - 136 kW - motorista de veículo especial",572871.36589999998,24.551600000000001,10.0989,4.0918999999999999,36.827399999999997,136.71940000000001,22.709800000000001,234.999,61.452199999999998]
["A9375","Guincho rebocador para resgate de veículos montada sobre chassi com capacidade de 20 t",155465,8.8836999999999993,2.7406000000000001,0,9.9941999999999993,0,20.2517,41.870199999999997,31.876000000000001]
["E9099","Caminhão de resgate de veículos pesados com dois guinchos com capacidade de 35 t - 240 kW",{"$nulls":7},486.74560000000002,148.8621]
["A9320","Caminhão plataforma 6 x 2, PBT 23.000 kg e distância entre eixos 4,8 m - 240 kW - motorista de veículo especial",906097.53419999999,38.832799999999999,15.9732,6.4721000000000002,58.249099999999999,241.2696,22.709800000000001,383.50659999999999,83.987899999999996]
["A9376","Guincho rebocador para resgate de veículos montada sobre chassi com capacidade de 35 t",596785,34.101999999999997,10.5205,0,38.364800000000002,0,20.2517,103.239,64.874200000000002]
["E9100","Cavalo mecânico sem reboque - 210 kW",{"$nulls":7},259.8784,63.609299999999998]
["A9310","Cavalo mecânico 4 x 2, PBT 16.000 kg - 210 kW - motorista de caminhão",633323.59569999995,27.142399999999999,11.1646,4.5236999999999998,40.713700000000003,155.55539999999999,20.778600000000001,259.8784,63.609299999999998]
["E9114","Painel com seta luminosa para montagem em caminhão",{"$nulls":7},5.5134999999999996,3.7743000000000002]
["A9380","Painel com seta luminosa montado sobre chassi",34783.080300000001,3.1305000000000001,0.64380000000000004,0,1.7392000000000001,0,0,5.5134999999999996,3.7743000000000002]
["E9115","Amortecedor retrátil (AMC) para montagem em caminhão",{"$nulls":7},76.578500000000005,41.859499999999997]
["A9381","Amortecedor retrátil montado em caminhão",385766.6372,34.719000000000001,7.1405000000000003,0,34.719000000000001,0,0,76.578500000000005,41.859499999999997]
["E9145","Caminhão basculante para concreto com capacidade de 7 m³ - 188 kW",{"$nulls":7},275.6053,80.135599999999997]
["A9316","Caminhão plataforma 8 x 2, PBT 29.000 kg e distância entre eixos 4,8 m - 188 kW - motorista de caminhão",808594.47710000002,34.654000000000003,14.2544,5.7756999999999996,51.981099999999998,139.25909999999999,20.778600000000001,266.7029,75.462699999999998]
["A9340","Caçamba basculante para concreto com capacidade de 7 m³",49813.995000000003,3.7595000000000001,0.91339999999999999,0,4.2294999999999998,0,0,8.9024000000000001,4.6729000000000003]
["E9146","Caminhão silo com capacidade de 30 m³ - 265 kW",{"$nulls":7},448.41109999999998,105.3856]
["A9335","Cavalo mecânico estradeiro 6 x 2, PBT 23.000 kg - 265 kW - condição de trabalho severa - motorista de caminhão",896018.97089999996,38.400799999999997,15.795500000000001,6.4001000000000001,57.601199999999999,266.40190000000001,20.778600000000001,405.37810000000002,81.375]
["A9357","Semirreboque silo para cimento com capacidade de 30 m³",275825,19.022400000000001,4.9882,0,19.022400000000001,0,0,43.033000000000001,24.0106]
["E9169","Cavalo mecânico com dolly pneumático de 4 eixos e mesas de giro com capacidade de 57 t - 323 kW",{"$nulls":7},566.80560000000003,188.06909999999999]
["A9324","Cavalo mecânico estradeiro 6 x 4, PBT 23.000 kg - 323 kW - motorista de veículo especial",1143870.2224000001,49.023000000000003,20.1648,8.1705000000000005,73.534499999999994,239.25899999999999,22.709800000000001,412.86160000000001,100.0681]
["A9385","Conjunto de duas mesas de giro para quinta roda ou reboque com capacidade de 100 t cada",325520.11940000003,21.7013,10.879200000000001,0,24.414000000000001,0,0,56.994500000000002,32.580500000000001]
["A9389","Dolly pneumático com capacidade de 48 t e 4 eixos",553719.79079999996,36.914700000000003,18.505800000000001,0,41.529000000000003,0,0,96.9495,55.420499999999997]
["E9170","Cavalo mecânico com dois dollys pneumáticos de 3 e 4 eixos e mesas de giro com capacidade de 77 t - 323 kW",{"$nulls":7},666.47699999999998,243.55680000000001]
["A9385","Conjunto de duas mesas de giro para quinta roda ou reboque com capacidade de 100 t cada",325520.11940000003,21.7013,10.879200000000001,0,24.414000000000001,0,0,56.994500000000002,32.580500000000001]
["A9386","Cavalo mecânico estradeiro 6 x 4, CMT 123.000 kg - 323 kW - motorista de veículo especial",1335248.9406000001,57.225000000000001,23.538499999999999,9.5374999999999996,85.837400000000002,239.25899999999999,22.709800000000001,438.10719999999998,113.0108]
["A9387","Dolly pneumático com capacidade de 28,5 t e 3 eixos",425077.81920000003,28.3385,14.2065,0,31.880800000000001,0,0,74.425799999999995,42.545000000000002]
["A9389","Dolly pneumático com capacidade de 48 t e 4 eixos",553719.79079999996,36.914700000000003,18.505800000000001,0,41.529000000000003,0,0,96.9495,55.420499999999997]
["E9171","Cavalo mecânico com dois dollys pneumáticos de 4 e 5 eixos e mesas de giro com capacidade de 111 t - 440 kW",{"$nulls":7},1319.1790000000001,536.40300000000002]
["A9325","Cavalo mecânico 8 x 8, PBT 26.000 kg - 440 kW -  motorista de veículo especial",5284693.5120000001,226.48689999999999,93.161600000000007,37.747799999999998,339.7303,325.92559999999997,22.709800000000001,1045.7619999999999,380.10610000000003]
["A9385","Conjunto de duas mesas de giro para quinta roda ou reboque com capacidade de 100 t cada",325520.11940000003,21.7013,10.879200000000001,0,24.414000000000001,0,0,56.994500000000002,32.580500000000001]
["A9388","Dolly pneumático com capacidade de 60 t e 5 eixos",682361.76240000001,45.4908,22.805099999999999,0,51.177100000000003,0,0,119.473,68.295900000000003]
["A9389","Dolly pneumático com capacidade de 48 t e 4 eixos",553719.79079999996,36.914700000000003,18.505800000000001,0,41.529000000000003,0,0,96.9495,55.420499999999997]
["E9199","Caminhão com sistema de hidrojateamento de alta pressão e vácuo para limpeza e desobstrução de bueiros com capacidade total de 15.600 l - 188 kW",{"$nulls":7},344.28649999999999,93.5916]
["A9299","Equipamento com sistema de hidrojateamento de alta pressão e vácuo para limpeza e desobstrução de bueiros com diâmetro de até 1.500 mm com capacidade total de 15.600 l",401200,16.047999999999998,6.8074000000000003,0,16.047999999999998,0,0,38.903399999999998,22.855399999999999]
["A9313","Caminhão plataforma 6 x 2, PBT 23.000 kg e distância entre eixos 5,4 m - 188 kW - motorista de veículo especial",710149.1004,30.434999999999999,12.5189,5.0724999999999998,45.6524,188.99449999999999,22.709800000000001,305.38310000000001,70.736199999999997]
["E9201","Caminhão basculante para rocha com capacidade de 12 m³ - 188 kW com periculosidade",{"$nulls":7},306.4366,99.667699999999996]
["A9327","Caminhão plataforma 8 x 2 PBT 29.000 kg e distância entre eixos 4,8 m - 188 kW - motorista de veículo especial com periculosidade",808594.47710000002,34.654000000000003,14.2544,5.7756999999999996,51.981099999999998,139.25909999999999,27.826899999999998,273.75119999999998,82.510999999999996]
["A9343","Caçamba basculante para rocha com capacidade de 12 m³",182894.041,13.8033,3.3534000000000002,0,15.528700000000001,0,0,32.685400000000001,17.156700000000001]
["E9202","Plataforma pantográfica montada em caminhão - 115 kW com periculosidade",{"$nulls":7},297.67669999999998,122.3813]
["A9300","Caminhão plataforma 4 x 2, PBT 8.300 kg e distância entre eixos 3,7 m - 115 kW - motorista de veículo especial com periculosidade",414775.68339999998,17.7761,7.3118999999999996,2.9626999999999999,26.664200000000001,115.6084,27.826899999999998,198.15020000000001,55.877600000000001]
["A9383","Plataforma pantográfica hidráulica montada sobre chassi com capacidade de 600 kg - com periculosidade",495341.58,33.022799999999997,8.9140999999999995,0,33.022799999999997,0,24.566800000000001,99.526499999999999,66.503699999999995]
["E9506","Caminhão basculante com capacidade de 6 m³ - 136 kW",{"$nulls":7},180.85339999999999,66.107200000000006]
["A9307","Caminhão plataforma 4 x 2, PBT 16.000 kg e distância entre eixos 3,6 m - 136 kW - motorista de caminhão",572871.36589999998,24.551600000000001,10.0989,4.0918999999999999,36.827399999999997,71.957599999999999,20.778600000000001,168.30600000000001,59.521000000000001]
["A9338","Caçamba basculante com capacidade de 6 m³",70210,5.2988999999999997,1.2873000000000001,0,5.9611999999999998,0,0,12.5474,6.5861999999999998]
["E9508","Caminhão carroceria com capacidade de 9 t - 136 kW",{"$nulls":7},175.21340000000001,63.3247]
["A9309","Caminhão plataforma 4 x 2, PBT 16.000 kg e distância entre eixos 4,8 m - 136 kW - motorista de caminhão",581285.72120000003,24.912199999999999,10.247199999999999,4.1520000000000001,37.368400000000001,71.957599999999999,20.778600000000001,169.416,60.09]
["A9350","Carroceria de madeira com capacidade de 9 t",37159.815999999999,2.5627,0.67200000000000004,0,2.5627,0,0,5.7973999999999997,3.2347000000000001]
["E9509","Caminhão tanque distribuidor de asfalto com capacidade de 6.000 l - 7 kW/136 kW",{"$nulls":7},255.02860000000001,68.078199999999995]
["A9323","Caminhão plataforma 4 x 2, PBT 14.300 kg e distância entre eixos 4,8 m - 136 kW - condição de trabalho severa - motorista de caminhão",547568.23950000003,23.467199999999998,9.6527999999999992,3.9112,35.200800000000001,136.71940000000001,20.778600000000001,229.73,57.809800000000003]
["A9363","Tanque espargidor de asfalto com capacidade de 6.000 l - 7 kW",190570,7.6227999999999998,2.6456,0,7.6227999999999998,7.4074,0,25.2986,10.2684]
["E9520","Caminhão com caçamba térmica com capacidade de 6 m³ - 188 kW",{"$nulls":7},268.16649999999998,76.705200000000005]
["A9311","Caminhão plataforma 6 x 2, PBT 23.000 kg e distância entre eixos 4,8 m - 188 kW - motorista de caminhão",703967.58310000005,30.17,12.4099,5.0282999999999998,45.255099999999999,139.25909999999999,20.778600000000001,252.90100000000001,68.386799999999994]
["A9339","Caçamba térmica com capacidade de 6 m³",123503.9767,6.1752000000000002,2.1432000000000002,0,6.9470999999999998,0,0,15.265499999999999,8.3184000000000005]
["E9571","Caminhão tanque com capacidade de 10.000 l - 188 kW",{"$nulls":7},319.38,77.728999999999999]
["A9332","Caminhão plataforma 6 x 2, PBT 23.000 kg e distância entre eixos 4,8 m - 188 kW - condição de trabalho severa - motorista de caminhão",703967.58310000005,30.17,12.4099,5.0282999999999998,45.255099999999999,188.99449999999999,20.778600000000001,302.63639999999998,68.386799999999994]
["A9360","Tanque para transporte de água com capacidade de 10.000 l",107321,7.4013999999999998,1.9408000000000001,0,7.4013999999999998,0,0,16.743600000000001,9.3422000000000001]
["E9575","Caminhão basculante com caçamba estanque com capacidade de 14 m³ - 188 kW",{"$nulls":7},287.0967,87.084999999999994]
["A9317","Caminhão plataforma 8 x 2, PBT 29.000 kg e distância entre eixos 4,8 m - 188 kW - motorista de veículo especial",808594.47710000002,34.654000000000003,14.2544,5.7756999999999996,51.981099999999998,139.25909999999999,22.709800000000001,268.63409999999999,77.393900000000002]
["A9345","Caçamba basculante estanque com capacidade de 14 m³",103309,7.7968999999999999,1.8942000000000001,0,8.7714999999999996,0,0,18.462599999999998,9.6911000000000005]
["E9579","Caminhão basculante com capacidade de 10 m³ - 188 kW",{"$nulls":7},283.05430000000001,84.045599999999993]
["A9316","Caminhão plataforma 8 x 2, PBT 29.000 kg e distância entre eixos 4,8 m - 188 kW - motorista de caminhão",808594.47710000002,34.654000000000003,14.2544,5.7756999999999996,51.981099999999998,139.25909999999999,20.778600000000001,266.7029,75.462699999999998]
["A9342","Caçamba basculante com capacidade de 10 m³",91495.393899999995,6.9053000000000004,1.6776,0,7.7685000000000004,0,0,16.351400000000002,8.5829000000000004]
["E9592","Caminhão carroceria com capacidade de 15 t - 188 kW",{"$nulls":7},260.13240000000002,72.384799999999998]
["A9314","Caminhão plataforma 6 x 2, PBT 23.000 kg e distância entre eixos 5,4 m - 188 kW - motorista de caminhão",710149.1004,30.434999999999999,12.5189,5.0724999999999998,45.6524,139.25909999999999,20.778600000000001,253.7165,68.805000000000007]
["A9352","Carroceria de madeira com capacidade de 15 t",41123,2.8361000000000001,0.74370000000000003,0,2.8361000000000001,0,0,6.4158999999999997,3.5798000000000001]
["E9600","Caminhão betoneira com capacidade de 8 m³ - 188 kW",{"$nulls":7},299.10649999999998,93.388999999999996]
["A9317","Caminhão plataforma 8 x 2, PBT 29.000 kg e distância entre eixos 4,8 m - 188 kW - motorista de veículo especial",808594.47710000002,34.654000000000003,14.2544,5.7756999999999996,51.981099999999998,139.25909999999999,22.709800000000001,268.63409999999999,77.393900000000002]
["A9346","Misturador de concreto para montagem em chassi de caminhão com capacidade de 8 m³",170510,12.8687,3.1263999999999998,0,14.4773,0,0,30.4724,15.995100000000001]
["E9604","Caminhão basculante para rocha com capacidade de 8 m³ - 210 kW",{"$nulls":7},298.85899999999998,83.739099999999993]
["A9315","Caminhão basculante 6 x 4, PBT 23.000 kg e distância entre eixos 3,6 m - 210 kW -  motorista de caminhão",838617.94279999996,35.940800000000003,14.7836,5.9901,53.911200000000001,155.55539999999999,20.778600000000001,286.9597,77.493099999999998]
["A9341","Caçamba basculante para rocha com capacidade de 8 m³",66583.652700000006,5.0251999999999999,1.2208000000000001,0,5.6532999999999998,0,0,11.8993,6.2460000000000004]
["E9605","Caminhão tanque com capacidade de 6.000 l - 136 kW",{"$nulls":7},244.43940000000001,66.016999999999996]
["A9323","Caminhão plataforma 4 x 2, PBT 14.300 kg e distância entre eixos 4,8 m - 136 kW - condição de trabalho severa - motorista de caminhão",547568.23950000003,23.467199999999998,9.6527999999999992,3.9112,35.200800000000001,136.71940000000001,20.778600000000001,229.73,57.809800000000003]
["A9358","Tanque para transporte de água com capacidade de 6.000 l",94282,6.5022000000000002,1.7050000000000001,0,6.5022000000000002,0,0,14.7094,8.2072000000000003]
["E9644","Caminhão demarcador de faixas com sistema de pintura a frio - 28 kW/115 kW",{"$nulls":7},360.00069999999999,142.88659999999999]
["A9302","Caminhão plataforma 4 x 2, PBT 8.300 kg e distância entre eixos 4,4 m - 115 kW - motorista de veículo especial",416111.21899999998,17.833300000000001,7.3353999999999999,2.9722,26.75,115.6084,22.709800000000001,193.20910000000001,50.850700000000003]
["A9368","Equipamento demarcador de faixas a frio montado sobre chassi com capacidade de 800 l - 28 kW",697085,52.668599999999998,19.115600000000001,0,49.570500000000003,25.185199999999998,20.2517,166.79159999999999,92.035899999999998]
["E9645","Caminhão demarcador de faixas com sistema de pintura a quente - 5 kW/30,10 kW/136 kW",{"$nulls":7},503.47230000000002,209.15469999999999]
["A9305","Caminhão plataforma 4 x 2, PBT 14.300 kg e distância entre eixos 4,8 m - 136 kW - motorista de veículo especial",547568.23950000003,23.467199999999998,9.6527999999999992,3.9112,35.200800000000001,136.71940000000001,22.709800000000001,231.66120000000001,59.741]
["A9328","Compressor de ar portátil de 70,79 l/s (150 PCM) sem reboque - 30,10 kW",134615.67050000001,8.9743999999999993,2.4224999999999999,0,8.9743999999999993,27.074000000000002,0,47.445300000000003,11.3969]
["A9369","Equipamento demarcador de faixas a quente montado sobre chassi com capacidade de 500 l - 5,0 kW",1143597.4310000001,86.405100000000004,31.36,0,81.322500000000005,5.0265000000000004,20.2517,224.36580000000001,138.01679999999999]
["E9663","Caminhão basculante com capacidade de 4 m³ - 136 kW",{"$nulls":7},175.00620000000001,63.078800000000001]
["A9304","Caminhão plataforma 4 x 2, PBT 14.300 kg e distância entre eixos 4,8 m - 136 kW - motorista de caminhão",547568.23950000003,23.467199999999998,9.6527999999999992,3.9112,35.200800000000001,71.957599999999999,20.778600000000001,164.9682,57.809800000000003]
["A9336","Caçamba basculante com capacidade de 4 m³",56168,4.2390999999999996,1.0299,0,4.7690000000000001,0,0,10.038,5.2690000000000001]
["E9665","Cavalo mecânico com semirreboque com capacidade de 22 t - 240 kW",{"$nulls":7},376.40789999999998,116.67910000000001]
["A9318","Cavalo mecânico 4 x 2, PBT 16.000 kg - 240 kW - motorista de veículo especial",847685.60360000003,36.3294,14.9435,6.0548999999999999,54.494100000000003,177.77760000000001,22.709800000000001,312.30930000000001,80.037599999999998]
["A9353","Semirreboque com 2 eixos",366095,24.406300000000002,12.235200000000001,0,27.457100000000001,0,0,64.098600000000005,36.641500000000001]
["E9666","Cavalo mecânico com semirreboque com capacidade de 30 t - 265 kW",{"$nulls":7},407.27350000000001,122.5339]
["A9321","Cavalo mecânico estradeiro 6 x 2, PBT 23.000 kg - 265 kW - motorista de caminhão",896018.97089999996,38.400799999999997,15.795500000000001,6.4001000000000001,57.601199999999999,196.2961,20.778600000000001,335.27229999999997,81.375]
["A9354","Semirreboque com 3 eixos",411230,27.415299999999998,13.743600000000001,0,30.842300000000002,0,0,72.001199999999997,41.158900000000003]
["E9667","Caminhão basculante com capacidade de 14 m³ - 188 kW",{"$nulls":7},287.0967,87.084999999999994]
["A9317","Caminhão plataforma 8 x 2, PBT 29.000 kg e distância entre eixos 4,8 m - 188 kW - motorista de veículo especial",808594.47710000002,34.654000000000003,14.2544,5.7756999999999996,51.981099999999998,139.25909999999999,22.709800000000001,268.63409999999999,77.393900000000002]
["A9344","Caçamba basculante com capacidade de 14 m³",103309,7.7968999999999999,1.8942000000000001,0,8.7714999999999996,0,0,18.462599999999998,9.6911000000000005]
["E9669","Caminhão tanque com capacidade de 8.000 l - 136 kW",{"$nulls":7},249.89099999999999,68.857299999999995]
["A9331","Caminhão plataforma 4 x 2, PBT 16.000 kg e distância entre eixos 4,8 m - 136 kW - condição de trabalho severa - motorista de caminhão",581285.72120000003,24.912199999999999,10.247199999999999,4.1520000000000001,37.368400000000001,136.71940000000001,20.778600000000001,234.17779999999999,60.09]
["A9359","Tanque para transporte de água com capacidade de 8.000 l",100715.9733,6.9459,1.8213999999999999,0,6.9459,0,0,15.713200000000001,8.7673000000000005]
["E9670","Usina móvel de lama asfáltica ou microrrevestimento com cavalo mecânico com capacidade de 12 m³ - 95,6 kW/240 kW",{"$nulls":7},718.14760000000001,231.3305]
["A9319","Cavalo mecânico 4 x 2, PBT 16.000 kg - 240 kW - condição de trabalho severa - motorista de veículo especial",847685.60360000003,36.3294,14.9435,6.0548999999999999,54.494100000000003,241.2696,22.709800000000001,375.80130000000003,80.037599999999998]
["A9367","Usina de lama asfáltica ou microrrevestimento asfáltico rebocável com capacidade de 12 m³ - 95,6 kW",1398281.297,89.889499999999998,27.730899999999998,0,89.889499999999998,101.1639,33.672499999999999,342.34629999999999,151.2929]
["E9672","Caminhão basculante para rocha com capacidade de 12 m³ - 188 kW",{"$nulls":7},301.31950000000001,94.550600000000003]
["A9317","Caminhão plataforma 8 x 2, PBT 29.000 kg e distância entre eixos 4,8 m - 188 kW - motorista de veículo especial",808594.47710000002,34.654000000000003,14.2544,5.7756999999999996,51.981099999999998,139.25909999999999,22.709800000000001,268.63409999999999,77.393900000000002]
["A9343","Caçamba basculante para rocha com capacidade de 12 m³",182894.041,13.8033,3.3534000000000002,0,15.528700000000001,0,0,32.685400000000001,17.156700000000001]
["E9679","Cavalo mecânico com dois reboques hidropneumáticos de 5 e 4 eixos e mesas de giro com capacidade de 130 t - 440 kW",{"$nulls":7},1491.0437999999999,634.64819999999997]
["A9325","Cavalo mecânico 8 x 8, PBT 26.000 kg - 440 kW -  motorista de veículo especial",5284693.5120000001,226.48689999999999,93.161600000000007,37.747799999999998,339.7303,325.92559999999997,22.709800000000001,1045.7619999999999,380.10610000000003]
["A9384","Reboque hidropneumático com capacidade de 166 t e 4 eixos",1012356.3852,67.490399999999994,33.833799999999997,0,75.926699999999997,0,0,177.2509,101.3242]
["A9385","Conjunto de duas mesas de giro para quinta roda ou reboque com capacidade de 100 t cada",325520.11940000003,21.7013,10.879200000000001,0,24.414000000000001,0,0,56.994500000000002,32.580500000000001]
["A9390","Reboque hidropneumático com capacidade de 117 t e 5 eixos",1205319.3426000001,80.354600000000005,40.282800000000002,0,90.399000000000001,0,0,211.03639999999999,120.6374]
["E9680","Caminhão tanque com capacidade de 13.000 l - 188 kW",{"$nulls":7},321.88389999999998,79.126099999999994]
["A9332","Caminhão plataforma 6 x 2, PBT 23.000 kg e distância entre eixos 4,8 m - 188 kW - condição de trabalho severa - motorista de caminhão",703967.58310000005,30.17,12.4099,5.0282999999999998,45.255099999999999,188.99449999999999,20.778600000000001,302.63639999999998,68.386799999999994]
["A9361","Tanque para transporte de água com capacidade de 13.000 l",123369,8.5082000000000004,2.2311000000000001,0,8.5082000000000004,0,0,19.247499999999999,10.7393]
["E9686","Caminhão carroceria com guindauto com capacidade de 20 t.m - 136 kW",{"$nulls":7},294.7002,103.5801]
["A9308","Caminhão plataforma 4 x 2, PBT 16.000 kg e distância entre eixos 4,8 m - 136 kW - motorista de veículo especial",595474.88879999996,25.520399999999999,10.497400000000001,4.2534000000000001,38.280500000000004,136.71940000000001,22.709800000000001,237.98089999999999,62.981000000000002]
["A9349","Carroceria de madeira com capacidade de 7 t",23614.5975,1.6286,0.42709999999999998,0,1.6286,0,0,3.6842999999999999,2.0556999999999999]
["A9372","Guindaste articulado montado sobre chassi com capacidade de 20 t.m",210128.5,14.4916,3.8001,0,14.4916,0,20.2517,53.034999999999997,38.543399999999998]
["E9687","Caminhão carroceria com capacidade de 5 t - 115 kW",{"$nulls":7},142.44329999999999,52.101500000000001]
["A9303","Caminhão plataforma 4 x 2, PBT 9.600 kg e distância entre eixos 3,7 m - 115 kW - motorista de caminhão",437070.08960000001,18.7316,7.7049000000000003,3.1219000000000001,28.0974,60.846499999999999,20.778600000000001,139.2809,50.337000000000003]
["A9348","Carroceria de madeira com capacidade de 5 t",20270.228800000001,1.3978999999999999,0.36659999999999998,0,1.3978999999999999,0,0,3.1623999999999999,1.7645]
["E9690","Caminhão carroceria com guindauto e cesto aéreo com capacidade de 10 t.m - 136 kW",{"$nulls":7},314.67950000000002,123.6798]
["A9308","Caminhão plataforma 4 x 2, PBT 16.000 kg e distância entre eixos 4,8 m - 136 kW - motorista de veículo especial",595474.88879999996,25.520399999999999,10.497400000000001,4.2534000000000001,38.280500000000004,136.71940000000001,22.709800000000001,237.98089999999999,62.981000000000002]
["A9329","Cesto aéreo simples isolado com capacidade para 135 kg",24327.764999999999,1.6778,0.44,0,1.6778,0,0,3.7955999999999999,2.1177999999999999]
["A9330","Guindaste articulado montado sobre chassi com capacidade de 10 t.m",170510,11.7593,3.0836000000000001,0,11.7593,0,40.503399999999999,67.105599999999995,55.346299999999999]
["A9350","Carroceria de madeira com capacidade de 9 t",37159.815999999999,2.5627,0.67200000000000004,0,2.5627,0,0,5.7973999999999997,3.2347000000000001]
["E9693","Caminhão demarcador de faixas com sistema de pintura Spray - 115 kW",{"$nulls":7},775.88760000000002,402.78460000000001]
["A9322","Caminhão plataforma 4 x 2, PBT 9.600 kg e distância entre eixos 3,7 m - 115 kW - condição de trabalho severa - motorista de caminhão",437070.08960000001,18.7316,7.7049000000000003,3.1219000000000001,28.0974,115.6084,20.778600000000001,194.0428,50.337000000000003]
["A9370","Equipamento demarcador de faixas sistema spray montado sobre chassi com capacidade 1.080 l",3225898.75,243.7346,88.461299999999994,0,229.3972,0,20.2517,581.84479999999996,352.44760000000002]
["E9783","Plataforma pantográfica montada em caminhão - 115 kW",{"$nulls":7},288.24450000000002,112.9491]
["A9301","Caminhão plataforma 4 x 2, PBT 8.300 kg e distância entre eixos 3,7 m - 115 kW - motorista de veículo especial",414775.68339999998,17.7761,7.3118999999999996,2.9626999999999999,26.664200000000001,115.6084,22.709800000000001,193.03309999999999,50.7605]
["A9377","Plataforma pantográfica hidráulica montada sobre chassi com capacidade de 600 kg",495341.58,33.022799999999997,8.9140999999999995,0,33.022799999999997,0,20.2517,95.211399999999998,62.188600000000001]
["E9787","Bomba para concreto com lança montada sobre chassi com capacidade de 50 m³/h - 136 kW",{"$nulls":7},576.13430000000005,264.68]
["A9308","Caminhão plataforma 4 x 2, PBT 16.000 kg e distância entre eixos 4,8 m - 136 kW - motorista de veículo especial",595474.88879999996,25.520399999999999,10.497400000000001,4.2534000000000001,38.280500000000004,136.71940000000001,22.709800000000001,237.98089999999999,62.981000000000002]
["A9371","Bomba para concreto com lança montada sobre chassi com capacidade de 50 m³/h",1705680.0851,136.45439999999999,31.572099999999999,0,136.45439999999999,0,33.672499999999999,338.15339999999998,201.69900000000001]
["E9792","Caminhão para hidrossemeadura com capacidade de 7.500 l - 136 kW",{"$nulls":7},321.20209999999997,115.44540000000001]
["A9323","Caminhão plataforma 4 x 2, PBT 14.300 kg e distância entre eixos 4,8 m - 136 kW - condição de trabalho severa - motorista de caminhão",547568.23950000003,23.467199999999998,9.6527999999999992,3.9112,35.200800000000001,136.71940000000001,20.778600000000001,229.73,57.809800000000003]
["A9362","Tanque para hidrossemeadura com capacidade de 7.500 l",398519.08289999998,30.076899999999998,7.3070000000000004,0,33.836500000000001,0,20.2517,91.472099999999998,57.635599999999997]

{"sheet":"MO D","index":18,"n_rows":118,"n_cols":7,"rows_kept":118,"cut":false,"hidden":true,"merged":[[0,0,1,0],[0,1,1,5],[0,6,1,6],[2,0,2,6],[3,0,3,6]]}
["CGCIT","SISTEMA DE CUSTOS REFERENCIAIS DE OBRAS - SICRO",{"$nulls":4},"DNIT"]
[]
["Alagoas - Abril/2023"]
["Com desoneração"]
["Código","Descrição","Unidade","Salário (R$)","Encargos Totais","Custo (R$)","Periculosidade/\nInsalubridade"]
["P9801","Ajudante","h",5.9595000000000002,1.8204720000000001,16.808599999999998,0]
["P9802","Ajudante especializado","h",7.1071999999999997,1.781145,19.766100000000002,0]
["P9803","Almoxarife","mês",2582.8000000000002,0.93333200000000005,4993.4098000000004,0]
["P9804","Apontador","mês",1754.8136999999999,1.1323179999999999,3741.8208,0]
["P9805","Armador","h",10.25,1.401885,24.619299999999999,0]
["P9806","Auxiliar administrativo","mês",1669.9290000000001,1.1635960000000001,3613.0517,0]
["P9807","Bombeiro hidráulico","h",10.7721,1.4550369999999999,26.445900000000002,0]
["P9808","Carpinteiro","h",7.7073999999999998,1.5981879999999999,20.025200000000002,0]
["P9809","Encarregado administrativo","mês",3814.4169999999999,0.73383799999999999,6613.5811000000003,0]
["P9810","Eletricista","h",8.8169000000000004,1.5652010000000001,22.617100000000001,0]
["P9811","Encarregado especializado","mês",3365.0331000000001,0.792103,6030.4858999999997,0]
["P9812","Engenheiro","mês",12569.693600000001,0.58630599999999999,19939.380300000001,0]
["P9814","Operacional","mês",1432.3199,1.272966,3255.6143999999999,0]
["P9815","Jardineiro","h",7.75,1.5939140000000001,20.102799999999998,0]
["P9819","Engenheiro supervisor","mês",12569.693600000001,0.58630599999999999,19939.380300000001,0]
["P9821","Pedreiro","h",7.7092999999999998,1.5945940000000001,20.002500000000001,0]
["P9822","Pintor","h",10.25,1.413932,24.742799999999999,0]
["P9823","Serralheiro","h",9.3101000000000003,1.465346,22.9526,0]
["P9824","Servente","h",5.9181999999999997,1.8246579999999999,16.716799999999999,0]
["P9825","Soldador","h",12.2767,1.3125579999999999,28.390499999999999,0]
["P9826","Chefe setor de finanças","mês",7889.6391999999996,0.63280700000000001,12882.258099999999,0]
["P9827","Vigia","mês",1302,1.490434,3633.145,0.3]
["P9830","Montador","h",10.2723,1.487921,25.5566,0]
["P9833","Auxiliar de laboratório","mês",2255,0.98801600000000001,4482.9759999999997,0]
["P9836","Geólogo","h",53.058700000000002,0.90652999999999995,101.158,0]
["P9837","Oceanógrafo","mês",4408.8626999999997,0.76156500000000005,7766.4982,0]
["P9840","Encarregado geral","mês",5263.6103999999996,0.69240500000000005,8908.1605,0]
["P9842","Faxineiro","mês",1377.2,1.3064039999999999,3176.3795,0]
["P9843","Operador de equipamento leve","h",7.9705000000000004,1.5408390000000001,20.2517,0]
["P9844","Capitão fluvial","mês",5937.7021999999997,0.69461700000000004,10062.130999999999,0]
["P9845","Operador de equipamento pesado","h",10.732799999999999,1.350967,25.232399999999998,0]
["P9846","Operador de equipamento especial","h",15.9488,1.111291,33.672499999999999,0]
["P9847","Perfurador de tubulão","h",5.9603000000000002,1.812387,16.762599999999999,0]
["P9848","Desenhista","mês",2830.9126000000001,0.81267900000000004,5131.5357999999997,0]
["P9849","Condutor maquinista fluvial","mês",2146.73,1.0162450000000001,4328.3335999999999,0]
["P9850","Copeiro","mês",1504.8,1.2024649999999999,3314.2692999999999,0]
["P9851","Médico do trabalho","mês",9843.5398000000005,0.60656399999999999,15814.276599999999,0]
["P9852","Blaster","h",9.8999000000000006,1.6841109999999999,29.542400000000001,0.3]
["P9853","Pré-marcador","h",5.9595000000000002,1.781288,16.574999999999999,0]
["P9854","Recepcionista","mês",1632.0016000000001,1.1189519999999999,3458.1329999999998,0]
["P9855","Marinheiro de máquinas","mês",2001.6548,1.051428,4106.2506999999996,0]
["P9856","Marinheiro de convés","h",8.8933,1.464191,21.9147,0]
["P9857","Marinheiro de convés - mensalista","mês",1956.5247999999999,1.062273,4034.8881999999999,0]
["P9858","Laboratorista","mês",3176.8,0.81010800000000005,5750.3509999999997,0]
["P9859","Trabalhador de via","h",5.9181999999999997,1.839852,16.806799999999999,0]
["P9861","Selecionador de material pétreo","h",5.9595000000000002,1.7957270000000001,16.661100000000001,0]
["P9864","Engenheiro de segurança do trabalho","mês",11149.0872,0.602105,17862.008300000001,0]
["P9865","Técnico em enfermagem","mês",2912.143,0.85076499999999999,5389.6922999999997,0]
["P9866","Motorista de caminhão","h",8.3823000000000008,1.4788749999999999,20.778600000000001,0]
["P9867","Técnico especializado - mensalista","mês",3150.2375000000002,0.81808999999999998,5727.4152000000004,0]
["P9869","Encarregado de obras de artes especiais","mês",3365.0331000000001,0.792103,6030.4858999999997,0]
["P9870","Motorista de veículo leve","h",10.25,1.35972,24.187100000000001,0]
["P9871","Motorista de veículo especial","h",9.4525000000000006,1.402523,22.709800000000001,0]
["P9875","Encarregado de turma","mês",2038.4864,1.0406500000000001,4159.8371999999999,0]
["P9876","Técnico de segurança do trabalho","mês",3093.2,0.81959300000000002,5628.3649999999998,0]
["P9878","Secretária","mês",2593.8973000000001,0.89592700000000003,4917.8398999999999,0]
["P9880","Piloto fluvial","mês",3276.33,0.84035800000000005,6029.6201000000001,0]
["P9882","Técnico especializado","h",14.3193,1.1659679999999999,31.0151,0]
["P9883","Chefe do setor administrativo","mês",3813.7231999999999,0.73387800000000003,6612.5307000000003,0]
["P9884","Encarregado de terraplenagem","mês",3365.0331000000001,0.792103,6030.4858999999997,0]
["P9885","Frentista de túnel","h",5.9595000000000002,1.885623,17.1968,0]
["P9889","Técnico da qualidade","mês",3433.6927999999998,0.79527000000000003,6164.4056,0]
["P9891","Engenheiro mecânico","mês",12633.3004,0.59126500000000004,20102.9287,0]
["P9892","Auxiliar de blaster","h",8.2651000000000003,1.8088850000000001,25.6952,0.3]
["P9893","Encarregado de pavimentação","mês",3365.0331000000001,0.792103,6030.4858999999997,0]
["P9896","Porteiro","mês",1431.4407000000001,1.2719929999999999,3252.2231999999999,0]
["P9897","Técnico de meio ambiente","mês",3429.5821999999998,0.792466,6147.4093999999996,0]
["P9900","Comprador","mês",3174.5236,0.80972100000000002,5745.0020000000004,0]
["P9901","Encarregado de superestrutura ferroviária","mês",3365.0331000000001,0.792103,6030.4858999999997,0]
["P9903","Auxiliar técnico","mês",1704.9315999999999,1.135977,3641.6945999999998,0]
["P9907","Comandante de longo curso","mês",14307.3935,0.58965999999999996,22743.891100000001,0]
["P9908","Imediato","mês",9204.4565999999995,0.63093999999999995,15011.9164,0]
["P9909","Oficial de náutica","mês",2559.2555000000002,0.93683399999999994,4956.8530000000001,0]
["P9910","Oficial de máquinas","mês",3003.1723000000002,0.87294400000000005,5624.7735000000002,0]
["P9911","Condutor de máquinas","mês",2146.73,1.0162450000000001,4328.3335999999999,0]
["P9912","Capitão fluvial com periculosidade","h",26.9895,1.2642279999999999,69.2072,0.3]
["P9913","Draguista","mês",3595.3388,0.81150699999999998,6512.9813999999997,0]
["P9915","Maquinista","h",12.510199999999999,1.3099400000000001,28.8978,0]
["P9916","Encarregado de conservação rodoviária","mês",3365.0331000000001,0.792103,6030.4858999999997,0]
["P9920","Mestre fluvial","mês",5937.7021999999997,0.69461700000000004,10062.130999999999,0]
["P9921","Mergulhador raso autônomo de emergência","h",9.0128000000000004,2.1727270000000001,30.962800000000001,0.26269999999999999]
["P9922","Mergulhador raso dependente de emergência","h",8.9931000000000001,2.24654,31.894300000000001,0.3]
["P9924","Mergulhador raso dependente","h",8.9931000000000001,3.729422,45.23,0.3]
["P9925","Mergulhador raso autônomo","h",9.0128000000000004,3.3196430000000001,41.299700000000001,0.26269999999999999]
["P9926","Mergulhador raso auxiliar de superfície","h",9.0128000000000004,1.9207510000000001,28.691800000000001,0.26269999999999999]
["P9927","Frentista de túnel com periculosidade","h",5.9595000000000002,2.1284200000000002,20.4316,0.3]
["P9928","Servente com periculosidade","h",5.9181999999999997,2.0674540000000001,19.929200000000002,0.3]
["P9929","Bombeiro hidráulico com periculosidade","h",10.7721,1.697525,32.2896,0.3]
["P9930","Eletricista com periculosidade","h",8.8169000000000004,1.8069740000000001,27.393799999999999,0.3]
["P9931","Operador de equipamento de mergulho","h",16.688199999999998,1.48844,43.895600000000002,0.1419]
["P9932","Operador de equipamento pesado com periculosidade","h",10.732799999999999,1.592344,31.042899999999999,0.3]
["P9933","Supervisor de mergulho raso","mês",3671.3966999999998,1.062492,8093.1975000000002,0.1419]
["P9934","Motorista de veículo especial com periculosidade","h",9.4525000000000006,1.643877,27.826899999999998,0.3]
["P9938","Operador de equipamento leve com periculosidade","h",7.9705000000000004,1.782224,24.566800000000001,0.3]
["P9939","Operador de equipamento leve com insalubridade","h",7.9705000000000004,2.0026380000000001,26.299700000000001,0.29699999999999999]
["P9940","Piloto fluvial com periculosidade","h",14.8924,1.439924,40.804000000000002,0.3]
["P9941","Mestre fluvial com periculosidade","h",26.9895,1.2642279999999999,69.2072,0.3]
["P9942","Marinheiro de convés com periculosidade","h",8.8933,1.7065319999999999,26.7379,0.3]
["P9943","Técnico de batimetria com periculosidade","h",11.652100000000001,1.5524199999999999,33.236600000000003,0.3]
["P9944","Operador de equipamento especial com periculosidade","h",15.9488,1.3526689999999999,42.306800000000003,0.3]
["P9945","Draguista com periculosidade","h",16.342400000000001,1.4051439999999999,44.208500000000001,0.3]
["P9946","Engenheiro auxiliar","mês",11067,0.59566200000000002,17659.191299999999,0]
["P9947","Técnico florestal","mês",3429.5821999999998,0.792466,6147.4093999999996,0]
["P9948","Motorista de veículo leve - mensalista","mês",2255,0.97813099999999997,4460.6854000000003,0]
["P9949","Topógrafo","mês",3825.8,0.76822400000000002,6764.8712999999998,0]
["P9950","Auxiliar de topografia","mês",2255,0.99952600000000003,4508.9310999999998,0]
["P9951","Médico de câmara hiperbárica","mês",9843.5398000000005,0.78434800000000005,18085.023799999999,5.2900000000000003E-2]
["P9952","Pedreiro - mensalista","mês",1696.0397,1.1752210000000001,3689.2611000000002,0]
["P9953","Eletricista - mensalista","mês",1939.4979000000001,1.148109,4166.2528000000002,0]
["P9954","Servente - mensalista","mês",1302,1.3654390000000001,3079.8015,0]
["P9955","Engenheiro chefe","mês",16616.8328,0.569523,26080.501199999999,0]
["P9956","Motorista de caminhão com periculosidade","h",8.3823000000000008,1.720226,25.316400000000002,0.3]
["P9972","Técnico de batimetria","mês",2563.4643000000001,0.93499299999999996,4960.2853999999998,0]

{"sheet":"Encargos D","index":19,"n_rows":151,"n_cols":30,"rows_kept":151,"cut":false,"hidden":true,"merged":[[148,3,148,9],[149,1,150,1],[149,3,149,9],[150,3,150,9],[139,3,139,9],[140,3,140,9],[141,3,141,9],[142,3,142,9],[143,3,143,9],[144,1,148,1],[144,3,144,9],[145,3,145,9],[146,3,146,9],[147,3,147,9],[134,1,143,1],[134,3,134,9],[135,3,135,9],[136,3,136,9],[137,3,137,9],[138,3,138,9],[6,27,6,28],[6,29,7,29],[124,3,124,9],[124,13,130,28],[125,1,133,1],[125,3,125,9],[126,3,126,9],[127,3,127,9],[128,3,128,9],[129,3,129,9],[6,22,6,26],[130,3,130,9],[131,3,131,9],[132,3,132,9],[133,3,133,9],[6,0,7,0],[6,1,7,1],[6,2,7,2],[6,3,6,11],[6,12,6,21],[4,0,4,29],[0,0,1,0],[0,1,1,28],[0,29,1,29],[2,0,2,29],[3,0,3,29]]}
["CGCIT","SISTEMA DE CUSTOS REFERENCIAIS DE OBRAS - SICRO",{"$nulls":27},"DNIT"]
[]
[]
["Alagoas - Abril/2023"]
["Com desoneração"]
[]
["Código","Descrição","Unid.","Encargos Sociais (%)",{"$nulls":8},"Encargos Trabalhistas (%)",{"$nulls":9},"Verbas Rescisórias (%)",{"$nulls":4},"Reincidências (%)",null,"Total (%)"]
[null,null,null,"A1","A2","A3","A4","A5","A6","A7","A8","A9","B1","B2","B3","B4","B5","B6","B7","B8","B9","B10","C1","C2","C3","C4","C5","D1","D2"]
["P9801","Ajudante","h",0,0.08,2.5000000000000001E-2,1.4999999999999999E-2,1.6E-2,2E-3,0.03,0,0,0.18599407413254601,5.14768459931964E-2,6.2992281890531798E-2,9.1512597665585702E-3,4.6041504131892798E-4,1.13428029830319E-3,9.2414790964694404E-2,7.4273153222795098E-3,1.41233518498324E-5,0,4.3990275980440197E-2,1.1108706044734599E-3,6.0227439395727403E-2,4.5154092376360901E-2,9.2841441528493801E-3,6.9058984975894896E-2,3.70584833998676E-3,0.81159999999999999]
["P9802","Ajudante especializado","h",0,0.08,2.5000000000000001E-2,1.4999999999999999E-2,1.6E-2,2E-3,0.03,0,0,0.18599407413254601,5.14768459931964E-2,6.2992281890531798E-2,9.1512597665585702E-3,4.6041504131892798E-4,1.13428029830319E-3,9.2414790964694404E-2,7.4273153222795098E-3,1.41233518498324E-5,0,4.3990275980440197E-2,1.1108706044734599E-3,6.0227439395727403E-2,4.5154092376360901E-2,9.2841441528493801E-3,6.9058984975894896E-2,3.70584833998676E-3,0.81159999999999999]
["P9803","Almoxarife","mês",0,0.08,2.5000000000000001E-2,1.4999999999999999E-2,1.6E-2,2E-3,0.03,1.11111111111111E-3,0,0,0,7.4777962322740504E-2,8.7416018348610396E-3,4.6021064012617902E-4,9.3578951605325701E-4,9.2373763431261399E-2,7.4240179666882501E-3,1.73456897961502E-4,0,3.5357726379298002E-2,8.9287593679208499E-4,4.8387055585607998E-2,3.7916377683510097E-2,9.2800224583603104E-3,3.1266412619105698E-2,2.9796133520991201E-3,0.52010000000000001]
["P9804","Apontador","mês",0,0.08,2.5000000000000001E-2,1.4999999999999999E-2,1.6E-2,2E-3,0.03,0,0,0,0,7.8640334809774906E-2,9.1513675368646401E-3,4.6042046342158801E-4,1.0027034037531799E-3,9.2415879292483405E-2,7.4274027904604996E-3,1.5720693648121499E-4,0,3.2561574479424399E-2,8.2226571937509896E-4,4.4580837580202898E-2,3.8056170087463703E-2,9.2842534880756208E-3,3.1794892959184202E-2,2.7430665992089699E-3,0.5171]
["P9805","Armador","h",0,0.08,2.5000000000000001E-2,1.4999999999999999E-2,1.6E-2,2E-3,0.03,1.11111111111111E-3,0,0.18508349705450999,5.12214632207268E-2,5.67613698068241E-2,8.7402839760638597E-3,4.6014126009124901E-4,9.5091354464079498E-4,9.2359837427873598E-2,7.4228987430525004E-3,7.7185963318835905E-6,0,4.4473625608209298E-2,1.22517431851162E-3,6.6385080097007304E-2,4.4896259956163698E-2,9.2786234288156199E-3,6.8153151573892706E-2,3.7650806389650498E-3,0.81030000000000002]
["P9806","Auxiliar administrativo","mês",0,0.08,2.5000000000000001E-2,1.4999999999999999E-2,1.6E-2,2E-3,0.03,0,0,0,0,6.8100723897950896E-2,9.1591321678983692E-3,4.6081111487389202E-4,6.5573773774054605E-4,9.2494291092847902E-2,7.4337046947359504E-3,1.35216409609102E-3,0,4.0301809886868503E-2,1.01772709792288E-3,5.52249975591797E-2,3.7749010073668397E-2,9.2921308684199393E-3,3.0182302886759299E-2,3.39512294340052E-3,0.52480000000000004]
["P9807","Bombeiro hidráulico","h",0,0.08,2.5000000000000001E-2,1.4999999999999999E-2,1.6E-2,2E-3,0.03,1.11111111111111E-3,0,0.18706780781879201,5.1778977831291297E-2,7.2081143408337697E-2,8.7405559992157593E-3,4.60155581030504E-4,9.7417162267307404E-4,9.2362711935630407E-2,7.4231297653302502E-3,1.55975554197209E-5,0,3.7322062355058999E-2,9.42480606100203E-4,5.10691391725029E-2,4.5468936048567103E-2,9.2789122066628104E-3,7.1179585645552407E-2,3.145148930903E-3,0.80840000000000001]
["P9808","Carpinteiro","h",0,0.08,2.5000000000000001E-2,1.4999999999999999E-2,1.6E-2,2E-3,0.03,0,0,0.18670515857421199,5.1676804511364097E-2,6.8783549804080996E-2,9.1493588617180006E-3,4.60319403646843E-4,9.1720027145496795E-4,9.2395594512187706E-2,7.4257725161513098E-3,2.3233679086813999E-5,0,3.9749881081580903E-2,1.00378943847676E-3,5.4410576212169298E-2,4.5361183748284899E-2,9.2822156451891295E-3,7.0146214678495702E-2,3.3486271121905701E-3,0.80879999999999996]
["P9809","Encarregado administrativo","mês",0,0.08,2.5000000000000001E-2,1.4999999999999999E-2,1.6E-2,2E-3,0.03,1.11111111111111E-3,0,0,0,8.2334418162499895E-2,8.7421228091724996E-3,4.60238067355867E-4,7.1860718486364101E-4,9.2379268641714696E-2,7.4244604167930999E-3,4.4998020075693402E-4,0,3.2326239516101703E-2,7.5352882177673601E-4,4.0837940026453003E-2,3.8160291055461003E-2,9.2805755209913708E-3,3.25554270361516E-2,2.7135292575930499E-3,0.51819999999999999]
["P9810","Eletricista","h",0,0.08,2.5000000000000001E-2,1.4999999999999999E-2,1.6E-2,2E-3,0.03,0,0,0.18753838428356201,5.1910833084230397E-2,7.5083338684816203E-2,9.1503628820826903E-3,4.60369917574924E-4,1.05031648607477E-3,9.24057336989767E-2,7.4265873958540797E-3,0,0,3.5153561815383101E-2,8.8772024255118101E-4,4.81243062471527E-2,4.5600829645861499E-2,9.2832342448175998E-3,7.1404355640772896E-2,2.9614219459792499E-3,0.80640000000000001]
["P9811","Encarregado especializado","mês",0,0.08,2.5000000000000001E-2,1.4999999999999999E-2,1.6E-2,2E-3,0.03,0,0,0,0,7.7577230883724896E-2,9.1481448883423203E-3,4.6025832663491401E-4,7.8545170345927797E-4,9.2383335096696106E-2,7.4247872350770103E-3,2.2181259129643599E-5,0,3.3318098668222898E-2,8.4136995239430102E-4,4.5600549245203299E-2,3.8009644460578099E-2,9.2809840438462608E-3,3.1550633418034803E-2,2.8067980454600798E-3,0.51719999999999999]
["P9812","Engenheiro","mês",0,0.08,2.5000000000000001E-2,1.4999999999999999E-2,1.6E-2,2E-3,0.03,1.11111111111111E-3,0,0,0,8.4231003895897605E-2,8.7419842513498207E-3,4.6023077283645602E-4,7.5393007086905497E-4,9.2377804481280995E-2,7.4243427431922599E-3,3.9883469716391198E-4,0,3.0823895339647099E-2,7.1850898482282396E-4,3.8939402079143801E-2,3.8220420189202901E-2,9.2804284289903297E-3,3.2873192805440203E-2,2.5874194799384701E-3,0.51690000000000003]
["P9814","Operacional","mês",0,0.08,2.5000000000000001E-2,1.4999999999999999E-2,1.6E-2,2E-3,0.03,4.1481481481481499E-3,0,0,0,5.6595874335608802E-2,7.8130313761299395E-3,3.9655965524721298E-4,1.02619576340661E-3,9.2279868841032606E-2,7.4164717208827302E-3,4.8552222911132897E-5,0,4.4551639555878098E-2,1.22732347284438E-3,6.6443950785767994E-2,3.7298449725287001E-2,9.27058965110341E-3,2.8503697133257001E-2,3.7754126274991699E-3,0.52880000000000005]
["P9815","Jardineiro","h",0,0.08,2.5000000000000001E-2,1.4999999999999999E-2,1.6E-2,2E-3,0.03,4.1481481481481499E-3,0,0.18665007911508999,5.1661565720909401E-2,6.8774281130736498E-2,8.8074383673218196E-3,4.6017992016452797E-4,8.9926369499965903E-4,9.2367597301618296E-2,7.4235223989474203E-3,7.69230453968996E-5,0,3.9741423270264302E-2,1.00357585641208E-3,5.4382515271421197E-2,4.5347867222245902E-2,9.2794029986842698E-3,7.1806582001156194E-2,3.35207758682867E-3,0.81420000000000003]
["P9819","Engenheiro supervisor","mês",0,0.08,2.5000000000000001E-2,1.4999999999999999E-2,1.6E-2,2E-3,0.03,1.11111111111111E-3,0,0,0,8.4231003895897605E-2,8.7419842513498207E-3,4.6023077283645602E-4,7.5393007086905497E-4,9.2377804481280995E-2,7.4243427431922599E-3,3.9883469716391198E-4,0,3.0823895339647099E-2,7.1850898482282396E-4,3.8939402079143801E-2,3.8220420189202901E-2,9.2804284289903297E-3,3.2873192805440203E-2,2.5874194799384701E-3,0.51690000000000003]
["P9821","Pedreiro","h",0,0.08,2.5000000000000001E-2,1.4999999999999999E-2,1.6E-2,2E-3,0.03,0,0,0.18584229755742199,5.1434353146190201E-2,6.2085314093252499E-2,9.1494780581014307E-3,4.6032540061438599E-4,9.3445919937549995E-4,9.2396798227210503E-2,7.4258692579275897E-3,1.9021916110185199E-5,0,4.4643896956373302E-2,1.1273762596995E-3,6.1110416876361401E-2,4.5111933339398599E-2,9.2823365724094796E-3,6.8837650031842404E-2,3.76091096813938E-3,0.81159999999999999]
["P9822","Pintor","h",0,0.08,2.5000000000000001E-2,1.4999999999999999E-2,1.6E-2,2E-3,0.03,1.11111111111111E-3,0,0.184810125053949,5.1144677022612897E-2,5.4687352242000199E-2,8.7400144431037906E-3,4.6012707025071102E-4,9.2074007471795998E-4,9.2356989234331902E-2,7.4226698356307302E-3,7.0262358162794701E-6,0,4.5861950751899298E-2,1.26342036408428E-3,6.8455300070442399E-2,4.4817591078797202E-2,9.2783372945384208E-3,6.7737408409477007E-2,3.88261448172264E-3,0.81100000000000005]
["P9823","Serralheiro","h",0,0.08,2.5000000000000001E-2,1.4999999999999999E-2,1.6E-2,2E-3,0.03,1.11111111111111E-3,0,0.18622325148652899,5.1541664155104798E-2,6.5515043846266593E-2,8.7407307508166297E-3,4.60164781008679E-4,9.8105331621635601E-4,9.23645585609221E-2,7.4232781773775E-3,2.8702899441102599E-5,0,4.2121619715140599E-2,1.0636821004524899E-3,5.7637700901629597E-2,4.5224910335157797E-2,9.2790977217218802E-3,6.9889977535104994E-2,3.5496100390877698E-3,0.81120000000000003]
["P9824","Servente","h",0,0.08,2.5000000000000001E-2,1.4999999999999999E-2,1.6E-2,2E-3,0.03,0,0,0.18599407413254601,5.14768459931964E-2,6.2992281890531798E-2,9.1512597665585702E-3,4.6041504131892798E-4,1.13428029830319E-3,9.2414790964694404E-2,7.4273153222795098E-3,1.41233518498324E-5,0,4.3990275980440197E-2,1.1108706044734599E-3,6.0227439395727403E-2,4.5154092376360901E-2,9.2841441528493801E-3,6.9058984975894896E-2,3.70584833998676E-3,0.81159999999999999]
["P9825","Soldador","h",0,0.08,2.5000000000000001E-2,1.4999999999999999E-2,1.6E-2,2E-3,0.03,1.11111111111111E-3,0,0.18601379961610701,5.14828131228958E-2,6.3892431209004397E-2,8.7407372854799107E-3,4.6016512503276399E-4,9.69089435067086E-4,9.2364627613648498E-2,7.4232837270992204E-3,4.1391228617621101E-5,0,4.3307459597547102E-2,1.09362768814472E-3,5.92604056091936E-2,4.5164426827614498E-2,9.2791046588740298E-3,6.9570338998712594E-2,3.6495413612878001E-3,0.81179999999999997]
["P9826","Chefe setor de finanças","mês",0,0.08,2.5000000000000001E-2,1.4999999999999999E-2,1.6E-2,2E-3,0.03,4.1481481481481499E-3,0,0,0,9.9092206470654295E-2,8.8152683270863192E-3,4.6058902779708198E-4,3.9155514484932001E-4,9.2449713637861794E-2,7.4301220343090798E-3,1.4734996879535501E-3,0,2.20626736745528E-2,4.4571260525028199E-4,2.4174078379828101E-2,3.8723614538576402E-2,9.2876525428863405E-3,3.6170555989934003E-2,1.84174249356434E-3,0.51500000000000001]
["P9827","Vigia","mês",0,0.08,2.5000000000000001E-2,1.4999999999999999E-2,1.6E-2,2E-3,0.03,0,0,0,0,8.5096183664630107E-2,9.15036587609519E-3,4.6037006820865301E-4,1.05064403124449E-3,9.2405763934271801E-2,7.4265898258446504E-3,0,0,3.01594125134634E-2,7.0301980425000398E-4,3.81115015810655E-2,3.8258877356809398E-2,9.2832372823058104E-3,3.28591061232495E-2,2.53086032819107E-3,0.51549999999999996]
["P9830","Montador","h",0,0.08,2.5000000000000001E-2,1.4999999999999999E-2,1.6E-2,2E-3,0.03,1.11111111111111E-3,0,0.18547922593129501,5.1332574608909602E-2,5.96879049633013E-2,8.7411554358815102E-3,4.6018713899171801E-4,1.0491277694319599E-3,9.2369046269062699E-2,7.4236388514978104E-3,9.3012359533390506E-6,0,4.2517026603843697E-2,1.17127327448854E-3,6.3470823395449003E-2,4.50096691905384E-2,9.2795485643722593E-3,6.8752487874998103E-2,3.5994374531709999E-3,0.8095]
["P9833","Auxiliar de laboratório","mês",0,0.08,2.5000000000000001E-2,1.4999999999999999E-2,1.6E-2,2E-3,0.03,1.11111111111111E-3,0,0,0,6.5481971092815505E-2,8.7409538244430894E-3,4.6017652494970601E-4,1.0060306880481E-3,9.2366915812005901E-2,7.4234676280802497E-3,2.92698868894329E-5,0,4.2147010540428499E-2,1.0643232858237399E-3,5.7673916656525603E-2,3.7616281134631398E-2,9.2793345351003097E-3,2.96804857184341E-2,3.5517497366813599E-3,0.52559999999999996]
["P9836","Geólogo","h",0,0.08,2.5000000000000001E-2,1.4999999999999999E-2,1.6E-2,2E-3,0.03,4.1481481481481499E-3,0,0.1879971202064,5.20394649922876E-2,7.8176037829769507E-2,8.8140111484137206E-3,4.6052334145821002E-4,7.2804497599620905E-4,9.2436529035424098E-2,7.4290623965748903E-3,9.9383656410944004E-4,0,3.29134498171475E-2,8.3115150061660603E-4,4.5072667550796003E-2,4.5730388175693901E-2,9.2863279957186105E-3,7.3864403056279102E-2,2.7761571770334999E-3,0.81169999999999998]
["P9837","Oceanógrafo","mês",0,0.08,2.5000000000000001E-2,1.4999999999999999E-2,1.6E-2,2E-3,0.03,4.1481481481481499E-3,0,0,0,8.0863452140404898E-2,7.8173719862504199E-3,3.9677996805156202E-4,8.2795755455076798E-4,9.2331135873420497E-2,7.4205920181988601E-3,8.0171892343324001E-4,0,3.0883614526737199E-2,7.7989280069296302E-4,4.2244729024155797E-2,3.80946882708579E-2,9.2757400227485697E-3,3.2787165605263499E-2,2.60494626353234E-3,0.51929999999999998]
["P9840","Encarregado geral","mês",0,0.08,2.5000000000000001E-2,1.4999999999999999E-2,1.6E-2,2E-3,0.03,0,0,0,0,7.7577230883724896E-2,9.1481448883423203E-3,4.6025832663491401E-4,7.8545170345927797E-4,9.2383335096696106E-2,7.4247872350770103E-3,2.2181259129643599E-5,0,3.3318098668222898E-2,8.4136995239430102E-4,4.5600549245203299E-2,3.8009644460578099E-2,9.2809840438462608E-3,3.1550633418034803E-2,2.8067980454600798E-3,0.51719999999999999]
["P9842","Faxineiro","mês",0,0.08,2.5000000000000001E-2,1.4999999999999999E-2,1.6E-2,2E-3,0.03,1.11111111111111E-3,0,0,0,6.8495559635068301E-2,8.7482660624810908E-3,4.6056148525924599E-4,4.3839079369071198E-4,9.2444185282685901E-2,7.4296777240782496E-3,1.43312633079096E-3,0,3.9986575562010497E-2,1.0097665989898599E-3,5.4763354075179599E-2,3.7742392554049702E-2,9.2870971550978194E-3,3.0346949539110098E-2,3.3696887964788998E-3,0.52510000000000001]
["P9843","Operador de equipamento leve","h",0,0.08,2.5000000000000001E-2,1.4999999999999999E-2,1.6E-2,2E-3,0.03,0,0,0.187788948822424,5.1981250202797397E-2,7.7049780830501999E-2,9.1501863495196799E-3,4.6036103592918699E-4,1.0310038117742901E-3,9.2403950969568299E-2,7.4264441190765003E-3,0,0,3.3716040802500902E-2,8.5141904186688102E-4,4.6155487128922403E-2,4.5673341636530897E-2,9.2830551488456304E-3,7.1785043591787306E-2,2.84032166323371E-3,0.80559999999999998]
["P9844","Capitão fluvial","mês",0,0.08,2.5000000000000001E-2,1.4999999999999999E-2,1.6E-2,2E-3,0.03,4.1481481481481499E-3,0,0,0,8.6227539735521802E-2,7.8111160238971099E-3,3.9646243927756402E-4,5.2955379967680404E-4,9.2257246577749502E-2,7.41465358461955E-3,2.9956457671186099E-4,0,2.9154270238314801E-2,6.7958980788641703E-4,3.67821223681443E-2,3.82379563755985E-2,9.2683169807744395E-3,3.3557894946506898E-2,2.4493317459931799E-3,0.51719999999999999]
["P9845","Operador de equipamento pesado","h",0,0.08,2.5000000000000001E-2,1.4999999999999999E-2,1.6E-2,2E-3,0.03,0,0,0.187788948822424,5.1981250202797397E-2,7.7049780830501999E-2,9.1501863495196799E-3,4.6036103592918699E-4,1.0310038117742901E-3,9.2403950969568299E-2,7.4264441190765003E-3,0,0,3.3716040802500902E-2,8.5141904186688102E-4,4.6155487128922403E-2,4.5673341636530897E-2,9.2830551488456304E-3,7.1785043591787306E-2,2.84032166323371E-3,0.80559999999999998]
["P9846","Operador de equipamento especial","h",0,0.08,2.5000000000000001E-2,1.4999999999999999E-2,1.6E-2,2E-3,0.03,0,0,0.187788948822424,5.1981250202797397E-2,7.7049780830501999E-2,9.1501863495196799E-3,4.6036103592918699E-4,1.0310038117742901E-3,9.2403950969568299E-2,7.4264441190765003E-3,0,0,3.3716040802500902E-2,8.5141904186688102E-4,4.6155487128922403E-2,4.5673341636530897E-2,9.2830551488456304E-3,7.1785043591787306E-2,2.84032166323371E-3,0.80559999999999998]
["P9847","Perfurador de tubulão","h",0,0.08,2.5000000000000001E-2,1.4999999999999999E-2,1.6E-2,2E-3,0.03,0,0,0.18599407413254601,5.14768459931964E-2,6.2992281890531798E-2,9.1512597665585702E-3,4.6041504131892798E-4,1.13428029830319E-3,9.2414790964694404E-2,7.4273153222795098E-3,1.41233518498324E-5,0,4.3990275980440197E-2,1.1108706044734599E-3,6.0227439395727403E-2,4.5154092376360901E-2,9.2841441528493801E-3,6.9058984975894896E-2,3.70584833998676E-3,0.81159999999999999]
["P9848","Desenhista","mês",0,0.08,2.5000000000000001E-2,1.4999999999999999E-2,1.6E-2,2E-3,0.03,1.11111111111111E-3,0,0,0,7.4769654098380406E-2,8.7457807682996894E-3,4.6043064438502901E-4,7.5974030173713697E-4,9.2417922821742493E-2,7.4275670275487397E-3,8.2715474085712204E-4,0,3.53899038460826E-2,8.9368850277810801E-4,4.8454242997276298E-2,3.7933064012894403E-2,9.2844587844359196E-3,3.1354595234810101E-2,2.9823249633786401E-3,0.52080000000000004]
["P9849","Condutor maquinista fluvial","mês",0,0.08,2.5000000000000001E-2,1.4999999999999999E-2,1.6E-2,2E-3,0.03,4.1481481481481499E-3,0,0,0,7.9527518793611598E-2,7.8108087540942504E-3,3.9644684343502501E-4,7.5327525819031199E-4,9.2253617408001906E-2,7.4143619106592203E-3,3.6735024566758397E-5,0,3.1811414344570098E-2,8.0332219551932597E-4,4.3477304417057702E-2,3.8022168447761899E-2,9.2679523883240304E-3,3.2397035816200501E-2,2.68320357589056E-3,0.51880000000000004]
["P9850","Copeiro","mês",0,0.08,2.5000000000000001E-2,1.4999999999999999E-2,1.6E-2,2E-3,0.03,1.11111111111111E-3,0,0,0,8.4735729183141095E-2,8.7474267233180296E-3,4.6051729738375003E-4,1.8336940225518699E-4,9.2435315865072004E-2,7.4289648948800803E-3,1.5926976458049899E-3,0,3.04660948466716E-2,7.1016860908042797E-4,3.8511358636954998E-2,3.8258688672379401E-2,9.2862061186001002E-3,3.3075431108893702E-2,2.5573849902915499E-3,0.51759999999999995]
["P9851","Médico do trabalho","mês",0,0.08,2.5000000000000001E-2,1.4999999999999999E-2,1.6E-2,2E-3,0.03,4.1481481481481499E-3,0,0,0,7.5127053881813802E-2,8.8071467803249402E-3,4.60164685033114E-4,4.2596706636568798E-4,9.2364539296647605E-2,7.4232766291205598E-3,5.1677839612025603E-4,0,3.5097153348693302E-2,8.8629577984681099E-4,4.8025665180383002E-2,3.7923997655533601E-2,9.2790957864007009E-3,3.18689133135652E-2,2.96034644510761E-3,0.52329999999999999]
["P9852","Blaster","h",0,0.08,2.5000000000000001E-2,1.4999999999999999E-2,1.6E-2,2E-3,0.03,4.1481481481481499E-3,0,0.18769948012891599,5.1956444485409398E-2,7.6942376426887699E-2,8.80715937803421E-3,4.6016534325093002E-4,9.4461767659208002E-4,9.2364671414533403E-2,7.4232872473472301E-3,0,0,3.3770596167597901E-2,8.5279670886377504E-4,4.62105187924901E-2,4.56511424672311E-2,9.2791090591840299E-3,7.3438090495011599E-2,2.8484550675855701E-3,0.81079999999999997]
["P9853","Pré-marcador","h",0,0.08,2.5000000000000001E-2,1.4999999999999999E-2,1.6E-2,2E-3,0.03,0,0,0.18599407413254601,5.14768459931964E-2,6.2992281890531798E-2,9.1512597665585702E-3,4.6041504131892798E-4,1.13428029830319E-3,9.2414790964694404E-2,7.4273153222795098E-3,1.41233518498324E-5,0,4.3990275980440197E-2,1.1108706044734599E-3,6.0227439395727403E-2,4.5154092376360901E-2,9.2841441528493801E-3,6.9058984975894896E-2,3.70584833998676E-3,0.81159999999999999]
["P9854","Recepcionista","mês",0,0.08,2.5000000000000001E-2,1.4999999999999999E-2,1.6E-2,2E-3,0.03,1.11111111111111E-3,0,0,0,7.0678505086725199E-2,8.7520644208701603E-3,4.60761453752285E-4,2.7252665199865102E-4,9.2484323081900105E-2,7.4329035723217501E-3,2.0341354668193699E-3,0,3.8415050958105199E-2,9.7008145385775099E-4,5.2633925689141603E-2,3.7827687031500398E-2,9.2911294654021894E-3,3.07977071595264E-2,3.23725562917858E-3,0.52439999999999998]
["P9855","Marinheiro de máquinas","mês",0,0.08,2.5000000000000001E-2,1.4999999999999999E-2,1.6E-2,2E-3,0.03,4.1481481481481499E-3,0,0,0,8.2994641233818001E-2,7.8117573607434099E-3,3.9649499108830501E-4,8.6274545167415104E-4,9.2264821419985599E-2,7.4152623696551101E-3,4.8779882434606901E-5,0,3.1722133129189298E-2,7.3944702380790005E-4,4.0025120659496101E-2,3.8137424086700802E-2,9.2690779620688904E-3,3.3017068466417998E-2,2.6650650861373298E-3,0.51949999999999996]
["P9856","Marinheiro de convés","h",0,0.08,2.5000000000000001E-2,1.4999999999999999E-2,1.6E-2,2E-3,0.03,4.1481481481481499E-3,0,0.18874929518062999,5.2252221669447797E-2,8.6489788355569794E-2,7.8121440890183197E-3,3.9651461993964101E-4,9.1416811587438304E-4,9.2269389075325406E-2,7.4156294690786804E-3,4.6906678634686398E-5,0,2.89554281015354E-2,6.7495477197473096E-4,3.6536063744864102E-2,4.5963073832112601E-2,9.26953683634835E-3,7.5116165707939095E-2,2.4326264622020399E-3,0.80740000000000001]
["P9857","Marinheiro de convés - mensalista","mês",0,0.08,2.5000000000000001E-2,1.4999999999999999E-2,1.6E-2,2E-3,0.03,4.1481481481481499E-3,0,0,0,8.6489788355569794E-2,7.8121440890183197E-3,3.9651461993964101E-4,9.1416811587438304E-4,9.2269389075325406E-2,7.4156294690786804E-3,4.6906678634686398E-5,0,2.89554281015354E-2,6.7495477197473096E-4,3.6536063744864102E-2,3.82510252929101E-2,9.26953683634835E-3,3.3628200881303499E-2,2.4326264622020399E-3,0.51719999999999999]
["P9858","Laboratorista","mês",0,0.08,2.5000000000000001E-2,1.4999999999999999E-2,1.6E-2,2E-3,0.03,1.11111111111111E-3,0,0,0,6.5481971092815505E-2,8.7409538244430894E-3,4.6017652494970601E-4,1.0060306880481E-3,9.2366915812005901E-2,7.4234676280802497E-3,2.92698868894329E-5,0,4.2147010540428499E-2,1.0643232858237399E-3,5.7673916656525603E-2,3.7616281134631398E-2,9.2793345351003097E-3,2.96804857184341E-2,3.5517497366813599E-3,0.52559999999999996]
["P9859","Trabalhador de via","h",0,0.08,2.5000000000000001E-2,1.4999999999999999E-2,1.6E-2,2E-3,0.03,0,0,0.18599407413254601,5.14768459931964E-2,6.2992281890531798E-2,9.1512597665585702E-3,4.6041504131892798E-4,1.13428029830319E-3,9.2414790964694404E-2,7.4273153222795098E-3,1.41233518498324E-5,0,4.3990275980440197E-2,1.1108706044734599E-3,6.0227439395727403E-2,4.5154092376360901E-2,9.2841441528493801E-3,6.9058984975894896E-2,3.70584833998676E-3,0.81159999999999999]
["P9861","Selecionador de material pétreo","h",0,0.08,2.5000000000000001E-2,1.4999999999999999E-2,1.6E-2,2E-3,0.03,0,0,0.18599407413254601,5.14768459931964E-2,6.2992281890531798E-2,9.1512597665585702E-3,4.6041504131892798E-4,1.13428029830319E-3,9.2414790964694404E-2,7.4273153222795098E-3,1.41233518498324E-5,0,4.3990275980440197E-2,1.1108706044734599E-3,6.0227439395727403E-2,4.5154092376360901E-2,9.2841441528493801E-3,6.9058984975894896E-2,3.70584833998676E-3,0.81159999999999999]
["P9864","Engenheiro de segurança do trabalho","mês",0,0.08,2.5000000000000001E-2,1.4999999999999999E-2,1.6E-2,2E-3,0.03,4.1481481481481499E-3,0,0,0,7.7204579116238695E-2,8.8093448053365008E-3,4.6027952966013901E-4,6.5390435841621605E-4,9.2387590980992002E-2,7.4251292776690101E-3,5.3838532430340298E-4,0,3.3592975690660699E-2,8.4831132289643596E-4,4.5978875525083999E-2,3.7999334828563699E-2,9.2814115970862605E-3,3.2274199401810297E-2,2.83347327854258E-3,0.52239999999999998]
["P9865","Técnico em enfermagem","mês",0,0.08,2.5000000000000001E-2,1.4999999999999999E-2,1.6E-2,2E-3,0.03,4.1481481481481499E-3,0,0,0,6.5462668492031903E-2,8.8189826253883604E-3,4.6078309619981302E-4,2.65274197649405E-4,9.24886671673118E-2,7.4332527035787998E-3,2.0219962522247401E-3,0,4.2224091247647901E-2,1.0662697771769601E-3,5.7855554397717203E-2,3.76624519851003E-2,9.2915658794735009E-3,3.0461894475400798E-2,3.56148366737918E-3,0.53120000000000001]
["P9866","Motorista de caminhão","h",0,0.08,2.5000000000000001E-2,1.4999999999999999E-2,1.6E-2,2E-3,0.03,0,0,0.18849234115572699,5.2178920412952898E-2,8.25579843226283E-2,9.1497708797671305E-3,4.6034013295755599E-4,9.8555139282185608E-4,9.2399755312214699E-2,7.4261069168838198E-3,0,0,3.2163759842293298E-2,7.4974139957730099E-4,4.0641689426991298E-2,4.5876824656830503E-2,9.2826336461047793E-3,7.2853329448360094E-2,2.6990573425124502E-3,0.80589999999999995]
["P9867","Técnico especializado - mensalista","mês",0,0.08,2.5000000000000001E-2,1.4999999999999999E-2,1.6E-2,2E-3,0.03,1.11111111111111E-3,0,0,0,7.0254492088485804E-2,8.7455085736697202E-3,4.6041631441813498E-4,7.5303559000972303E-4,9.24150465019523E-2,7.4273358596390702E-3,8.02734985831904E-4,0,3.8686080941672099E-2,9.7692567647206805E-4,5.2965569914117397E-2,3.7787474237248202E-2,9.2841698245488408E-3,3.05851937121242E-2,3.2600954619549298E-3,0.52349999999999997]
["P9869","Encarregado de obras de artes especiais","mês",0,0.08,2.5000000000000001E-2,1.4999999999999999E-2,1.6E-2,2E-3,0.03,0,0,0,0,7.7577230883724896E-2,9.1481448883423203E-3,4.6025832663491401E-4,7.8545170345927797E-4,9.2383335096696106E-2,7.4247872350770103E-3,2.2181259129643599E-5,0,3.3318098668222898E-2,8.4136995239430102E-4,4.5600549245203299E-2,3.8009644460578099E-2,9.2809840438462608E-3,3.1550633418034803E-2,2.8067980454600798E-3,0.51719999999999999]
["P9870","Motorista de veículo leve","h",0,0.08,2.5000000000000001E-2,1.4999999999999999E-2,1.6E-2,2E-3,0.03,1.11111111111111E-3,0,0.18722282417663499,5.1822576369956297E-2,7.33570046707296E-2,8.7400750912952404E-3,4.6013026313727E-4,8.9891712939405097E-4,9.2357630112490804E-2,7.4227213425823698E-3,3.5743413912434898E-5,0,3.6386694751226897E-2,9.1886010469812405E-4,4.9786502145924803E-2,4.5514163922244298E-2,9.2784016782279707E-3,7.1418602394638098E-2,3.06632503335932E-3,0.80779999999999996]
["P9871","Motorista de veículo especial","h",0,0.08,2.5000000000000001E-2,1.4999999999999999E-2,1.6E-2,2E-3,0.03,0,0,0.18849234115572699,5.2178920412952898E-2,8.25579843226283E-2,9.1497708797671305E-3,4.6034013295755599E-4,9.8555139282185608E-4,9.2399755312214699E-2,7.4261069168838198E-3,0,0,3.2163759842293298E-2,7.4974139957730099E-4,4.0641689426991298E-2,4.5876824656830503E-2,9.2826336461047793E-3,7.2853329448360094E-2,2.6990573425124502E-3,0.80589999999999995]
["P9875","Encarregado de turma","mês",0,0.08,2.5000000000000001E-2,1.4999999999999999E-2,1.6E-2,2E-3,0.03,0,0,0,0,7.7577230883724896E-2,9.1481448883423203E-3,4.6025832663491401E-4,7.8545170345927797E-4,9.2383335096696106E-2,7.4247872350770103E-3,2.2181259129643599E-5,0,3.3318098668222898E-2,8.4136995239430102E-4,4.5600549245203299E-2,3.8009644460578099E-2,9.2809840438462608E-3,3.1550633418034803E-2,2.8067980454600798E-3,0.51719999999999999]
["P9876","Técnico de segurança do trabalho","mês",0,0.08,2.5000000000000001E-2,1.4999999999999999E-2,1.6E-2,2E-3,0.03,1.11111111111111E-3,0,0,0,6.4407787137053196E-2,8.7461705077576998E-3,4.6045116262057099E-4,6.68660365666297E-4,9.2422041254630993E-2,7.4278980232624896E-3,9.6283776011826003E-4,0,4.29600777830337E-2,1.0848553802273299E-3,5.8821601202454797E-2,3.7603067078755499E-2,9.2848725290781108E-3,2.9610653103701E-2,3.62026732138781E-3,0.5272]
["P9878","Secretária","mês",0,0.08,2.5000000000000001E-2,1.4999999999999999E-2,1.6E-2,2E-3,0.03,4.1481481481481499E-3,0,0,0,8.40142094041441E-2,8.8198002425944402E-3,4.6082581588798201E-4,2.15348368534346E-4,9.2497241889460097E-2,7.4339418482982896E-3,2.16498572556413E-3,0,3.1081381053286401E-2,7.2451101009168796E-4,3.93154464484693E-2,3.8259403305423503E-2,9.2924273103728704E-3,3.3673271485657699E-2,2.61123371296314E-3,0.52270000000000005]
["P9880","Piloto fluvial","mês",0,0.08,2.5000000000000001E-2,1.4999999999999999E-2,1.6E-2,2E-3,0.03,4.1481481481481499E-3,0,0,0,8.6227539735521802E-2,7.8111160238971099E-3,3.9646243927756402E-4,5.2955379967680404E-4,9.2257246577749502E-2,7.41465358461955E-3,2.9956457671186099E-4,0,2.9154270238314801E-2,6.7958980788641703E-4,3.67821223681443E-2,3.82379563755985E-2,9.2683169807744395E-3,3.3557894946506898E-2,2.4493317459931799E-3,0.51719999999999999]
["P9882","Técnico especializado","h",0,0.08,2.5000000000000001E-2,1.4999999999999999E-2,1.6E-2,2E-3,0.03,1.11111111111111E-3,0,0.186932589332203,5.1740541829864102E-2,7.0254492088485804E-2,8.7455085736697202E-3,4.6041631441813498E-4,7.5303559000972303E-4,9.24150465019523E-2,7.4273358596390702E-3,8.02734985831904E-4,0,3.8686080941672099E-2,9.7692567647206805E-4,5.2965569914117397E-2,4.5425014434434398E-2,9.2841698245488408E-3,7.0947472115309398E-2,3.2600954619549298E-3,0.81020000000000003]
["P9883","Chefe do setor administrativo","mês",0,0.08,2.5000000000000001E-2,1.4999999999999999E-2,1.6E-2,2E-3,0.03,1.11111111111111E-3,0,0,0,8.2334418162499895E-2,8.7421228091724996E-3,4.60238067355867E-4,7.1860718486364101E-4,9.2379268641714696E-2,7.4244604167930999E-3,4.4998020075693402E-4,0,3.2326239516101703E-2,7.5352882177673601E-4,4.0837940026453003E-2,3.8160291055461003E-2,9.2805755209913708E-3,3.25554270361516E-2,2.7135292575930499E-3,0.51819999999999999]
["P9884","Encarregado de terraplenagem","mês",0,0.08,2.5000000000000001E-2,1.4999999999999999E-2,1.6E-2,2E-3,0.03,0,0,0,0,7.7577230883724896E-2,9.1481448883423203E-3,4.6025832663491401E-4,7.8545170345927797E-4,9.2383335096696106E-2,7.4247872350770103E-3,2.2181259129643599E-5,0,3.3318098668222898E-2,8.4136995239430102E-4,4.5600549245203299E-2,3.8009644460578099E-2,9.2809840438462608E-3,3.1550633418034803E-2,2.8067980454600798E-3,0.51719999999999999]
["P9885","Frentista de túnel","h",0,0.08,2.5000000000000001E-2,1.4999999999999999E-2,1.6E-2,2E-3,0.03,0,0,0.18599407413254601,5.14768459931964E-2,6.2992281890531798E-2,9.1512597665585702E-3,4.6041504131892798E-4,1.13428029830319E-3,9.2414790964694404E-2,7.4273153222795098E-3,1.41233518498324E-5,0,4.3990275980440197E-2,1.1108706044734599E-3,6.0227439395727403E-2,4.5154092376360901E-2,9.2841441528493801E-3,6.9058984975894896E-2,3.70584833998676E-3,0.81159999999999999]
["P9889","Técnico da qualidade","mês",0,0.08,2.5000000000000001E-2,1.4999999999999999E-2,1.6E-2,2E-3,0.03,1.11111111111111E-3,0,0,0,7.0444966984353097E-2,8.7454105182107802E-3,4.6041115218741602E-4,7.4005108307081502E-4,9.2414010335819502E-2,7.4272525836557102E-3,8.0450818495309895E-4,0,3.8546381071823399E-2,9.7339788594552601E-4,5.2773713463406299E-2,3.7793171546951998E-2,9.2840657295696401E-3,3.0615302411322799E-2,3.2483228837913202E-3,0.52339999999999998]
["P9891","Engenheiro mecânico","mês",0,0.08,2.5000000000000001E-2,1.4999999999999999E-2,1.6E-2,2E-3,0.03,4.1481481481481499E-3,0,0,0,8.3805022439158799E-2,8.8067451740776199E-3,4.60143701504974E-4,7.5725383380982299E-4,9.2360327469941703E-2,7.4229381274077801E-3,1.4007680532718899E-4,0,3.1148543333089598E-2,7.2607657151564295E-4,3.9342080854096802E-2,3.8200080241639303E-2,9.2786726592597301E-3,3.3354135374004001E-2,2.6168762038473398E-3,0.52059999999999995]
["P9892","Auxiliar de blaster","h",0,0.08,2.5000000000000001E-2,1.4999999999999999E-2,1.6E-2,2E-3,0.03,4.1481481481481499E-3,0,0.18769948012891599,5.1956444485409398E-2,7.6942376426887699E-2,8.80715937803421E-3,4.6016534325093002E-4,9.4461767659208002E-4,9.2364671414533403E-2,7.4232872473472301E-3,0,0,3.3770596167597901E-2,8.5279670886377504E-4,4.62105187924901E-2,4.56511424672311E-2,9.2791090591840299E-3,7.3438090495011599E-2,2.8484550675855701E-3,0.81079999999999997]
["P9893","Encarregado de pavimentação","mês",0,0.08,2.5000000000000001E-2,1.4999999999999999E-2,1.6E-2,2E-3,0.03,0,0,0,0,7.7577230883724896E-2,9.1481448883423203E-3,4.6025832663491401E-4,7.8545170345927797E-4,9.2383335096696106E-2,7.4247872350770103E-3,2.2181259129643599E-5,0,3.3318098668222898E-2,8.4136995239430102E-4,4.5600549245203299E-2,3.8009644460578099E-2,9.2809840438462608E-3,3.1550633418034803E-2,2.8067980454600798E-3,0.51719999999999999]
["P9896","Porteiro","mês",0,0.08,2.5000000000000001E-2,1.4999999999999999E-2,1.6E-2,2E-3,0.03,1.11111111111111E-3,0,0,0,6.1344000599168703E-2,8.7421010549740396E-3,4.6023692208366299E-4,7.1811878158315205E-4,9.2379038761971899E-2,7.4244419415109703E-3,4.4798057437087498E-4,0,4.1412107249203599E-2,1.14083458641626E-3,6.1828051083460497E-2,3.7488509396341199E-2,9.2805524268887093E-3,2.9005247573719899E-2,3.5058963844391299E-3,0.52429999999999999]
["P9897","Técnico de meio ambiente","mês",0,0.08,2.5000000000000001E-2,1.4999999999999999E-2,1.6E-2,2E-3,0.03,4.1481481481481499E-3,0,0,0,6.4734580186079804E-2,8.8151184016583804E-3,4.6058119434215598E-4,5.79432937898971E-4,9.2448141301959302E-2,7.4299956667177201E-3,1.2682665632783299E-3,0,4.2734753765484502E-2,1.0791653539204101E-3,5.8529608216532601E-2,3.7623555720061902E-2,9.2874945833971503E-3,3.0252646975518199E-2,3.6045566184618001E-3,0.53100000000000003]
["P9900","Comprador","mês",0,0.08,2.5000000000000001E-2,1.4999999999999999E-2,1.6E-2,2E-3,0.03,1.11111111111111E-3,0,0,0,8.3784864623734703E-2,8.7443470918624495E-3,4.6035516701104499E-4,7.2758181276756997E-4,9.2402772956700296E-2,7.4263494429653203E-3,6.9537035166499503E-4,0,3.1194974408597202E-2,7.2715888588764503E-4,3.9418832651865798E-2,3.82157325262946E-2,9.2829368037066502E-3,3.2848419809098597E-2,2.61856859983455E-3,0.51770000000000005]
["P9901","Encarregado de superestrutura ferroviária","mês",0,0.08,2.5000000000000001E-2,1.4999999999999999E-2,1.6E-2,2E-3,0.03,0,0,0,0,7.7577230883724896E-2,9.1481448883423203E-3,4.6025832663491401E-4,7.8545170345927797E-4,9.2383335096696106E-2,7.4247872350770103E-3,2.2181259129643599E-5,0,3.3318098668222898E-2,8.4136995239430102E-4,4.5600549245203299E-2,3.8009644460578099E-2,9.2809840438462608E-3,3.1550633418034803E-2,2.8067980454600798E-3,0.51719999999999999]
["P9903","Auxiliar técnico","mês",0,0.08,2.5000000000000001E-2,1.4999999999999999E-2,1.6E-2,2E-3,0.03,1.11111111111111E-3,0,0,0,7.0254492088485804E-2,8.7455085736697202E-3,4.6041631441813498E-4,7.5303559000972303E-4,9.24150465019523E-2,7.4273358596390702E-3,8.02734985831904E-4,0,3.8686080941672099E-2,9.7692567647206805E-4,5.2965569914117397E-2,3.7787474237248202E-2,9.2841698245488408E-3,3.05851937121242E-2,3.2600954619549298E-3,0.52349999999999997]
["P9907","Comandante de longo curso","mês",0,0.08,2.5000000000000001E-2,1.4999999999999999E-2,1.6E-2,2E-3,0.03,4.1481481481481499E-3,0,0,0,8.6227539735521802E-2,7.8111160238971099E-3,3.9646243927756402E-4,5.2955379967680404E-4,9.2257246577749502E-2,7.41465358461955E-3,2.9956457671186099E-4,0,2.9154270238314801E-2,6.7958980788641703E-4,3.67821223681443E-2,3.82379563755985E-2,9.2683169807744395E-3,3.3557894946506898E-2,2.4493317459931799E-3,0.51719999999999999]
["P9908","Imediato","mês",0,0.08,2.5000000000000001E-2,1.4999999999999999E-2,1.6E-2,2E-3,0.03,4.1481481481481499E-3,0,0,0,8.6227539735521802E-2,7.8111160238971099E-3,3.9646243927756402E-4,5.2955379967680404E-4,9.2257246577749502E-2,7.41465358461955E-3,2.9956457671186099E-4,0,2.9154270238314801E-2,6.7958980788641703E-4,3.67821223681443E-2,3.82379563755985E-2,9.2683169807744395E-3,3.3557894946506898E-2,2.4493317459931799E-3,0.51719999999999999]
["P9909","Oficial de náutica","mês",0,0.08,2.5000000000000001E-2,1.4999999999999999E-2,1.6E-2,2E-3,0.03,4.1481481481481499E-3,0,0,0,8.1259718437966297E-2,7.8153523010213496E-3,3.96677456537197E-4,8.3368583478416597E-4,9.2307281331045599E-2,7.4186748444841502E-3,5.3764226236383298E-4,0,3.0578566333336998E-2,7.7218952847101299E-4,4.1816656670094501E-2,3.8098209038982499E-2,9.2733435556051902E-3,3.28061060337854E-2,2.5792163040126402E-3,0.51859999999999995]
["P9910","Oficial de máquinas","mês",0,0.08,2.5000000000000001E-2,1.4999999999999999E-2,1.6E-2,2E-3,0.03,4.1481481481481499E-3,0,0,0,8.6054842268257506E-2,7.8123960072753297E-3,3.9652740634895398E-4,8.0735876765906803E-4,9.2272364486865002E-2,7.4158686009263798E-3,1.8577969901366101E-4,0,2.9302329160405299E-2,6.8304108049920605E-4,3.6974977047562502E-2,3.8238244391563099E-2,9.2698357511579697E-3,3.3559444365723501E-2,2.4617705899494702E-3,0.51759999999999995]
["P9911","Condutor de máquinas","mês",0,0.08,2.5000000000000001E-2,1.4999999999999999E-2,1.6E-2,2E-3,0.03,4.1481481481481499E-3,0,0,0,7.9527518793611598E-2,7.8108087540942504E-3,3.9644684343502501E-4,7.5327525819031199E-4,9.2253617408001906E-2,7.4143619106592203E-3,3.6735024566758397E-5,0,3.1811414344570098E-2,8.0332219551932597E-4,4.3477304417057702E-2,3.8022168447761899E-2,9.2679523883240304E-3,3.2397035816200501E-2,2.68320357589056E-3,0.51880000000000004]
["P9912","Capitão fluvial com periculosidade","h",0,0.08,2.5000000000000001E-2,1.4999999999999999E-2,1.6E-2,2E-3,0.03,4.1481481481481499E-3,0,0.188692052889296,5.2236240920561901E-2,8.6227539735521802E-2,7.8111160238971099E-3,3.9646243927756402E-4,5.2955379967680404E-4,9.2257246577749502E-2,7.41465358461955E-3,2.9956457671186099E-4,0,2.9154270238314801E-2,6.7958980788641703E-4,3.67821223681443E-2,4.5947661777513998E-2,9.2683169807744395E-3,7.5033254562366897E-2,2.4493317459931799E-3,0.80730000000000002]
["P9913","Draguista","mês",0,0.08,2.5000000000000001E-2,1.4999999999999999E-2,1.6E-2,2E-3,0.03,4.1481481481481499E-3,0,0,0,8.6227539735521802E-2,7.8111160238971099E-3,3.9646243927756402E-4,5.2955379967680404E-4,9.2257246577749502E-2,7.41465358461955E-3,2.9956457671186099E-4,0,2.9154270238314801E-2,6.7958980788641703E-4,3.67821223681443E-2,3.82379563755985E-2,9.2683169807744395E-3,3.3557894946506898E-2,2.4493317459931799E-3,0.51719999999999999]
["P9915","Maquinista","h",0,0.08,2.5000000000000001E-2,1.4999999999999999E-2,1.6E-2,2E-3,0.03,4.1481481481481499E-3,0,0.17236122500913401,4.7647242473901001E-2,0,8.8021728369743705E-3,4.59904801425815E-4,3.7789108287093602E-4,9.2312375298757798E-2,7.4190842432832601E-3,0,0,0.1,3.0303168044703201E-3,0.12308316706501,4.2540156663883097E-2,9.2738553041040693E-3,5.6702139089963799E-2,8.5216634261917803E-3,0.84470000000000001]
["P9916","Encarregado de conservação rodoviária","mês",0,0.08,2.5000000000000001E-2,1.4999999999999999E-2,1.6E-2,2E-3,0.03,0,0,0,0,7.7577230883724896E-2,9.1481448883423203E-3,4.6025832663491401E-4,7.8545170345927797E-4,9.2383335096696106E-2,7.4247872350770103E-3,2.2181259129643599E-5,0,3.3318098668222898E-2,8.4136995239430102E-4,4.5600549245203299E-2,3.8009644460578099E-2,9.2809840438462608E-3,3.1550633418034803E-2,2.8067980454600798E-3,0.51719999999999999]
["P9920","Mestre fluvial","mês",0,0.08,2.5000000000000001E-2,1.4999999999999999E-2,1.6E-2,2E-3,0.03,4.1481481481481499E-3,0,0,0,8.6227539735521802E-2,7.8111160238971099E-3,3.9646243927756402E-4,5.2955379967680404E-4,9.2257246577749502E-2,7.41465358461955E-3,2.9956457671186099E-4,0,2.9154270238314801E-2,6.7958980788641703E-4,3.67821223681443E-2,3.82379563755985E-2,9.2683169807744395E-3,3.3557894946506898E-2,2.4493317459931799E-3,0.51719999999999999]
["P9921","Mergulhador raso autônomo de emergência","h",0,0.08,2.5000000000000001E-2,1.4999999999999999E-2,1.6E-2,2E-3,0.03,4.1481481481481499E-3,0.12,0.18824757880885201,5.2111181610385401E-2,8.24805542649137E-2,7.8128539725600896E-3,3.9655065091904503E-4,9.8620348563010205E-4,9.2277773523943896E-2,7.4163033216410497E-3,6.5783863433166101E-5,0,3.21387510199646E-2,7.4915844069604897E-4,4.0556477100344698E-2,4.5817433072072901E-2,9.2703791520513095E-3,0.12614804638022101,2.7899653327160701E-3,0.98140000000000005]
["P9922","Mergulhador raso dependente de emergência","h",0,0.08,2.5000000000000001E-2,1.4999999999999999E-2,1.6E-2,2E-3,0.03,4.1481481481481499E-3,0,0.18824757880885201,5.2111181610385401E-2,8.24805542649137E-2,7.8128539725600896E-3,3.9655065091904503E-4,9.8620348563010205E-4,9.2277773523943896E-2,7.4163033216410497E-3,6.5783863433166101E-5,0,3.21387510199646E-2,7.4915844069604897E-4,4.0556477100344698E-2,4.5817433072072901E-2,9.2703791520513095E-3,7.4332672359947796E-2,2.7000663198325399E-3,0.8095]
["P9924","Mergulhador raso dependente","h",0,0.08,2.5000000000000001E-2,1.4999999999999999E-2,1.6E-2,2E-3,0.03,4.1481481481481499E-3,0,0.18824757880885201,5.2111181610385401E-2,8.24805542649137E-2,7.8128539725600896E-3,3.9655065091904503E-4,9.8620348563010205E-4,9.2277773523943896E-2,7.4163033216410497E-3,6.5783863433166101E-5,0,3.21387510199646E-2,7.4915844069604897E-4,4.0556477100344698E-2,4.5817433072072901E-2,9.2703791520513095E-3,7.4332672359947796E-2,2.7000663198325399E-3,0.8095]
["P9925","Mergulhador raso autônomo","h",0,0.08,2.5000000000000001E-2,1.4999999999999999E-2,1.6E-2,2E-3,0.03,4.1481481481481499E-3,0.12,0.18824757880885201,5.2111181610385401E-2,8.24805542649137E-2,7.8128539725600896E-3,3.9655065091904503E-4,9.8620348563010205E-4,9.2277773523943896E-2,7.4163033216410497E-3,6.5783863433166101E-5,0,3.21387510199646E-2,7.4915844069604897E-4,4.0556477100344698E-2,4.5817433072072901E-2,9.2703791520513095E-3,0.12614804638022101,2.7899653327160701E-3,0.98140000000000005]
["P9926","Mergulhador raso auxiliar de superfície","h",0,0.08,2.5000000000000001E-2,1.4999999999999999E-2,1.6E-2,2E-3,0.03,4.1481481481481499E-3,0.12,0.18824757880885201,5.2111181610385401E-2,8.24805542649137E-2,7.8128539725600896E-3,3.9655065091904503E-4,9.8620348563010205E-4,9.2277773523943896E-2,7.4163033216410497E-3,6.5783863433166101E-5,0,3.21387510199646E-2,7.4915844069604897E-4,4.0556477100344698E-2,4.5817433072072901E-2,9.2703791520513095E-3,0.12614804638022101,2.7899653327160701E-3,0.98140000000000005]
["P9927","Frentista de túnel com periculosidade","h",0,0.08,2.5000000000000001E-2,1.4999999999999999E-2,1.6E-2,2E-3,0.03,0,0,0.18599407413254601,5.14768459931964E-2,6.2992281890531798E-2,9.1512597665585702E-3,4.6041504131892798E-4,1.13428029830319E-3,9.2414790964694404E-2,7.4273153222795098E-3,1.41233518498324E-5,0,4.3990275980440197E-2,1.1108706044734599E-3,6.0227439395727403E-2,4.5154092376360901E-2,9.2841441528493801E-3,6.9058984975894896E-2,3.70584833998676E-3,0.81159999999999999]
["P9928","Servente com periculosidade","h",0,0.08,2.5000000000000001E-2,1.4999999999999999E-2,1.6E-2,2E-3,0.03,0,0,0.18599407413254601,5.14768459931964E-2,6.2992281890531798E-2,9.1512597665585702E-3,4.6041504131892798E-4,1.13428029830319E-3,9.2414790964694404E-2,7.4273153222795098E-3,1.41233518498324E-5,0,4.3990275980440197E-2,1.1108706044734599E-3,6.0227439395727403E-2,4.5154092376360901E-2,9.2841441528493801E-3,6.9058984975894896E-2,3.70584833998676E-3,0.81159999999999999]
["P9929","Bombeiro hidráulico com periculosidade","h",0,0.08,2.5000000000000001E-2,1.4999999999999999E-2,1.6E-2,2E-3,0.03,1.11111111111111E-3,0,0.18706780781879201,5.1778977831291297E-2,7.2081143408337697E-2,8.7405559992157593E-3,4.60155581030504E-4,9.7417162267307404E-4,9.2362711935630407E-2,7.4231297653302502E-3,1.55975554197209E-5,0,3.7322062355058999E-2,9.42480606100203E-4,5.10691391725029E-2,4.5468936048567103E-2,9.2789122066628104E-3,7.1179585645552407E-2,3.145148930903E-3,0.80840000000000001]
["P9930","Eletricista com periculosidade","h",0,0.08,2.5000000000000001E-2,1.4999999999999999E-2,1.6E-2,2E-3,0.03,0,0,0.18753838428356201,5.1910833084230397E-2,7.5083338684816203E-2,9.1503628820826903E-3,4.60369917574924E-4,1.05031648607477E-3,9.24057336989767E-2,7.4265873958540797E-3,0,0,3.5153561815383101E-2,8.8772024255118101E-4,4.81243062471527E-2,4.5600829645861499E-2,9.2832342448175998E-3,7.1404355640772896E-2,2.9614219459792499E-3,0.80640000000000001]
["P9931","Operador de equipamento de mergulho","h",0,0.08,2.5000000000000001E-2,1.4999999999999999E-2,1.6E-2,2E-3,0.03,4.1481481481481499E-3,0.12,0.18824757880885201,5.2111181610385401E-2,8.24805542649137E-2,7.8128539725600896E-3,3.9655065091904503E-4,9.8620348563010205E-4,9.2277773523943896E-2,7.4163033216410497E-3,6.5783863433166101E-5,0,3.21387510199646E-2,7.4915844069604897E-4,4.0556477100344698E-2,4.5817433072072901E-2,9.2703791520513095E-3,0.12614804638022101,2.7899653327160701E-3,0.98140000000000005]
["P9932","Operador de equipamento pesado com periculosidade","h",0,0.08,2.5000000000000001E-2,1.4999999999999999E-2,1.6E-2,2E-3,0.03,0,0,0.187788948822424,5.1981250202797397E-2,7.7049780830501999E-2,9.1501863495196799E-3,4.6036103592918699E-4,1.0310038117742901E-3,9.2403950969568299E-2,7.4264441190765003E-3,0,0,3.3716040802500902E-2,8.5141904186688102E-4,4.6155487128922403E-2,4.5673341636530897E-2,9.2830551488456304E-3,7.1785043591787306E-2,2.84032166323371E-3,0.80559999999999998]
["P9933","Supervisor de mergulho raso","mês",0,0.08,2.5000000000000001E-2,1.4999999999999999E-2,1.6E-2,2E-3,0.03,4.1481481481481499E-3,0.12,0,0,8.24805542649137E-2,7.8128539725600896E-3,3.9655065091904503E-4,9.8620348563010205E-4,9.2277773523943896E-2,7.4163033216410497E-3,6.5783863433166101E-5,0,3.21387510199646E-2,7.4915844069604897E-4,4.0556477100344698E-2,3.81259527386573E-2,9.2703791520513095E-3,5.5927679632556598E-2,2.7899653327160701E-3,0.66310000000000002]
["P9934","Motorista de veículo especial com periculosidade","h",0,0.08,2.5000000000000001E-2,1.4999999999999999E-2,1.6E-2,2E-3,0.03,0,0,0.18849234115572699,5.2178920412952898E-2,8.25579843226283E-2,9.1497708797671305E-3,4.6034013295755599E-4,9.8555139282185608E-4,9.2399755312214699E-2,7.4261069168838198E-3,0,0,3.2163759842293298E-2,7.4974139957730099E-4,4.0641689426991298E-2,4.5876824656830503E-2,9.2826336461047793E-3,7.2853329448360094E-2,2.6990573425124502E-3,0.80589999999999995]
["P9938","Operador de equipamento leve com periculosidade","h",0,0.08,2.5000000000000001E-2,1.4999999999999999E-2,1.6E-2,2E-3,0.03,0,0,0.187788948822424,5.1981250202797397E-2,7.7049780830501999E-2,9.1501863495196799E-3,4.6036103592918699E-4,1.0310038117742901E-3,9.2403950969568299E-2,7.4264441190765003E-3,0,0,3.3716040802500902E-2,8.5141904186688102E-4,4.6155487128922403E-2,4.5673341636530897E-2,9.2830551488456304E-3,7.1785043591787306E-2,2.84032166323371E-3,0.80559999999999998]
["P9939","Operador de equipamento leve com insalubridade","h",0,0.08,2.5000000000000001E-2,1.4999999999999999E-2,1.6E-2,2E-3,0.03,0,0.12,0.187788948822424,5.1981250202797397E-2,7.7049780830501999E-2,9.1501863495196799E-3,4.6036103592918699E-4,1.0310038117742901E-3,9.2403950969568299E-2,7.4264441190765003E-3,0,0,3.3716040802500902E-2,8.5141904186688102E-4,4.6155487128922403E-2,4.5673341636530897E-2,9.2830551488456304E-3,0.123060074728778,2.9424919482577399E-3,0.97699999999999998]
["P9940","Piloto fluvial com periculosidade","h",0,0.08,2.5000000000000001E-2,1.4999999999999999E-2,1.6E-2,2E-3,0.03,4.1481481481481499E-3,0,0.188692052889296,5.2236240920561901E-2,8.6227539735521802E-2,7.8111160238971099E-3,3.9646243927756402E-4,5.2955379967680404E-4,9.2257246577749502E-2,7.41465358461955E-3,2.9956457671186099E-4,0,2.9154270238314801E-2,6.7958980788641703E-4,3.67821223681443E-2,4.5947661777513998E-2,9.2683169807744395E-3,7.5033254562366897E-2,2.4493317459931799E-3,0.80730000000000002]
["P9941","Mestre fluvial com periculosidade","h",0,0.08,2.5000000000000001E-2,1.4999999999999999E-2,1.6E-2,2E-3,0.03,4.1481481481481499E-3,0,0.188692052889296,5.2236240920561901E-2,8.6227539735521802E-2,7.8111160238971099E-3,3.9646243927756402E-4,5.2955379967680404E-4,9.2257246577749502E-2,7.41465358461955E-3,2.9956457671186099E-4,0,2.9154270238314801E-2,6.7958980788641703E-4,3.67821223681443E-2,4.5947661777513998E-2,9.2683169807744395E-3,7.5033254562366897E-2,2.4493317459931799E-3,0.80730000000000002]
["P9942","Marinheiro de convés com periculosidade","h",0,0.08,2.5000000000000001E-2,1.4999999999999999E-2,1.6E-2,2E-3,0.03,4.1481481481481499E-3,0,0.18874929518062999,5.2252221669447797E-2,8.6489788355569794E-2,7.8121440890183197E-3,3.9651461993964101E-4,9.1416811587438304E-4,9.2269389075325406E-2,7.4156294690786804E-3,4.6906678634686398E-5,0,2.89554281015354E-2,6.7495477197473096E-4,3.6536063744864102E-2,4.5963073832112601E-2,9.26953683634835E-3,7.5116165707939095E-2,2.4326264622020399E-3,0.80740000000000001]
["P9943","Técnico de batimetria com periculosidade","h",0,0.08,2.5000000000000001E-2,1.4999999999999999E-2,1.6E-2,2E-3,0.03,4.1481481481481499E-3,0,0.18799624195933501,5.2040625062949597E-2,8.0644620439093997E-2,7.81222934313088E-3,3.96518947113034E-4,9.3482030654603199E-4,9.2270396013342998E-2,7.4157103960178399E-3,3.7194229452979501E-5,0,3.1004784688995202E-2,7.8295266718372001E-4,4.2382574245363298E-2,4.5745547414303402E-2,9.2696379950222996E-3,7.3945954145465703E-2,2.6151666268629499E-3,0.80740000000000001]
["P9944","Operador de equipamento especial com periculosidade","h",0,0.08,2.5000000000000001E-2,1.4999999999999999E-2,1.6E-2,2E-3,0.03,0,0,0.187788948822424,5.1981250202797397E-2,7.7049780830501999E-2,9.1501863495196799E-3,4.6036103592918699E-4,1.0310038117742901E-3,9.2403950969568299E-2,7.4264441190765003E-3,0,0,3.3716040802500902E-2,8.5141904186688102E-4,4.6155487128922403E-2,4.5673341636530897E-2,9.2830551488456304E-3,7.1785043591787306E-2,2.84032166323371E-3,0.80559999999999998]
["P9945","Draguista com periculosidade","h",0,0.08,2.5000000000000001E-2,1.4999999999999999E-2,1.6E-2,2E-3,0.03,4.1481481481481499E-3,0,0.188692052889296,5.2236240920561901E-2,8.6227539735521802E-2,7.8111160238971099E-3,3.9646243927756402E-4,5.2955379967680404E-4,9.2257246577749502E-2,7.41465358461955E-3,2.9956457671186099E-4,0,2.9154270238314801E-2,6.7958980788641703E-4,3.67821223681443E-2,4.5947661777513998E-2,9.2683169807744395E-3,7.5033254562366897E-2,2.4493317459931799E-3,0.80730000000000002]
["P9946","Engenheiro auxiliar","mês",0,0.08,2.5000000000000001E-2,1.4999999999999999E-2,1.6E-2,2E-3,0.03,1.11111111111111E-3,0,0,0,8.4231003895897605E-2,8.7419842513498207E-3,4.6023077283645602E-4,7.5393007086905497E-4,9.2377804481280995E-2,7.4243427431922599E-3,3.9883469716391198E-4,0,3.0823895339647099E-2,7.1850898482282396E-4,3.8939402079143801E-2,3.8220420189202901E-2,9.2804284289903297E-3,3.2873192805440203E-2,2.5874194799384701E-3,0.51690000000000003]
["P9947","Técnico florestal","mês",0,0.08,2.5000000000000001E-2,1.4999999999999999E-2,1.6E-2,2E-3,0.03,4.1481481481481499E-3,0,0,0,6.4734580186079804E-2,8.8151184016583804E-3,4.6058119434215598E-4,5.79432937898971E-4,9.2448141301959302E-2,7.4299956667177201E-3,1.2682665632783299E-3,0,4.2734753765484502E-2,1.0791653539204101E-3,5.8529608216532601E-2,3.7623555720061902E-2,9.2874945833971503E-3,3.0252646975518199E-2,3.6045566184618001E-3,0.53100000000000003]
["P9948","Motorista de veículo leve - mensalista","mês",0,0.08,2.5000000000000001E-2,1.4999999999999999E-2,1.6E-2,2E-3,0.03,1.11111111111111E-3,0,0,0,7.33570046707296E-2,8.7400750912952404E-3,4.6013026313727E-4,8.9891712939405097E-4,9.2357630112490804E-2,7.4227213425823698E-3,3.5743413912434898E-5,0,3.6386694751226897E-2,9.1886010469812405E-4,4.9786502145924803E-2,3.7864711104753299E-2,9.2784016782279707E-3,3.0993369102203398E-2,3.06632503335932E-3,0.52070000000000005]
["P9949","Topógrafo","mês",0,0.08,2.5000000000000001E-2,1.4999999999999999E-2,1.6E-2,2E-3,0.03,1.11111111111111E-3,0,0,0,5.9859198823988199E-2,8.7405750078875296E-3,4.6015658176162502E-4,9.7461205675712203E-4,9.2362912802998007E-2,7.4231459089070702E-3,1.7330647168104302E-5,0,4.2399619719290099E-2,1.16803891035015E-3,6.3291351580009203E-2,3.7434813818543002E-2,9.2789323861338403E-3,2.8721481360494398E-2,3.5894979354935399E-3,0.52480000000000004]
["P9950","Auxiliar de topografia","mês",0,0.08,2.5000000000000001E-2,1.4999999999999999E-2,1.6E-2,2E-3,0.03,1.11111111111111E-3,0,0,0,5.9859198823988199E-2,8.7405750078875296E-3,4.6015658176162502E-4,9.7461205675712203E-4,9.2362912802998007E-2,7.4231459089070702E-3,1.7330647168104302E-5,0,4.2399619719290099E-2,1.16803891035015E-3,6.3291351580009203E-2,3.7434813818543002E-2,9.2789323861338403E-3,2.8721481360494398E-2,3.5894979354935399E-3,0.52480000000000004]
["P9951","Médico de câmara hiperbárica","mês",0,0.08,2.5000000000000001E-2,1.4999999999999999E-2,1.6E-2,2E-3,0.03,4.1481481481481499E-3,0.12,0,0,7.5127053881813802E-2,8.8071467803249402E-3,4.60164685033114E-4,4.2596706636568798E-4,9.2364539296647605E-2,7.4232766291205598E-3,5.1677839612025603E-4,0,3.5097153348693302E-2,8.8629577984681099E-4,4.8025665180383002E-2,3.7923997655533601E-2,9.2790957864007009E-3,5.4083904521816301E-2,3.0667019386892299E-3,0.66559999999999997]
["P9952","Pedreiro - mensalista","mês",0,0.08,2.5000000000000001E-2,1.4999999999999999E-2,1.6E-2,2E-3,0.03,0,0,0,0,6.2085314093252499E-2,9.1494780581014307E-3,4.6032540061438599E-4,9.3445919937549995E-4,9.2396798227210503E-2,7.4258692579275897E-3,1.9021916110185199E-5,0,4.4643896956373302E-2,1.1273762596995E-3,6.1110416876361401E-2,3.7519080516882901E-2,9.2823365724094796E-3,2.8975172713635498E-2,3.76091096813938E-3,0.52690000000000003]
["P9953","Eletricista - mensalista","mês",0,0.08,2.5000000000000001E-2,1.4999999999999999E-2,1.6E-2,2E-3,0.03,0,0,0,0,7.5083338684816203E-2,9.1503628820826903E-3,4.60369917574924E-4,1.05031648607477E-3,9.24057336989767E-2,7.4265873958540797E-3,0,0,3.5153561815383101E-2,8.8772024255118101E-4,4.81243062471527E-2,3.7938454690092098E-2,9.2832342448175998E-3,3.11768871229837E-2,2.9614219459792499E-3,0.51910000000000001]
["P9954","Servente - mensalista","mês",0,0.08,2.5000000000000001E-2,1.4999999999999999E-2,1.6E-2,2E-3,0.03,0,0,0,0,6.2992281890531798E-2,9.1512597665585702E-3,4.6041504131892798E-4,1.13428029830319E-3,9.2414790964694404E-2,7.4273153222795098E-3,1.41233518498324E-5,0,4.3990275980440197E-2,1.1108706044734599E-3,6.0227439395727403E-2,3.7555022932337201E-2,9.2841441528493801E-3,2.91638703947701E-2,3.70584833998676E-3,0.52659999999999996]
["P9955","Engenheiro chefe","mês",0,0.08,2.5000000000000001E-2,1.4999999999999999E-2,1.6E-2,2E-3,0.03,1.11111111111111E-3,0,0,0,8.4231003895897605E-2,8.7419842513498207E-3,4.6023077283645602E-4,7.5393007086905497E-4,9.2377804481280995E-2,7.4243427431922599E-3,3.9883469716391198E-4,0,3.0823895339647099E-2,7.1850898482282396E-4,3.8939402079143801E-2,3.8220420189202901E-2,9.2804284289903297E-3,3.2873192805440203E-2,2.5874194799384701E-3,0.51690000000000003]
["P9956","Motorista de caminhão com periculosidade","h",0,0.08,2.5000000000000001E-2,1.4999999999999999E-2,1.6E-2,2E-3,0.03,0,0,0.18849234115572699,5.2178920412952898E-2,8.25579843226283E-2,9.1497708797671305E-3,4.6034013295755599E-4,9.8555139282185608E-4,9.2399755312214699E-2,7.4261069168838198E-3,0,0,3.2163759842293298E-2,7.4974139957730099E-4,4.0641689426991298E-2,4.5876824656830503E-2,9.2826336461047793E-3,7.2853329448360094E-2,2.6990573425124502E-3,0.80589999999999995]
["P9972","Técnico de batimetria","mês",0,0.08,2.5000000000000001E-2,1.4999999999999999E-2,1.6E-2,2E-3,0.03,4.1481481481481499E-3,0,0,0,8.0644620439093997E-2,7.81222934313088E-3,3.96518947113034E-4,9.3482030654603199E-4,9.2270396013342998E-2,7.4157103960178399E-3,3.7194229452979501E-5,0,3.1004784688995202E-2,7.8295266718372001E-4,4.2382574245363298E-2,3.8064367669590302E-2,9.2696379950222996E-3,3.2624052000296097E-2,2.6151666268629499E-3,0.51839999999999997]
[]
[null,"Legenda:",{"$nulls":11},"CONSIDERAÇÕES SOBRE O USO DOS DADOS DESTA PLANILHA:"]
[]
[null,"Classificação","Parcela","Descrição",{"$nulls":9},"1.     Para fins de apresentação dos valores percentuais obtidos para cada parcela dos encargos sociais e trabalhistas adotou-se apenas quatro casas decimais em porcentagem, o que pode promover pequenas diferenças entre o valor divulgado na coluna Total (%) em relação a uma eventual soma dos valores visíveis das parcelas.\r\n\r\n2.     Sobre os encargos sociais e trabalhistas apresentados na presente tabela, não está aplicada a média móvel. A média móvel é parte da metodologia de cálculo dos salários e encargos sociais das categorias do SICRO, tendo por objetivo estabilizar os resultados e realizar o abrandamento das variações decorrentes de eventuais flutuações no número de amostras. Isso implica dizer que, após a obtenção dos valores totais dos encargos sociais (última coluna), deve ser aplicada a média aritmética simples sobre o resultado da referência atual juntamente com os resultados das duas referências anteriores, obtendo desta forma, os percentuais efetivamente utilizados no cálculo dos custos da Mão de Obra."]
[null,"Grupo A - Encargos Sociais (%)","A1","Previdência Social"]
[null,null,"A2","FGTS"]
[null,null,"A3","Salário Educação"]
[null,null,"A4","SESC ou SESI"]
[null,null,"A5","SENAI / SEBRAE"]
[null,null,"A6","INCRA"]
[null,null,"A7","Seguro Contra Risco e Acidente de Trabalho"]
[null,null,"A8","SECONCI"]
[null,null,"A9","FAE - Financiamento de Aposentadoria Especial"]
[null,"Grupo B - Encargos Trabalhistas (%)","B1","Repouso Semanal Remunerado - Domingos"]
[null,null,"B2","Feriados"]
[null,null,"B3","Férias Gozadas + 1/3"]
[null,null,"B4","Auxílio Enfermidade"]
[null,null,"B5","Auxílio Acidente de Trabalho"]
[null,null,"B6","Licença Paternidade"]
[null,null,"B7","13° Salário"]
[null,null,"B8","Faltas Justificadas"]
[null,null,"B9","Férias sobre Licença Maternidade"]
[null,null,"B10","Reciclagem Tecnológica"]
[null,"Grupo C - Verbas Rescisórias (%)","C1","Aviso Prévio Indenizado"]
[null,null,"C2","Aviso Prévio Trabalhado"]
[null,null,"C3","Féria Indenizadas + 1/3"]
[null,null,"C4","Depósito por Rescisão Sem Justa Causa"]
[null,null,"C5","Indenização Adicional"]
[null,"Grupo D - Reincidências (%)","D1","Reincidência de A sobre B"]
[null,null,"D2","Reincidência de A sobre Aviso Prévio Trabalhado + Reincidência de FGTS sobre Aviso Prévio Indenizado"]