{"text_format":"2","workbook":"xlsx","n_sheets":20,"sheets":["RESUMO","PO1","MEMÓRIA","CFF","BDI DNIT D","BDI + ES","CFF2","ABC Serviços","CPUs","PROJ.EXEC","DES.MOB.","EAI","CAP (2)","EAI (2)","RR-1C (2)","Comparação ARAPIRACA-MACEIO","Encargos SD","EQUIP D","MO D","Encargos D"],"not_rendered":{"charts":0,"images":7,"macros":0,"external_links":39,"defined_names":713,"comments":1,"pivot_tables":0},"unopened":[],"bounds":{"document_bytes":16777216,"sheet_cells":100000,"run_cost":"one","rows_first":2000,"rows_last":500,"rows_between":2000,"halvings":0,"cell_chars":16384,"cell_head_chars":4096},"cells_cut":0,"cells_raw":0,"read":"whole","date_system":"1900"}

{"sheet":"RESUMO","index":0,"n_rows":13,"n_cols":6,"rows_kept":13,"cut":false,"hidden":false,"merged":[[12,1,12,2],[9,1,9,5],[6,2,6,5],[7,2,7,3],[0,2,0,5],[1,2,1,5],[2,2,2,5],[3,2,3,5],[4,2,4,5]]}
[null,null,"Ministério do Desenvolvimento Regional - MDR"]
[null,null,"Companhia de Desenvolvimento dos Vales do São Francisco e do Parnaíba"]
[null,null,"5ª Superintendência Regional"]
[null,null,"Gerência Regional de Infraestrutura"]
[null,null,"Unidade Regional de Estudos e Projetos"]
[]
[null,"Objeto:","CONTRATAÇÃO DE SERVIÇOS DE EXECUÇÃO DE PAVIMENTAÇÃO EM PARALELEPÍPEDO GRANÍTICO, EM VIAS DE DIVERSOS MUNICÍPIOS INSERIDOS NA ÁREA DE ATUAÇÃO DA 5ª SUPERINTENDÊNCIA REGIONAL DA CODEVASF, NO ESTADO DE ALAGOAS"]
[null,"Bancos:","SINAPI - 10/2023 - Alagoas; SICRO3 - 07/2023 - Alagoas; ORSE - 09/2023 - Sergipe - Sem Desoneração",null,"BDI:",0.2135]
{"$rows_left_out":6}
{"sheet":"PO1","index":1,"n_rows":39,"n_cols":19,"rows_kept":39,"cut":false,"hidden":false,"merged":[[36,8,36,9],[37,8,37,9],[38,8,38,9],[5,10,6,10],[0,5,0,6],[0,8,0,9],[1,5,1,6],[1,8,1,9],[2,1,3,10],[4,1,6,1],[4,2,6,2],[4,3,6,3],[4,4,6,4],[5,9,6,9]]}
[{"$nulls":5},"Bancos",null,null,"B.D.I.",null,"Encargos Sociais"]
[{"$nulls":5},"SINAPI - 10/2023 - Alagoas\nSICRO3 - 07/2023 - Alagoas\nORSE - 09/2023 - Sergipe\nSem desoneração\n",null,null,{"$f":"RESUMO!F8","v":0.2135},null,"Não Desonerado: \nHorista: 113,41%\nMensalista: 69,73%"]
[null,{"$f":"RESUMO!C12","v":"Pavimentação em paralelepípedo granítico"}]
[]
[null,"ITEM","ORIGEM COMPOSIÇÃO","CÓDIGO COMPOSIÇÃO","DISCRIMINAÇÃO DOS SERVIÇOS","BDI: ",{"$f":"RESUMO!F8","v":0.2135},"BDI Diferenciado: ",{"$f":"'BDI + ES'!H61","v":0.15279999999999999},"R$/m² = ",{"$f":"RESUMO!F12","v":128.08644352564104}]
[{"$nulls":5},"Total de m²: ",{"$f":"MEMÓRIA!M10","v":156000},"Encargos Sociais: Horista: 114,90%","Encargos Sociais: Mensalista: 70,23% ","VALOR UNIT. COM BDI","PREÇO TOTAL"]
[{"$nulls":5},"UND","QUANT.","BDI","VALOR UNIT.",null,null,"Peso (%)",null,null,null,"N1","TERRAPLENAGEM",{"$f":"ROUND((SUMIF(O:O,\"TERRAPLENAGEM\",K:K))/$K$39,5)","v":6.5369999999999998E-2},{"$f":"(SUMIF(O:O,\"TERRAPLENAGEM\",K:K))","v":1306258.2}]
[null,1,null,null,"SERVIÇOS PRELIMINARES",{"$nulls":5},{"$f":"SUM(K9:K13)","v":266136.03000000003},{"$f":"K8/$K$39","v":1.3319131559509466E-2},{"$f":"SUM(M9:M13)","v":220658.88},null,null,"N2","EDIFICAÇÕES",{"$f":"ROUND((SUMIF(O:O,\"EDIFICAÇÕES\",K:K))/$K$39,6)","v":7.3047000000000001E-2},{"$f":"(SUMIF(O:O,\"EDIFICAÇÕES\",K:K))","v":1459586.99}]
{"$rows_left_out":32}
{"sheet":"MEMÓRIA","index":2,"n_rows":139,"n_cols":16,"rows_kept":139,"cut":false,"hidden":false,"merged":[[4,1,4,13],[5,10,5,13],[11,0,11,13]]}
[]
[]
[]
[]
["Obra:",{"$f":"RESUMO!C12","v":"Pavimentação em paralelepípedo granítico"}]
[{"$nulls":10},"Parâmetros"]
[{"$nulls":11},"Qtde de módulo mínimo:",13,"und"]
[{"$nulls":11},"Extensão do módulo mínimo:",2000,"m"]
{"$rows_left_out":132}
{"sheet":"CFF","index":3,"n_rows":29,"n_cols":16,"rows_kept":29,"cut":false,"hidden":false,"merged":[[7,0,8,0],[7,1,8,1],[0,2,0,8],[1,2,1,8],[2,2,2,8],[3,2,3,8],[4,2,4,8],[9,0,10,0],[9,1,10,1],[11,0,12,0],[11,1,12,1],[13,0,14,0],[13,1,14,1],[23,0,23,1],[24,0,24,1],[21,0,21,1],[22,0,22,1],[15,0,16,0],[15,1,16,1],[17,0,18,0],[17,1,18,1],[19,0,20,0],[19,1,20,1]]}
[null,null,"Ministério do Desenvolvimento Regional - MDR"]
[null,null,"Companhia de Desenvolvimento dos Vales do São Francisco e do Parnaíba"]
[null,null,"5ª Superintendência Regional"]
[null,null,"Gerência Regional de Infraestrutura"]
[null,null,"Unidade Regional de Estudos e Projetos"]
[]
["Item","Descrição","Total Por Etapa","MÊS 1","MÊS 2","MÊS 3","MÊS 4","MÊS 5","MÊS 6","MÊS 7","MÊS 8","MÊS 9","MÊS 10","MÊS 11","MÊS 12"]
[1,{"$f":"VLOOKUP(A8,'PO1'!B8:K32,4,0)","v":"SERVIÇOS PRELIMINARES"},{"$f":"SUM(D8:O8)","v":1},{"$f":"D27","v":2.8999999999999998E-3},{"$f":"E27","v":2.8999999999999998E-3},8.8599999999999998E-2,8.8599999999999998E-2,0.1082,0.1082,0.1082,0.1082,0.1082,8.8599999999999998E-2,9.3700000000000006E-2,9.3700000000000006E-2]
{"$rows_left_out":22}
{"sheet":"BDI DNIT D","index":4,"n_rows":69,"n_cols":15,"rows_kept":69,"cut":false,"hidden":true,"merged":[[66,1,66,2],[66,3,66,5],[67,1,67,7],[62,2,62,5],[63,1,63,2],[63,3,63,5],[64,1,64,2],[64,3,64,5],[65,1,65,2],[65,3,65,5],[61,2,61,5],[23,1,23,2],[23,3,23,5],[24,1,24,7],[25,1,25,8],[54,1,54,8],[55,1,55,8],[56,2,56,5],[57,2,57,5],[58,2,58,5],[59,2,59,5],[60,2,60,5],[11,1,11,8],[12,1,12,8],[22,1,22,2],[22,3,22,5],[1,3,1,8],[2,3,2,8],[3,3,3,8],[4,3,4,8],[5,3,5,8],[7,1,7,8]]}
[]
[null,null,null,"Ministério do Desenvolvimento Regional - MDR"]
[null,null,null,"Companhia de Desenvolvimento dos Vales do São Francisco e do Parnaíba"]
[null,null,null,"5ª Superintendência Regional"]
[null,null,null,"Gerência Regional de Infraestrutura"]
[null,null,null,"Unidade Regional de Estudos e Projetos"]
[]
[null,"ANEXO 3 - ENCARGOS SOCIAIS e COMPOSIÇÃO DO BDI"]
{"$rows_left_out":36}
{"sheet":"BDI + ES","index":5,"n_rows":103,"n_cols":11,"rows_kept":103,"cut":false,"hidden":false,"merged":[[23,2,23,5],[24,3,24,5],[25,3,25,5],[18,2,18,5],[19,2,19,5],[20,2,20,5],[21,2,21,5],[22,2,22,5],[75,2,75,3],[76,2,76,3],[77,2,77,3],[79,2,79,3],[16,8,17,10],[49,8,49,10],[17,1,17,7],[16,1,16,7],[24,1,24,2],[25,1,25,2],[65,2,66,3],[68,2,68,3],[69,2,69,3],[36,2,36,5],[33,8,33,10],[58,3,58,5],[91,2,91,3],[81,2,81,3],[82,2,82,3],[83,2,83,3],[84,2,84,3],[85,2,85,3],[90,1,90,7],[86,2,86,3],[87,2,87,3],[88,2,88,3],[89,2,89,3],[98,2,98,3],[99,2,99,3],[100,2,100,3],[97,1,97,7],[27,1,27,2],[92,2,92,3],[93,2,93,3],[94,2,94,3],[95,2,95,3],[96,2,96,3],[43,3,43,5],[44,1,44,6],[49,1,49,7],[64,1,64,7],[53,2,53,5],[54,2,54,5],[80,2,80,3],[37,2,37,5],[38,2,38,5],[50,2,50,5],[51,2,51,5],[52,2,52,5],[43,1,43,2],[70,2,70,3],[71,2,71,3],[72,2,72,3],[73,2,73,3],[74,2,74,3],[40,3,40,5],[57,1,57,2],[57,3,57,5],[58,1,58,2],[14,1,14,4],[42,1,42,2],[42,3,42,5],[102,1,102,3],[65,4,65,5],[65,1,66,1],[101,1,101,6],[65,6,65,7],[67,1,67,7],[78,1,78,7],[39,2,39,5],[40,1,40,2],[32,1,32,7],[33,1,33,7],[34,2,34,5],[35,2,35,5],[1,3,1,7],[2,3,2,7],[3,3,3,7],[4,3,4,7],[5,3,5,7],[60,1,60,6],[41,1,41,2],[41,3,41,5],[26,3,26,5],[27,3,27,5],[59,1,59,2],[59,3,59,5],[55,2,55,5],[56,1,56,2],[56,3,56,5],[28,1,28,6],[26,1,26,2]]}
[]
[null,null,null,"Ministério da Integração e do Desenvolvimento Regional - MIDR"]
[null,null,null,"Companhia de Desenvolvimento dos Vales do São Francisco e do Parnaíba"]
[null,null,null,"5ª Superintendência Regional"]
[null,null,null,"Gerência Regional de Infraestrutura"]
[null,null,null,"Unidade Regional de Estudos e Projetos"]
[]
[null,"Considerações:",null,"Acórdão  Nº 2622/2013 – TCU – Plenário de 25/9/2013"]
{"$rows_left_out":96}
{"sheet":"CFF2","index":6,"n_rows":23,"n_cols":34,"rows_kept":23,"cut":false,"hidden":true,"merged":[[7,32,7,33],[19,0,19,1],[7,8,7,9],[7,10,7,11],[7,12,7,13],[7,14,7,15],[7,20,7,21],[7,22,7,23],[7,0,8,0],[7,1,8,1],[7,2,8,2],[7,3,8,3],[7,4,7,5],[19,16,19,17],[3,18,3,24],[4,18,4,24],[7,6,7,7],[7,16,8,16],[7,17,8,17],[3,2,3,8],[4,2,4,8],[6,0,6,15],[6,16,6,31],[7,24,7,25],[7,26,7,27],[7,28,7,29],[7,30,7,31],[7,18,8,18],[7,19,8,19],[0,2,0,8],[1,2,1,8],[0,18,0,24],[1,18,1,24],[2,18,2,24],[2,2,2,8]]}
[null,null,"Ministério do Desenvolvimento Regional - MDR",{"$nulls":15},"Ministério do Desenvolvimento Regional - MDR"]
[null,null,"Companhia de Desenvolvimento dos Vales do São Francisco e do Parnaíba",{"$nulls":15},"Companhia de Desenvolvimento dos Vales do São Francisco e do Parnaíba"]
[null,null,"5ª Superintendência Regional",{"$nulls":15},"5ª Superintendência Regional"]
[null,null,"Gerência Regional de Infraestrutura",{"$nulls":15},"Gerência Regional de Infraestrutura"]
[null,null,"Unidade Regional de Estudos e Projetos",{"$nulls":15},"Unidade Regional de Estudos e Projetos"]
[]
["Cronograma Físico e Financeiro ",{"$nulls":15},"Cronograma Físico e Financeiro "]
["ITEM","ETAPA","%","R$","30 dias",null,"60 dias",null,"90 dias",null,"120 dias",null,"150 dias",null,"180 dias",null,"ITEM","ETAPA","%","R$","210 dias",null,"240 dias",null,"270 dias",null,"300 dias",null,"330 dias",null,"360 dias",null,"Total"]
{"$rows_left_out":16}
{"sheet":"ABC Serviços","index":7,"n_rows":28,"n_cols":16,"rows_kept":28,"cut":false,"hidden":false,"merged":[[0,4,0,5],[0,7,0,9],[1,4,1,5],[1,7,1,9],[2,1,2,10]]}
[null,null,null,"Obra"]
[null,null,null,{"$f":"RESUMO!C7","v":"CONTRATAÇÃO DE SERVIÇOS DE EXECUÇÃO DE PAVIMENTAÇÃO EM PARALELEPÍPEDO GRANÍTICO, EM VIAS DE DIVERSOS MUNICÍPIOS INSERIDOS NA ÁREA DE ATUAÇÃO DA 5ª SUPERINTENDÊNCIA REGIONAL DA CODEVASF, NO ESTADO DE ALAGOAS"}]
[null,"Curva ABC de Serviços"]
[null,"Código","Banco","Descrição","Und","Quant.","Valor Unit com BDI","Total","Peso (%)","Peso Acumulado (%)","Classe",null,"Onde:","A <=",0.75]
[{"$nulls":7},{"$f":"SUM(H1:H4)","v":0},{"$nulls":5},{"$f":"O4","v":0.75},"< B <=",0.95]
[10,{"$f":"VLOOKUP(A6,'PO1'!$A:$P,4,0)","v":101169},{"$f":"VLOOKUP(A6,'PO1'!$A:$P,3,0)","v":"SINAPI"},{"$f":"VLOOKUP(A6,'PO1'!$A:$P,5,0)","v":"EXECUÇÃO DE PAVIMENTO EM PARALELEPÍPEDOS, REJUNTAMENTO COM ARGAMASSA TRAÇO 1:3 (CIMENTO E AREIA). AF_05/2020"},{"$f":"VLOOKUP(A6,'PO1'!$A:$P,6,0)","v":"m²"},{"$f":"VLOOKUP(A6,'PO1'!$A:$P,7,0)","v":156000},{"$f":"VLOOKUP(A6,'PO1'!$A:$P,10,0)","v":86.55},{"$f":"VLOOKUP(A6,'PO1'!$A:$P,11,0)","v":13501800},{"$f":"H6/$H$28","v":0.67571553723930167},{"$f":"I6+J5","v":0.67571553723930167},{"$f":"IF(J6<=$O$4,\"A\",IF(AND(J6<=$P$5,J6>$N$5),\"B\",IF(J6>$O$6,\"C\")))","v":"A"},null,null,"C >",0.95]
[11,{"$f":"VLOOKUP(A7,'PO1'!$A:$P,4,0)","v":94273},{"$f":"VLOOKUP(A7,'PO1'!$A:$P,3,0)","v":"SINAPI"},{"$f":"VLOOKUP(A7,'PO1'!$A:$P,5,0)","v":"ASSENTAMENTO DE GUIA (MEIO-FIO) EM TRECHO RETO, CONFECCIONADA EM CONCRETO PRÉ-FABRICADO, DIMENSÕES 100X15X13X30 CM (COMPRIMENTO X BASE INFERIOR X BASE SUPERIOR X ALTURA), PARA VIAS URBANAS (USO VIÁRIO). AF_06/2016"},{"$f":"VLOOKUP(A7,'PO1'!$A:$P,6,0)","v":"M"},{"$f":"VLOOKUP(A7,'PO1'!$A:$P,7,0)","v":52000},{"$f":"VLOOKUP(A7,'PO1'!$A:$P,10,0)","v":64.91},{"$f":"VLOOKUP(A7,'PO1'!$A:$P,11,0)","v":3375320},{"$f":"H7/$H$28","v":0.16892237828693651},{"$f":"I7+J6","v":0.84463791552623824},"B"]
[16,{"$f":"VLOOKUP(A8,'PO1'!$A:$P,4,0)","v":95876},{"$f":"VLOOKUP(A8,'PO1'!$A:$P,3,0)","v":"SINAPI"},{"$f":"VLOOKUP(A8,'PO1'!$A:$P,5,0)","v":"TRANSPORTE COM CAMINHÃO BASCULANTE DE 14 M³, EM VIA URBANA PAVIMENTADA, DMT ATÉ 30 KM (UNIDADE: M3XKM). AF_07/2020 (PEDRA)"},{"$f":"VLOOKUP(A8,'PO1'!$A:$P,6,0)","v":"M3XKM"},{"$f":"VLOOKUP(A8,'PO1'!$A:$P,7,0)","v":262080},{"$f":"VLOOKUP(A8,'PO1'!$A:$P,10,0)","v":2.5099999999999998},{"$f":"VLOOKUP(A8,'PO1'!$A:$P,11,0)","v":657820.80000000005},3.2921516781405979E-2,0.87755943230764422,"B"]
{"$rows_left_out":21}
{"sheet":"CPUs","index":8,"n_rows":161,"n_cols":11,"rows_kept":161,"cut":false,"hidden":false,"merged":[[1,4,1,5],[3,0,3,9],[36,4,36,5],[37,4,37,5],[153,7,153,8],[155,4,155,5],[156,4,156,5],[157,4,157,5],[158,4,158,5],[139,7,139,8],[133,7,133,8],[135,4,135,5],[136,4,136,5],[137,4,137,5],[124,4,124,5],[125,4,125,5],[127,7,127,8],[129,4,129,5],[130,4,130,5],[131,4,131,5],[117,7,117,8],[119,4,119,5],[120,4,120,5],[121,4,121,5],[160,7,160,8],[144,4,144,5],[146,7,146,8],[148,4,148,5],[149,4,149,5],[150,4,150,5],[151,4,151,5],[141,4,141,5],[142,4,142,5],[143,4,143,5],[122,4,122,5],[123,4,123,5],[109,7,109,8],[111,4,111,5],[112,4,112,5],[113,4,113,5],[114,4,114,5],[115,4,115,5],[102,4,102,5],[103,4,103,5],[104,4,104,5],[105,4,105,5],[106,4,106,5],[107,4,107,5],[94,4,94,5],[95,4,95,5],[96,4,96,5],[97,4,97,5],[99,7,99,8],[101,4,101,5],[87,7,87,8],[89,4,89,5],[90,4,90,5],[91,4,91,5],[92,4,92,5],[93,4,93,5],[80,4,80,5],[81,4,81,5],[82,4,82,5],[83,4,83,5],[84,4,84,5],[85,4,85,5],[72,4,72,5],[73,4,73,5],[75,7,75,8],[77,4,77,5],[78,4,78,5],[79,4,79,5],[64,4,64,5],[65,4,65,5],[67,7,67,8],[69,4,69,5],[70,4,70,5],[71,4,71,5],[56,4,56,5],[58,7,58,8],[60,4,60,5],[61,4,61,5],[62,4,62,5],[63,4,63,5],[50,4,50,5],[51,4,51,5],[52,4,52,5],[53,4,53,5],[54,4,54,5],[55,4,55,5],[42,4,42,5],[43,4,43,5],[44,4,44,5],[46,7,46,8],[48,4,48,5],[49,4,49,5],[32,4,32,5],[33,4,33,5],[34,4,34,5],[35,4,35,5],[39,7,39,8],[41,4,41,5],[24,4,24,5],[25,4,25,5],[27,7,27,8],[29,4,29,5],[30,4,30,5],[31,4,31,5],[18,4,18,5],[19,4,19,5],[20,4,20,5],[21,4,21,5],[22,4,22,5],[23,4,23,5],[10,4,10,5],[11,4,11,5],[12,4,12,5],[13,4,13,5],[15,7,15,8],[17,4,17,5],[4,4,4,5],[5,4,5,5],[6,4,6,5],[7,4,7,5],[8,4,8,5],[9,4,9,5]]}
[{"$nulls":4},"Bancos",null,"B.D.I.",null,"Encargos Sociais"]
[null,null,null,{"$f":"RESUMO!C7","v":"CONTRATAÇÃO DE SERVIÇOS DE EXECUÇÃO DE PAVIMENTAÇÃO EM PARALELEPÍPEDO GRANÍTICO, EM VIAS DE DIVERSOS MUNICÍPIOS INSERIDOS NA ÁREA DE ATUAÇÃO DA 5ª SUPERINTENDÊNCIA REGIONAL DA CODEVASF, NO ESTADO DE ALAGOAS"},"SINAPI - 10/2023 - Alagoas\nSICRO3 - 07/2023 - Alagoas\nORSE - 09/2023 - Sergipe\nSem Desoneração\n",null,{"$f":"RESUMO!F8","v":0.2135},null,"Não Desonerado: \nHorista:  114,90%\nMensalista: 70,23% "]
[]
["Composições Analíticas com Preço Unitário - Composições Principais",{"$nulls":9},{"$f":"MEMÓRIA!M9","v":12000}]
[" 1.1 ","Código","Banco","Descrição","Tipo",null,"Und","Quant.","Valor Unit","Total","m²"]
["Composição","CPU-01","Próprio","ADMINISTRAÇÃO LOCAL","SERT - SERVIÇOS TÉCNICOS",null,"Global",1,8646.56,8646.56,{"$f":"TRUNC(J6/(K4),2)","v":0.72}]
["Composição Auxiliar",93565,"SINAPI","ENGENHEIRO CIVIL DE OBRA JUNIOR COM ENCARGOS COMPLEMENTARES","SEDI - SERVIÇOS DIVERSOS",null,"MES",0.1,20823.560000000001,2082.35]
["Composição Auxiliar",93566,"SINAPI","AUXILIAR DE ESCRITORIO COM ENCARGOS COMPLEMENTARES","SEDI - SERVIÇOS DIVERSOS",null,"MES",0.66700000000000004,2888.89,1926.88]
{"$rows_left_out":154}
{"sheet":"PROJ.EXEC","index":9,"n_rows":34,"n_cols":6,"rows_kept":34,"cut":false,"hidden":false,"merged":[[7,0,7,7],[0,1,0,7],[1,1,1,7],[2,1,2,7],[3,1,3,7],[4,1,4,7]]}
[null,"Ministério do Desenvolvimento Regional - MDR"]
[null,"Companhia de Desenvolvimento dos Vales do São Francisco e do Parnaíba"]
[null,"5ª Superintendência Regional"]
[null,"Gerência Regional de Infraestrutura"]
[null,"Unidade Regional de Estudos e Projetos"]
[]
[]
["CPU - 07 - COMPOSIÇÃO PREÇO PROJETO EXECUTIVO "]
{"$rows_left_out":27}
{"sheet":"DES.MOB.","index":10,"n_rows":31,"n_cols":7,"rows_kept":31,"cut":false,"hidden":false,"merged":[[7,0,7,7],[1,1,1,7],[0,1,0,7],[2,1,2,7],[3,1,3,7],[4,1,4,7]]}
[null,"Ministério do Desenvolvimento Regional - MDR"]
[null,"Companhia de Desenvolvimento dos Vales do São Francisco e do Parnaíba"]
[null,"5ª Superintendência Regional"]
[null,"Gerência Regional de Infraestrutura"]
[null,"Unidade Regional de Estudos e Projetos"]
[]
[]
["MEMÓRIA DE CÁLCULO DOS MOMENTOS DE TRANSPORTE PARA MOBILIZAÇÃO E DESMOBILIZAÇÃO"]
{"$rows_left_out":24}
{"sheet":"EAI","index":11,"n_rows":37,"n_cols":20,"rows_kept":37,"cut":false,"hidden":true,"merged":[[13,16,13,17],[15,1,35,1],[9,0,11,0],[9,3,9,5],[9,6,9,7],[9,9,11,9],[10,14,10,15],[13,1,14,1],[13,2,13,6],[7,0,7,19],[0,3,0,8],[1,3,1,8],[2,3,2,8],[3,3,3,8],[4,3,4,8]]}
[null,null,null,"Ministério do Desenvolvimento Regional - MDR"]
[null,null,null,"Companhia de Desenvolvimento dos Vales do São Francisco e do Parnaíba"]
[null,null,null,"5ª Superintendência Regional"]
[null,null,null,"Gerência Regional de Infraestrutura"]
[null,null,null,"Unidade Regional de Estudos e Projetos"]
[]
[]
["MEMÓRIA DE CÁLCULO"]
{"$rows_left_out":30}
{"sheet":"CAP (2)","index":12,"n_rows":28,"n_cols":20,"rows_kept":28,"cut":false,"hidden":true,"merged":[[13,16,13,17],[15,1,26,1],[9,0,11,0],[9,3,9,5],[9,6,9,7],[9,9,11,9],[10,14,10,15],[13,1,14,1],[13,2,13,6],[7,0,7,19],[0,3,0,8],[1,3,1,8],[2,3,2,8],[3,3,3,8],[4,3,4,8]]}
[null,null,null,"Ministério do Desenvolvimento Regional - MDR"]
[null,null,null,"Companhia de Desenvolvimento dos Vales do São Francisco e do Parnaíba"]
[null,null,null,"5ª Superintendência Regional"]
[null,null,null,"Gerência Regional de Infraestrutura"]
[null,null,null,"Unidade Regional de Estudos e Projetos"]
[]
[]
["MEMÓRIA DE CÁLCULO"]
{"$rows_left_out":21}
{"sheet":"EAI (2)","index":13,"n_rows":37,"n_cols":20,"rows_kept":37,"cut":false,"hidden":true,"merged":[[13,16,13,17],[15,1,35,1],[9,0,11,0],[9,3,9,5],[9,6,9,7],[9,9,11,9],[10,14,10,15],[13,1,14,1],[13,2,13,6],[7,0,7,19],[0,3,0,8],[1,3,1,8],[2,3,2,8],[3,3,3,8],[4,3,4,8]]}
[null,null,null,"Ministério do Desenvolvimento Regional - MDR"]
[null,null,null,"Companhia de Desenvolvimento dos Vales do São Francisco e do Parnaíba"]
[null,null,null,"5ª Superintendência Regional"]
[null,null,null,"Gerência Regional de Infraestrutura"]
[null,null,null,"Unidade Regional de Estudos e Projetos"]
[]
[]
["MEMÓRIA DE CÁLCULO"]
{"$rows_left_out":30}
{"sheet":"RR-1C (2)","index":14,"n_rows":37,"n_cols":20,"rows_kept":37,"cut":false,"hidden":true,"merged":[[13,16,13,17],[15,1,35,1],[9,0,11,0],[9,3,9,5],[9,6,9,7],[9,9,11,9],[10,14,10,15],[13,1,14,1],[13,2,13,6],[7,0,7,19],[0,3,0,8],[1,3,1,8],[2,3,2,8],[3,3,3,8],[4,3,4,8]]}
[null,null,null,"Ministério do Desenvolvimento Regional - MDR"]
[null,null,null,"Companhia de Desenvolvimento dos Vales do São Francisco e do Parnaíba"]
[null,null,null,"5ª Superintendência Regional"]
[null,null,null,"Gerência Regional de Infraestrutura"]
[null,null,null,"Unidade Regional de Estudos e Projetos"]
[]
[]
["MEMÓRIA DE CÁLCULO"]
{"$rows_left_out":30}
{"sheet":"Comparação ARAPIRACA-MACEIO","index":15,"n_rows":18,"n_cols":10,"rows_kept":18,"cut":false,"hidden":true,"merged":[[0,0,0,9],[9,0,9,9]]}
["ARAPIRACA"]
[4,null,null,"AQUISIÇÃO E TRANSPORTE DE MATERIAL BETUMINOSO",{"$nulls":5},{"$f":"SUM(J3:J8)","v":10500379.469999999}]
["4.1","Codevasf","CPU-08","Aquisição de Cimento Asfáltico 50/70 (BDI=15%)","t",1622.34,0.15,4439.1499999999996,5105.0200000000004,8282078.1399999997]
["4.2","Codevasf","CPU-09","Aquisição de Emulsão Asfáltica para imprimação - EAI (BDI=15%)","t",277.95999999999998,0.15,2859.76,3288.72,914132.61]
["4.3","Codevasf","CPU-10","Aquisição de Emulsão Asfáltica RR-1C (BDI=15%)","t",96.22,0.15,3085.62,3548.46,341432.82]
["4.4","Codevasf","CPU-11","Transporte de Cimento Asfáltico 50/70 (BDI=15%)","t",1622.34,0.15,366.13,421.04,683070.03]
["4.5","Codevasf","CPU-12","Transporte de Emulsão Asfáltica para imprimação - EAI (BDI = 15%)","t",277.95999999999998,0.15,649.92999999999995,747.41,207750.08]
["4.6","Codevasf","CPU-13","Transporte de Emulsão Asfáltica RR-1C (BDI=15%)","t",96.22,0.15,649.92999999999995,747.41,71915.789999999994]
{"$rows_left_out":11}
{"sheet":"Encargos SD","index":16,"n_rows":151,"n_cols":30,"rows_kept":151,"cut":false,"hidden":true,"merged":[[148,3,148,9],[149,1,150,1],[149,3,149,9],[150,3,150,9],[139,3,139,9],[140,3,140,9],[141,3,141,9],[142,3,142,9],[143,3,143,9],[144,1,148,1],[144,3,144,9],[145,3,145,9],[146,3,146,9],[147,3,147,9],[134,1,143,1],[134,3,134,9],[135,3,135,9],[136,3,136,9],[137,3,137,9],[138,3,138,9],[6,27,6,28],[6,29,7,29],[124,3,124,9],[124,13,130,28],[125,1,133,1],[125,3,125,9],[126,3,126,9],[127,3,127,9],[128,3,128,9],[129,3,129,9],[6,22,6,26],[130,3,130,9],[131,3,131,9],[132,3,132,9],[133,3,133,9],[6,0,7,0],[6,1,7,1],[6,2,7,2],[6,3,6,11],[6,12,6,21],[4,0,4,29],[0,0,1,0],[0,1,1,28],[0,29,1,29],[2,0,2,29],[3,0,3,29]]}
["CGCIT","SISTEMA DE CUSTOS REFERENCIAIS DE OBRAS - SICRO",{"$nulls":27},"DNIT"]
[]
[]
["Alagoas - Abril/2023"]
["Sem desoneração"]
[]
["Código","Descrição","Unid.","Encargos Sociais (%)",{"$nulls":8},"Encargos Trabalhistas (%)",{"$nulls":9},"Verbas Rescisórias (%)",{"$nulls":4},"Reincidências (%)",null,"Total (%)"]
[null,null,null,"A1","A2","A3","A4","A5","A6","A7","A8","A9","B1","B2","B3","B4","B5","B6","B7","B8","B9","B10","C1","C2","C3","C4","C5","D1","D2"]
{"$rows_left_out":144}
{"sheet":"EQUIP D","index":17,"n_rows":533,"n_cols":11,"rows_kept":533,"cut":false,"hidden":true,"merged":[[524,2,524,8],[527,2,527,8],[530,2,530,8],[501,2,501,8],[506,2,506,8],[509,2,509,8],[513,2,513,8],[516,2,516,8],[521,2,521,8],[498,2,498,8],[464,2,464,8],[467,2,467,8],[470,2,470,8],[473,2,473,8],[476,2,476,8],[480,2,480,8],[483,2,483,8],[486,2,486,8],[489,2,489,8],[492,2,492,8],[495,2,495,8],[461,2,461,8],[426,2,426,8],[431,2,431,8],[434,2,434,8],[437,2,437,8],[440,2,440,8],[443,2,443,8],[446,2,446,8],[449,2,449,8],[452,2,452,8],[455,2,455,8],[458,2,458,8],[421,2,421,8],[387,2,387,8],[391,2,391,8],[396,2,396,8],[399,2,399,8],[402,2,402,8],[405,2,405,8],[407,2,407,8],[409,2,409,8],[411,2,411,8],[414,2,414,8],[417,2,417,8],[384,2,384,8],[0,1,0,9],[1,1,1,9],[374,2,374,8],[377,2,377,8],[381,2,381,8]]}
["CGCIT","SISTEMA DE CUSTOS REFERENCIAIS DE OBRAS - SICRO",{"$nulls":8},"DNIT"]
[null,"Alagoas - Abril/2023 - Com desoneração"]
["Código","Descrição","Valor de Aquisição (R$)","Depreciação (R$/h)","Oportunidade de Capital (R$/h)","Seguros e Impostos (R$/h)","Manutenção (R$/h)","Operação (R$/h)","Mão de Obra de Operação (R$/h)","Custo Produtivo (R$/h)","Custo Improdutivo (R$/h)"]
["E9001","Conjunto vibratório para tubos de concreto com encaixe PB e 3 jogos de fôrmas - D = 0,60 m - 2,20 kW",76710.856599999999,10.2281,2.3664999999999998,0,7.6711,0,0,20.265699999999999,12.5946]
["E9002","Conjunto vibratório para tubos de concreto com encaixe PB e 3 jogos de fôrmas - D = 0,80 m - 2,20 kW",83255.5723,11.1007,2.5684,0,8.3255999999999997,0,0,21.994700000000002,13.6691]
["E9003","Conjunto vibratório para tubos de concreto com encaixe PB e 3 jogos de fôrmas - D = 1,00 m - 2,20 kW",91563.191800000001,12.208399999999999,2.8247,0,9.1562999999999999,0,0,24.189399999999999,15.033099999999999]
["E9004","Conjunto vibratório para tubos de concreto com encaixe PB e 3 jogos de fôrmas - D = 1,20 m - 2,20 kW",92067.672300000006,12.275700000000001,2.8403,0,9.2067999999999994,0,0,24.322800000000001,15.116]
["E9005","Conjunto vibratório para tubos de concreto com encaixe PB e 3 jogos de fôrmas - D = 1,50 m - 2,20 kW",94050.433900000004,12.540100000000001,2.9015,0,9.4049999999999994,0,0,24.846599999999999,15.441599999999999]
{"$rows_left_out":526}
{"sheet":"MO D","index":18,"n_rows":118,"n_cols":7,"rows_kept":118,"cut":false,"hidden":true,"merged":[[0,0,1,0],[0,1,1,5],[0,6,1,6],[2,0,2,6],[3,0,3,6]]}
["CGCIT","SISTEMA DE CUSTOS REFERENCIAIS DE OBRAS - SICRO",{"$nulls":4},"DNIT"]
[]
["Alagoas - Abril/2023"]
["Com desoneração"]
["Código","Descrição","Unidade","Salário (R$)","Encargos Totais","Custo (R$)","Periculosidade/\nInsalubridade"]
["P9801","Ajudante","h",5.9595000000000002,1.8204720000000001,16.808599999999998,0]
["P9802","Ajudante especializado","h",7.1071999999999997,1.781145,19.766100000000002,0]
["P9803","Almoxarife","mês",2582.8000000000002,0.93333200000000005,4993.4098000000004,0]
{"$rows_left_out":111}
{"sheet":"Encargos D","index":19,"n_rows":151,"n_cols":30,"rows_kept":151,"cut":false,"hidden":true,"merged":[[148,3,148,9],[149,1,150,1],[149,3,149,9],[150,3,150,9],[139,3,139,9],[140,3,140,9],[141,3,141,9],[142,3,142,9],[143,3,143,9],[144,1,148,1],[144,3,144,9],[145,3,145,9],[146,3,146,9],[147,3,147,9],[134,1,143,1],[134,3,134,9],[135,3,135,9],[136,3,136,9],[137,3,137,9],[138,3,138,9],[6,27,6,28],[6,29,7,29],[124,3,124,9],[124,13,130,28],[125,1,133,1],[125,3,125,9],[126,3,126,9],[127,3,127,9],[128,3,128,9],[129,3,129,9],[6,22,6,26],[130,3,130,9],[131,3,131,9],[132,3,132,9],[133,3,133,9],[6,0,7,0],[6,1,7,1],[6,2,7,2],[6,3,6,11],[6,12,6,21],[4,0,4,29],[0,0,1,0],[0,1,1,28],[0,29,1,29],[2,0,2,29],[3,0,3,29]]}
["CGCIT","SISTEMA DE CUSTOS REFERENCIAIS DE OBRAS - SICRO",{"$nulls":27},"DNIT"]
[]
[]
["Alagoas - Abril/2023"]
["Com desoneração"]
[]
["Código","Descrição","Unid.","Encargos Sociais (%)",{"$nulls":8},"Encargos Trabalhistas (%)",{"$nulls":9},"Verbas Rescisórias (%)",{"$nulls":4},"Reincidências (%)",null,"Total (%)"]
[null,null,null,"A1","A2","A3","A4","A5","A6","A7","A8","A9","B1","B2","B3","B4","B5","B6","B7","B8","B9","B10","C1","C2","C3","C4","C5","D1","D2"]
{"$rows_left_out":143}