{"text_format":"2","workbook":"xlsx","n_sheets":14,"sheets":["CAPA","CRONOGRAMA","ETAPAS","FCON","FCON1_Qde","FCON2_FatorK1","FCON3_FatorK2345","ENCARGOS COMPLEM.","SALÁRIOS HORAMÊS","Comp. Escritório","Comp. Energia","SALÁRIOS CONSULTORIA","ENCARGOS SOCIAIS","FCON4_OS"],"not_rendered":{"charts":0,"images":4,"macros":0,"external_links":49,"defined_names":6908,"comments":2,"pivot_tables":0},"unopened":[],"bounds":{"document_bytes":16777216,"sheet_cells":100000,"run_cost":"one","rows_first":2000,"rows_last":500,"rows_between":2000,"halvings":0,"cell_chars":16384,"cell_head_chars":4096},"cells_cut":0,"cells_raw":0,"read":"whole","date_system":"1900"}

{"sheet":"CAPA","index":0,"n_rows":33,"n_cols":20,"rows_kept":33,"cut":false,"hidden":false,"merged":[[13,0,13,9],[16,0,17,9],[18,0,18,9]]}
{"$rows_empty":13}
["ANEXO III"]
[]
[]
["Orçamento de Referência e Cronograma Físico-Financeiro"]
{"$rows_empty":15}
[{"$nulls":19},"'"]

{"sheet":"CRONOGRAMA","index":1,"n_rows":83,"n_cols":49,"rows_kept":83,"cut":false,"hidden":false,"merged":[[86,19,86,35],[73,13,73,18],[75,13,75,18],[73,19,73,24],[74,19,74,24],[75,19,75,24],[23,31,27,36],[28,31,32,36],[33,31,37,36],[38,31,42,36],[43,31,47,36],[48,31,52,36],[53,31,57,36],[68,13,72,18],[58,31,62,36],[67,31,67,36],[68,19,72,24],[71,25,71,30],[72,31,72,36],[66,31,66,36],[71,31,71,36],[66,25,66,30],[67,25,67,30],[72,25,72,30],[56,25,56,30],[57,25,57,30],[63,13,67,18],[63,19,67,24],[53,13,57,18],[23,13,26,18],[23,19,27,24],[28,19,32,24],[33,19,37,24],[23,25,27,30],[28,25,32,30],[33,25,37,30],[38,25,42,30],[43,25,47,30],[48,25,52,30],[61,19,61,24],[62,19,62,24],[61,25,61,30],[62,25,62,30],[73,2,75,2],[73,3,75,6],[73,7,73,12],[74,7,74,12],[75,7,75,12],[63,7,67,12],[68,0,72,0],[68,1,72,1],[68,2,72,2],[68,3,72,6],[68,7,72,12],[58,0,62,0],[58,1,62,1],[58,2,62,2],[58,3,62,6],[58,7,62,12],[58,13,62,18],[74,13,74,18],[9,7,9,12],[9,13,9,18],[32,7,32,12],[31,7,31,12],[31,13,31,18],[32,13,32,18],[43,1,47,1],[43,2,47,2],[43,3,47,6],[43,7,47,12],[33,1,37,1],[33,2,37,2],[33,3,37,6],[36,13,36,18],[37,13,37,18],[73,0,75,0],[73,1,75,1],[9,19,9,24],[56,19,56,24],[57,19,57,24],[48,0,52,0],[48,1,52,1],[48,2,52,2],[48,3,52,6],[48,7,52,12],[51,13,51,18],[52,13,52,18],[51,19,51,24],[52,19,52,24],[23,0,27,0],[23,1,27,1],[23,2,27,2],[27,7,27,12],[26,3,26,6],[46,13,46,18],[46,19,46,24],[47,13,47,18],[47,19,47,24],[43,0,47,0],[28,2,32,2],[28,3,32,6],[12,25,12,30],[18,0,22,0],[18,1,22,1],[18,2,22,2],[22,13,22,18],[22,7,22,12],[13,0,17,0],[13,1,17,1],[13,2,17,2],[22,3,22,6],[18,19,22,24],[0,0,4,37],[5,0,5,37],[6,3,7,36],[17,3,17,6],[11,3,11,6],[9,3,9,6],[11,0,12,0],[11,1,12,1],[13,19,17,24],[13,25,17,30],[13,31,17,36],[11,7,11,12],[17,13,17,18],[12,7,12,12],[12,13,12,18],[17,7,17,12],[16,3,16,6],[16,7,16,12],[11,19,11,24],[11,31,11,36],[12,19,12,24],[12,31,12,36],[11,13,11,18],[11,25,11,30],[80,0,81,0],[77,1,78,2],[80,1,81,2],[6,40,8,42],[6,39,9,39],[63,0,67,0],[63,1,67,1],[63,2,67,2],[73,25,75,30],[73,31,75,36],[6,0,9,0],[26,7,26,12],[53,3,57,6],[53,7,57,12],[63,3,67,6],[18,25,22,30],[18,31,22,36],[21,3,21,6],[21,7,21,12],[21,13,21,18],[38,2,42,2],[36,7,36,12],[37,7,37,12],[77,0,78,0],[6,43,9,43],[6,1,9,2],[6,37,9,37],[11,2,12,2],[27,3,27,6],[12,3,12,6],[53,0,57,0],[53,1,57,1],[53,2,57,2],[41,3,41,6],[42,3,42,6],[38,13,42,18],[41,7,41,12],[42,7,42,12],[38,19,42,24],[9,25,9,30],[9,31,9,36],[13,13,16,18],[28,1,32,1],[38,0,42,0],[38,1,42,1],[27,13,27,18],[28,0,32,0],[33,0,37,0]]}
["'"]
[]
[]
[]
[]
["CRONOGRAMA FÍSICO-FINANCEIRO"]
["ITEM","DISCRIMINAÇÃO",null,"SEMESTRE",{"$nulls":33},"TOTAL",null,null,"Duração",null,null,"PORTE"]
[]
[null,null,null,"1º MÊS",null,null,null,"2º MÊS",{"$nulls":5},"3º MÊS",{"$nulls":5},"4º MÊS",{"$nulls":5},"5º MÊS",{"$nulls":5},"6º MÊS"]
[{"$nulls":40},"dias","semana","quinzena"]
{"$rows_left_out":74}
{"sheet":"ETAPAS","index":2,"n_rows":74,"n_cols":22,"rows_kept":74,"cut":false,"hidden":false,"merged":[[17,1,17,4],[17,6,17,21],[18,1,18,4],[18,6,18,21],[19,1,19,4],[19,6,19,21],[20,1,20,4],[20,6,20,21],[21,1,21,4],[21,6,21,21],[22,1,22,4],[22,6,22,21],[23,1,23,4],[23,6,23,21],[24,1,24,4],[24,6,24,21],[25,1,25,4],[25,6,25,21],[32,1,33,1],[32,19,33,19],[35,1,36,1],[35,19,36,19],[26,1,26,4],[26,6,26,21],[28,19,28,35],[29,1,30,1],[29,19,30,19],[29,21,30,21],[44,1,45,1],[44,19,45,19],[47,1,48,1],[47,19,48,19],[38,1,39,1],[38,19,39,19],[41,1,42,1],[41,19,42,19],[50,1,51,1],[50,19,51,19],[53,1,54,1],[53,19,54,19],[50,2,51,18],[53,2,54,18],[65,2,66,18],[56,1,57,1],[56,19,57,19],[59,1,60,1],[59,19,60,19],[56,2,57,18],[59,2,60,18],[68,2,69,18],[11,1,13,21],[68,1,69,1],[68,19,69,19],[29,2,30,18],[32,2,33,18],[35,2,36,18],[38,2,39,18],[41,2,42,18],[44,2,45,18],[47,2,48,18],[62,1,63,1],[62,19,63,19],[65,1,66,1],[65,19,66,19],[62,2,63,18]]}
{"$rows_empty":11}
[null,"ETAPAS: "]
[]
[]
[]
[]
[{"$nulls":5},"%"]
[null,"Etapa 1",null,null,null,0.03,"Etapa 1 – Diagnóstico e Análise da Documentação e dos Dados Existentes; "]
[null,"Etapa 2",null,null,null,7.0000000000000007E-2,"Etapa 2 – Elaboração de Inspeção Especial com apresentação do devido Relatório; "]
[null,"Etapa 3",null,null,null,0.1,"Etapa 3 – Elaboração dos estudos hidráulicos e hidrológicos; "]
{"$rows_left_out":55}
{"sheet":"FCON","index":3,"n_rows":54,"n_cols":20,"rows_kept":54,"cut":false,"hidden":false,"merged":[[54,0,54,8],[42,0,42,4],[43,0,43,4],[44,0,44,4],[45,0,45,4],[46,0,46,8],[42,7,42,8],[43,7,43,8],[51,0,51,8],[47,0,47,8],[48,0,48,8],[49,0,49,8],[53,0,53,8],[50,0,50,8],[52,0,52,8],[0,0,1,6],[4,3,4,6],[0,7,0,8],[1,7,1,8],[4,7,4,8],[2,0,2,8],[3,0,3,8],[4,0,4,2],[5,0,5,2],[5,7,5,8],[5,3,5,6],[36,7,36,8],[36,0,36,6],[37,7,37,8],[38,7,38,8],[39,7,39,8],[40,7,40,8],[41,7,41,8],[37,0,37,6],[38,0,38,6],[39,0,39,6],[40,0,40,6],[41,0,41,6]]}
["'",{"$nulls":6},"CODIGO:"]
[{"$nulls":7},"FCON"]
["NOME DA CONSULTORA:"]
[]
["PROJETO:",null,null,"PRODUTO:",null,null,null,"EDITAL:"]
["SERVIÇOS ESPECIALIZADOS PARA ELABORAÇÃO DOS RELATÓRIOS DE REVISÃO PERIÓDICA DE SEGURANÇA DE BARRAGEM (RPSB) DO EIXO LESTE - PISF"]
["Cod.","Categoria / Insumo","Uni","Qde","CUD","PU","FatorK","CT","PT",null,null,"CODEVASF"]
["MO","Mão de Obra",{"$nulls":5},{"$f":"SUBTOTAL(9,H9:H22)","v":1585733.1000000003},{"$f":"SUBTOTAL(9,I9:I22)","v":3569525.52},null,null,"CATEGORIA","SAL. MENSAL"]
["P0","Coordenador Geral","mês",{"$f":"SUMIF(FCON1_Qde!$B$12:$B$33,\"=\"&FCON!$B9,FCON1_Qde!$D$12:$D$33)","v":5.9999999999999991},{"$f":"INDEX('SALÁRIOS CONSULTORIA'!D:D,MATCH(A9,'SALÁRIOS CONSULTORIA'!A:A,0))","v":16922.669999999998},{"$f":"ROUND(E9*G9,2)","v":37416.019999999997},{"$f":"FCON2_FatorK1!$E$37","v":2.2109999999999999},{"$f":"ROUND(D9*E9,2)","v":101536.02},{"$f":"ROUND(F9*D9,2)","v":224496.12},null,null,{"$f":"A9","v":"P0"},16889.91,null,{"$f":"E9=M9","v":false}]
["P1","Engenheiro Hidráulico","mês",{"$f":"SUMIF(FCON1_Qde!$B$12:$B$33,\"=\"&FCON!$B10,FCON1_Qde!$D$12:$D$33)","v":18},{"$f":"INDEX('SALÁRIOS CONSULTORIA'!D:D,MATCH(A10,'SALÁRIOS CONSULTORIA'!A:A,0))","v":11127.03},{"$f":"ROUND(E10*G10,2)","v":24870.02},{"$f":"FCON2_FatorK1!$E$38","v":2.2351000000000001},{"$f":"ROUND(D10*E10,2)","v":200286.54},{"$f":"ROUND(F10*D10,2)","v":447660.36},null,null,{"$f":"A10","v":"P1"},10987.76,null,{"$f":"E10=M10","v":false}]
{"$rows_left_out":45}
{"sheet":"FCON1_Qde","index":4,"n_rows":47,"n_cols":21,"rows_kept":47,"cut":false,"hidden":false,"merged":[[8,16,9,16],[6,3,9,3],[6,2,9,2],[6,0,9,0],[6,1,9,1],[40,0,40,10],[39,0,39,10],[43,0,43,16],[39,11,39,16],[40,11,40,16],[41,11,41,16],[42,11,42,16],[46,0,46,16],[45,0,45,16],[41,0,41,10],[42,0,42,10],[0,0,1,11],[2,0,2,16],[3,0,3,16],[0,12,0,16],[1,12,1,16],[6,4,6,16],[44,0,44,16],[4,12,4,16],[5,12,5,16],[4,2,4,11],[5,2,5,11],[5,0,5,1]]}
["'",{"$nulls":11},"CODIGO:"]
[{"$nulls":12},"FCON-1"]
["NOME DA CONSULTORA:"]
[]
["PROJETO:",null,"PRODUTO:",{"$nulls":9},"EDITAL:"]
["SERVIÇOS ESPECIALIZADOS PARA ELABORAÇÃO DOS RELATÓRIOS DE REVISÃO PERIÓDICA DE SEGURANÇA DE BARRAGEM (RPSB) DO EIXO LESTE - PISF"]
["Cod.","Insumo - Produto RPS","Uni","Qde              Total","PRODUTOS"]
[{"$nulls":4},"P1","P2","P3","P4","P5","P6","P7","P8","P9","P10","P11","P12","P13"]
[{"$nulls":4},2104,2105,2106,2107,2108,2109,2110,2111,2112,2113,2114,2115,"PE"]
[{"$nulls":4},"M","G","M","M","M","P","P","M","P","P","M","P"]
{"$rows_left_out":38}
{"sheet":"FCON2_FatorK1","index":5,"n_rows":50,"n_cols":20,"rows_kept":50,"cut":false,"hidden":false,"merged":[[42,4,42,5],[44,0,44,3],[29,1,29,3],[26,1,26,3],[27,1,27,3],[28,1,28,3],[32,1,32,3],[33,1,33,3],[35,1,35,3],[36,1,36,3],[34,1,34,3],[41,4,41,5],[37,1,37,3],[38,1,38,3],[39,1,39,3],[40,1,40,3],[8,1,8,3],[18,1,18,3],[19,1,19,3],[0,0,1,4],[2,0,2,5],[5,0,5,1],[5,2,5,4],[6,0,7,3],[6,4,6,5],[4,2,4,4],[3,0,3,5],[49,0,49,5],[48,0,48,5],[47,0,47,5],[46,0,46,5],[50,0,50,5],[25,1,25,3],[30,1,30,3],[31,1,31,3],[20,1,20,3],[21,1,21,3],[22,1,22,3],[23,1,23,3],[24,1,24,3]]}
["'",{"$nulls":4},"CODIGO:"]
[{"$nulls":5},"FCON-2"]
["NOME DA CONSULTORA:"]
[]
["PROJETO:",null,"PRODUTO:",null,null,"EDITAL:"]
["SERVIÇOS ESPECIALIZADOS PARA ELABORAÇÃO DOS RELATÓRIOS DE REVISÃO PERIÓDICA DE SEGURANÇA DE BARRAGEM (RPSB) DO EIXO LESTE - PISF"]
["DISCRIMINAÇÃO",null,null,null,"VALORES"]
[{"$nulls":4},"%","R$"]
["A","ENCARGOS SOCIAIS BÁSICOS",null,null,{"$f":"ROUND(SUM(E10:E18),4)","v":0.36799999999999999},{"$f":"E9*FCON!$H$8","v":583549.78080000007}]
["A1","SECONCI",null,null,0,{"$f":"E10*FCON!$H$8","v":0}]
{"$rows_left_out":41}
{"sheet":"FCON3_FatorK2345","index":6,"n_rows":42,"n_cols":20,"rows_kept":42,"cut":false,"hidden":false,"merged":[[38,0,38,5],[39,0,39,5],[22,1,22,3],[15,1,15,3],[16,1,16,3],[17,1,17,3],[27,0,27,5],[31,0,31,5],[32,0,32,5],[28,0,28,5],[29,0,29,5],[30,0,30,5],[33,0,33,5],[34,0,34,5],[35,0,35,5],[36,0,36,5],[0,0,1,4],[2,0,2,5],[5,0,5,1],[5,2,5,4],[6,4,6,5],[4,2,4,4],[3,0,3,5],[37,0,37,5],[14,1,14,3],[6,0,7,3],[13,1,13,3],[10,1,10,2],[11,1,11,2],[12,1,12,2],[8,0,9,0],[8,1,9,2],[18,1,18,3],[19,1,19,2],[20,1,20,2]]}
["'",{"$nulls":4},"CODIGO:"]
[{"$nulls":5},"FCON-3"]
["NOME DA CONSULTORA:"]
[]
["PROJETO:",null,"PRODUTO:",null,null,"EDITAL:"]
["SERVIÇOS ESPECIALIZADOS PARA ELABORAÇÃO DOS RELATÓRIOS DE REVISÃO PERIÓDICA DE SEGURANÇA DE BARRAGEM (RPSB) DO EIXO LESTE - PISF"]
["DISCRIMINAÇÃO 1",null,null,null,"VALORES"]
[{"$nulls":4},"%","R$"]
["K4","DESPESAS FISCAIS",null,"K4 (%)2","K4' (%)3"]
[null,null,null,{"$f":"ROUND(D11+D12+D13,4)","v":8.6499999999999994E-2},{"$f":"ROUND(E11+E12+E13,4)","v":9.4600000000000004E-2},{"$f":"E10*SUM(FCON!$H$8*(1+FCON2_FatorK1!$E$36)+FCON!$H$23+FCON!$H$27+FCON3_FatorK2345!$F$15+FCON3_FatorK2345!$F$14)","v":312272.85387329466}]
{"$rows_left_out":33}
{"sheet":"ENCARGOS COMPLEM.","index":7,"n_rows":33,"n_cols":20,"rows_kept":33,"cut":false,"hidden":false,"merged":[[26,0,26,3],[0,0,1,4],[2,0,2,5],[3,0,3,5],[4,2,4,4],[5,0,5,1],[5,2,5,4],[6,0,7,3],[6,4,6,5],[8,1,8,3],[23,4,23,5],[24,4,24,5],[28,0,28,5],[29,0,29,5],[30,0,30,5],[31,0,31,5],[32,0,32,5]]}
["'",{"$nulls":4},"CODIGO:"]
[{"$nulls":5},"FCON-4"]
["NOME DA CONSULTORA:"]
[]
["PROJETO:",null,"PRODUTO:",null,null,"EDITAL:"]
["SERVIÇOS ESPECIALIZADOS PARA ELABORAÇÃO DOS RELATÓRIOS DE REVISÃO PERIÓDICA DE SEGURANÇA DE BARRAGEM (RPSB) DO EIXO LESTE - PISF"]
["DISCRIMINAÇÃO",null,null,null,"VALORES"]
[{"$nulls":4},"%","R$"]
["P0","Coordenador - Senior",null,null,{"$f":"ROUND(SUM(E10:E11),4)","v":4.02E-2},{"$f":"SUM(F10:F11)","v":680.29133400000001},"P8061"]
[null,"ALIMENTAÇÃO",null,null,0.04,{"$f":"E10*FCON!$E$9","v":676.90679999999998}]
{"$rows_left_out":24}
{"sheet":"SALÁRIOS HORAMÊS","index":8,"n_rows":33,"n_cols":20,"rows_kept":33,"cut":false,"hidden":false,"merged":[[1,0,1,5],[3,7,3,8]]}
["'"]
["TABELA SALÁRIOS DE PROFISSIONAIS DE ENGENHARIA CONSULTIVA"]
[]
["PROFISSIONAL","CATEGORIA","NÍVEL","TEMPO FORMAÇÃO (ANOS)","EXPERIÊNCIA (PROJETOS)","SALÁRIO-HORA ADOTADO (R$) \n(176 H/MÊS)",null,"Ref",{"$nulls":5},"PROFISSIONAL(Descrição na tabela enviada à AD/GCT)","REFERÊNCIA ","FONTE","VALOR ","DESCRIÇÃO"]
["CONSULTOR","C","PÓS-GRADUAÇÃO","-","+ 20",{"$f":"20307.2/176","v":115.38181818181819},null,"P8060","SICRO",20302.32,"Engenheiro consultor especial",null,null,"CONSULTOR","P8060","SICRO",20302.32,"Engenheiro consultor especial"]
["ENGENHERIO SÊNIOR","P0","SUPERIOR","T > 15","+ 15",{"$f":"16922.67/176","v":96.151534090909081},null,"P8061","SICRO",16918.599999999999,"Engenheiro coordenador",null,null,"ENGENHERIO SÊNIOR","P8061","SICRO",16918.599999999999,"Engenheiro coordenador"]
["ENGENHEIRO PLENO","P1","SUPERIOR","10 < T < 15","+ 10",{"$f":"11127.03/176","v":63.221761363636368},null,"P8066","SICRO",11294.64,"Engenheiro de projetos pleno",null,null,"ENGENHEIRO PLENO","P8066","SICRO",11294.64,"Engenheiro de projetos pleno"]
["ENGENHEIRO MÉDIO","P2","SUPERIOR","8 < T < 10","+ 5",{"$f":"10302/176","v":58.534090909090907},null,"P8066","SICRO",11294.64,"Engenheiro de projetos pleno",null,null,"ENGENHEIRO MÉDIO","P8066","SICRO",11294.64,"Engenheiro de projetos pleno"]
["ENGENHEIRO JÚNIOR","P3","SUPERIOR","4 < T < 8","+ 2",{"$f":"10302/176","v":58.534090909090907},null,"P8065","SICRO",11067,"Engenheiro de projetos júnior",null,null,"ENGENHEIRO JÚNIOR","P8065","SICRO",11067,"Engenheiro de projetos júnior"]
["ENGENHEIRO TRAINEE","P4","SUPERIOR","T < 4","-",{"$f":"J10","v":79.67},null,"56.11.07","SUDECAP",79.67," ENGENHEIRO TRAINEE PROJETO",null,null,"ENGENHEIRO TRAINEE","56.11.07","SUDECAP",79.67," ENGENHEIRO TRAINEE PROJETO"]
{"$rows_left_out":18}
{"sheet":"Comp. Escritório","index":9,"n_rows":33,"n_cols":20,"rows_kept":33,"cut":false,"hidden":false,"merged":[[21,0,31,6],[32,0,32,4],[32,5,32,6],[9,2,9,5],[7,4,8,4],[7,5,8,5],[7,6,8,6],[20,0,20,6],[0,2,0,5],[1,2,1,5],[2,2,2,5],[4,0,5,5],[7,0,8,0],[7,1,8,1],[7,2,8,2],[7,3,8,3]]}
["'",null,"Ministério do Desenvolvimento Regional  - MDR"]
[null,null,"Companhia de Desenvolvimento dos Vales do São Francisco e do Parnaíba"]
[null,null,"Gerência de Operação do PISF - Centro de Controle e Operação (AD / GOI / CCO)"]
[]
["TERMO DE REFERÊNCIA PARA CONTRATAÇÃO DE RPSB"]
[]
[]
["ITEM","CÓD","CATEGORIA / DESCRIÇÃO","UND.","QUANTID.","VALOR UN","VALOR TOTAL"]
[]
["1.",null,"ESCRITÓRIO - ADMINISTRAÇÃO E LOGÍSTICA",null,null,null,{"$f":"SUM(G11:G20)","v":6977.4013333333332},"6 meses "]
{"$rows_left_out":15}
{"sheet":"Comp. Energia","index":10,"n_rows":33,"n_cols":20,"rows_kept":33,"cut":false,"hidden":false,"merged":[]}
["'","Composição Energia"]
[]
[null,"Valor kWh",0.70599999999999996]
[]
[null,"Quantidade","Descrição","Uso diário","KWh/Mês","Custo/Mês"]
[null,12,"Celular","9 horas",16.2,{"$f":"E6*$C$3","v":11.437199999999999}]
[null,4,"Iluminação","9 horas",64.8,{"$f":"E7*$C$3","v":45.748799999999996}]
[null,1,"Impressora","60 minutos",2.7,1.9062000000000001]
[null,2,"Luminária","9 horas",32.4,22.874399999999998]
[null,1,"Modem","24 horas",19.440000000000001,13.724640000000001]
{"$rows_left_out":6}
{"sheet":"SALÁRIOS CONSULTORIA","index":11,"n_rows":33,"n_cols":20,"rows_kept":33,"cut":false,"hidden":false,"merged":[[1,0,1,6],[2,0,2,6],[3,0,3,1],[3,2,3,3],[4,0,4,1]]}
["'"]
["CODEVASF"]
["SALÁRIOS - ENGENHARIA CONSULTIVA - 2023"]
["DATA: Março/2023",null,"Localidade: Pernambuco"]
["Encargos Sociais",null,"Horista:",{"$f":"'ENCARGOS SOCIAIS'!E42","v":1.1455000000000002},"Mensalista:",{"$f":"'ENCARGOS SOCIAIS'!F42","v":0.70109999999999995}]
[]
["Categoria","Profissional","Salário-hora adotado\n (R$)","Sal. Mensal\n (R$)","Encargos Sociais\n (R$)","Sal. Mensal c/ Encargos\n (R$)","Encargos Sociais\n (%)"]
["C","Consultor",{"$f":"INDEX('SALÁRIOS HORAMÊS'!F:F,MATCH(A8,'SALÁRIOS HORAMÊS'!B:B,0))","v":115.38181818181819},{"$f":"ROUND(C8*$A$26,2)","v":20307.2},{"$f":"ROUND(D8*G8%,2)","v":4061.44},{"$f":"D8+E8","v":24368.639999999999},{"$f":"'ENCARGOS SOCIAIS'!F9*100","v":20}]
["P0","Engenheiro - Profissional Sênior",{"$f":"INDEX('SALÁRIOS HORAMÊS'!F:F,MATCH(A9,'SALÁRIOS HORAMÊS'!B:B,0))","v":96.151534090909081},{"$f":"ROUND(C9*$A$26,2)","v":16922.669999999998},{"$f":"ROUND(D9*G9%,2)","v":11864.48},{"$f":"D9+E9","v":28787.149999999998},{"$f":"$F$5*100","v":70.11}]
["P1","Engenheiro - Profissional Pleno",{"$f":"INDEX('SALÁRIOS HORAMÊS'!F:F,MATCH(A10,'SALÁRIOS HORAMÊS'!B:B,0))","v":63.221761363636368},11127.03,7801.16,18928.190000000002,{"$f":"$F$5*100","v":70.11}]
{"$rows_left_out":24}
{"sheet":"ENCARGOS SOCIAIS","index":12,"n_rows":42,"n_cols":19,"rows_kept":42,"cut":false,"hidden":false,"merged":[[18,0,18,5],[30,0,30,5],[37,0,37,5],[41,0,41,1],[4,0,4,5],[5,0,6,0],[5,1,6,1],[5,2,5,3],[5,4,5,5],[7,0,7,5]]}
["'"]
[]
["SINAPI - PERNAMBUCO ",null,null,null,"VIGÊNCIA A PARTIR DE ","12/2022"]
[]
["ENCARGOS  SOCIAIS  SOBRE  A  MÃO   DE  OBRA"]
["CÓDIGO","DESCRIÇÃO","COM DESONERAÇÃO",null,"SEM DESONERAÇÃO"]
["CÓDIGO","DESCRIÇÃO","HORISTA\n%","MENSALISTA\n%","HORISTA\n%","MENSALISTA\n%"]
["GRUPO A"]
["A1","INSS",0,0,0.2,0.2]
["A2","SESI",1.4999999999999999E-2,1.4999999999999999E-2,1.4999999999999999E-2,1.4999999999999999E-2]
{"$rows_left_out":33}
{"sheet":"FCON4_OS","index":13,"n_rows":48,"n_cols":9,"rows_kept":48,"cut":false,"hidden":false,"merged":[[37,0,37,4],[37,5,37,8],[0,0,1,6],[0,7,0,8],[1,7,1,8],[2,0,2,8],[3,0,3,8],[4,0,4,2],[4,3,4,6],[4,7,4,8],[5,0,5,2],[5,3,5,6],[5,7,5,8],[36,0,36,4],[36,5,36,8],[38,0,38,4],[38,5,38,8],[39,0,39,4],[39,5,39,8],[40,0,40,4],[40,5,40,8],[49,0,49,8],[41,0,41,4],[41,5,41,8],[42,0,42,4],[42,7,42,8],[43,0,43,4],[43,7,43,8],[44,0,44,4],[45,0,45,4],[46,0,46,8],[47,0,48,8],[50,0,50,8],[51,0,51,8],[52,0,52,8],[53,0,53,8],[54,0,54,8]]}
["ORDEM DE SERVIÇO",{"$nulls":6},"CODIGO:"]
[{"$nulls":7},"O.S."]
["NOME DA CONSULTORA:"]
[]
["PROJETO:",null,null,"PRODUTO:",null,null,null,"CONTRATO:"]
["SERVIÇOS ESPECIALIZADOS PARA ELABORAÇÃO DOS RELATÓRIOS DE REVISÃO PERIÓDICA DE SEGURANÇA DE BARRAGEM (RPSB) DO EIXO LESTE - PISF"]
["Cod.","Categoria / Insumo","Uni","Qde","CUD","PU","FatorK","CT","PT"]
["MO","Mão de Obra",{"$nulls":5},{"$f":"SUM(H9:H22)","v":0},{"$f":"SUM(I9:I22)","v":0}]
["P0","Coordenador Geral","mês"]
["P1","Engenheiro Hidráulico","mês"]
{"$rows_left_out":38}