{"text_format":"2","workbook":"xlsx","n_sheets":17,"sheets":["Resumo","Orçamento","Cronograma","Curva ABC","Adm Local","BDI","Encargos Sociais","Insumos SINAPI (des)","CPU (des)","CPU Própria (des)","Insumos ORSE (des)","Insumo SINAPI (sem des.)","CPU (sem des)","CPU Própria (sem des)","Insumos ORSE (sem des)","Cotação Playground","Cotação Estaca"],"not_rendered":{"charts":0,"images":0,"macros":0,"external_links":0,"defined_names":5,"comments":0,"pivot_tables":0},"unopened":[],"bounds":{"document_bytes":16777216,"sheet_cells":100000,"run_cost":"one","rows_first":2000,"rows_last":500,"rows_between":2000,"halvings":0,"cell_chars":16384,"cell_head_chars":4096},"cells_cut":0,"cells_raw":0,"read":"whole","date_system":"1900"}

{"sheet":"Resumo","index":0,"n_rows":19,"n_cols":7,"rows_kept":19,"cut":false,"hidden":false,"merged":[[6,5,6,6],[18,1,18,2],[1,1,1,6],[2,1,3,3],[6,1,7,1],[6,2,7,2],[6,3,6,4]]}
[]
[null,"QUADRO RESUMO DO ORÇAMENTO"]
[null,"Obra: Realização das obras de revitalização do setor \ncomercial e portuário do município de Santana, no estado do Amapá"]
[]
[]
[]
[null,"Item","DESCRIÇÃO","PREÇO  SEM DESONERAÇÃO           ",null,"PREÇO  COM DESONERAÇÃO           "]
[null,null,null,"RELAÇÃO (%)","VALOR","RELAÇÃO (%)","VALOR"]
[null,1,{"$f":"Orçamento!C10","v":"Administração de Obras"},{"$f":"E9/$E$19","v":{"$error":"#REF!"}},{"$f":"Orçamento!N10","v":0},{"$f":"G9/$G$19","v":{"$error":"#REF!"}},{"$f":"Orçamento!O10","v":0}]
[null,2,{"$f":"Orçamento!C13","v":"Projeto Urbanístico"},{"$error":"#REF!"},{"$f":"Orçamento!N13","v":0},{"$error":"#REF!"},{"$f":"Orçamento!O13","v":0}]
[null,3,{"$f":"Orçamento!C175","v":"Edificações Novas"},{"$error":"#REF!"},{"$f":"Orçamento!N175","v":0},{"$error":"#REF!"},{"$f":"Orçamento!O175","v":0}]
[null,4,{"$f":"Orçamento!C1258","v":"Edificações a serem Reformadas"},{"$error":"#REF!"},{"$f":"Orçamento!N1258","v":0},{"$error":"#REF!"},{"$f":"Orçamento!O1258","v":0}]
[null,5,{"$f":"Orçamento!C1402","v":"Projeto Viário"},{"$error":"#REF!"},{"$f":"Orçamento!N1402","v":{"$error":"#REF!"}},{"$error":"#REF!"},{"$f":"Orçamento!O1402","v":{"$error":"#REF!"}}]
[null,6,{"$f":"Orçamento!C1455","v":"Projeto de Drenagem"},{"$error":"#REF!"},{"$f":"Orçamento!N1455","v":0},{"$error":"#REF!"},{"$f":"Orçamento!O1455","v":0}]
[null,7,{"$f":"Orçamento!C1492","v":"Projeto de Iluminação e Eletrificação Pública"},{"$error":"#REF!"},{"$f":"Orçamento!N1492","v":0},{"$error":"#REF!"},{"$f":"Orçamento!O1492","v":0}]
[null,8,{"$f":"Orçamento!C1541","v":"Projeto de Abastecimento de Água e Rede de Esgoto"},{"$error":"#REF!"},{"$f":"Orçamento!N1541","v":0},{"$error":"#REF!"},{"$f":"Orçamento!O1541","v":0}]
[null,9,{"$f":"Orçamento!C1617","v":"Estruturas de Contenção"},{"$error":"#REF!"},{"$f":"Orçamento!N1617","v":0},{"$error":"#REF!"},{"$f":"Orçamento!O1617","v":0}]
[null,10,{"$f":"Orçamento!C1661","v":"Estruturas de Acesso e Embarcação"},{"$error":"#REF!"},{"$f":"Orçamento!N1661","v":0},{"$error":"#REF!"},{"$f":"Orçamento!O1661","v":0}]
[null,"Custo total",null,{"$f":"ROUND(SUM(D9:D18),3)","v":{"$error":"#REF!"}},{"$f":"SUM(E9:E18)","v":{"$error":"#REF!"}},{"$f":"ROUND(SUM(F9:F18),3)","v":{"$error":"#REF!"}},{"$f":"SUM(G9:G18)","v":{"$error":"#REF!"}}]

{"sheet":"Orçamento","index":1,"n_rows":1689,"n_cols":15,"rows_kept":1689,"cut":false,"hidden":false,"merged":[[2,1,6,4],[1688,13,1689,13],[1688,14,1689,14],[7,1,8,1],[7,2,8,3],[7,4,8,4],[7,5,8,5],[7,6,8,6],[7,7,7,9],[7,10,7,12],[7,13,8,13],[7,14,8,14]]}
[]
[null,"QUADRO DEMONSTRATIVO DO ORÇAMENTO"]
[null,"Obra: Realização das obras de revitalização do setor \ncomercial e portuário do município de Santana, no estado do Amapá",{"$nulls":8},"BDIs adotados:",null,null,"Sem Desoneração","Com Desoneração"]
[{"$nulls":10},"Serviços",null,null,{"$f":"BDI!C24","v":0},{"$f":"BDI!C77","v":0}]
[{"$nulls":10},"Fornecimento",null,null,{"$f":"BDI!C50","v":0},{"$f":"BDI!C103","v":0}]
[]
[]
[null,"Item","Código",null,"DESCRIÇÃO","UND","QUANT","PREÇO  SEM DESONERAÇÃO           ",null,null,"PREÇO  COM DESONERAÇÃO           ",null,null,"TOTAL SEM DESONERAÇÃO    ","TOTAL COM DESONERAÇÃO    "]
[{"$nulls":7},"Custo Direto","BDI","Custo com BDI","Custo Direto","BDI","Custo com BDI"]
[null,1,"Administração de Obras",{"$nulls":10},{"$f":"N11","v":0},{"$f":"O11","v":0}]
[null,"1.1","Administração Local",null,null,null,1,{"$nulls":6},{"$f":"SUM(N12)","v":0},{"$f":"SUM(O12)","v":0}]
[null,"1.1.1","Composição Própria",1,"Administração Local","UN",1,null,{"$f":"$N$4","v":0},{"$f":"H12*(1+I12)","v":0},null,{"$f":"$O$4","v":0},{"$f":"K12*(1+L12)","v":0},{"$f":"J12*G12","v":0},{"$f":"M12*G12","v":0}]
[null,2,"Projeto Urbanístico",{"$nulls":10},{"$f":"N14+N45+N84+N106+N129+N142","v":0},{"$f":"O14+O45+O84+O106+O129+O142","v":0}]
[null,"2.1","Praça da Natureza",{"$nulls":10},{"$f":"N15+N17+N21+N28+N31+N38+N42","v":0},{"$f":"O15+O17+O21+O28+O31+O38+O42","v":0}]
[null,"2.1.1","SERVIÇOS PRELIMINARES ",null,null,null,1,{"$nulls":6},{"$f":"SUM(N16)","v":0},{"$f":"SUM(O16)","v":0}]
[null,"2.1.1.1","Composição Própria","1.1","MOBILIZAÇÃO ","UN",1,null,{"$f":"$N$4","v":0},{"$f":"H16*(1+I16)","v":0},null,{"$f":"$O$4","v":0},{"$f":"K16*(1+L16)","v":0},{"$f":"J16*G16","v":0},{"$f":"M16*G16","v":0}]
[null,"2.1.2","PAVIMENTAÇÃO ",null,null,null,1,{"$nulls":6},{"$f":"SUM(N18:N20)","v":0},{"$f":"SUM(O18:O20)","v":0}]
[null,"2.1.2.1","Composição Sinapi",100575,"REGULARIZAÇÃO DE SUPERFÍCIES COM MOTONIVELADORA. AF_11/2019","M2",1979.58,null,{"$f":"$N$4","v":0},{"$f":"H18*(1+I18)","v":0},null,{"$f":"$O$4","v":0},{"$f":"K18*(1+L18)","v":0},{"$f":"J18*G18","v":0},{"$f":"M18*G18","v":0}]
[null,"2.1.2.2","Composição Orse",3212,"Colchão de areia","M3",197.95,null,{"$f":"$N$4","v":0},{"$f":"H19*(1+I19)","v":0},null,{"$f":"$O$4","v":0},{"$f":"K19*(1+L19)","v":0},{"$f":"J19*G19","v":0},0]
[null,"2.1.2.3","Composição Sinapi",92397,"EXECUÇÃO DE PÁTIO/ESTACIONAMENTO EM PISO INTERTRAVADO, COM BLOCO RETANGULAR COR NATURAL DE 20 X 10 CM, ESPESSURA 6 CM. AF_12/2015","M2",1979.58,null,{"$f":"$N$4","v":0},{"$f":"H20*(1+I20)","v":0},null,{"$f":"$O$4","v":0},{"$f":"K20*(1+L20)","v":0},{"$f":"J20*G20","v":0},0]
{"$rows_left_out":1670}
{"sheet":"Cronograma","index":2,"n_rows":29,"n_cols":44,"rows_kept":29,"cut":false,"hidden":false,"merged":[[0,1,1,4],[25,1,26,2],[27,1,28,2],[4,1,5,1],[6,1,7,1],[8,1,9,1],[10,1,11,1],[12,1,13,1],[14,1,15,1],[16,1,17,1],[18,1,19,1],[20,1,21,1],[22,1,23,1],[16,2,17,2],[18,2,19,2],[20,2,21,2],[22,2,23,2],[4,2,5,2],[6,2,7,2],[8,2,9,2],[10,2,11,2],[12,2,13,2],[14,2,15,2]]}
[null,"CRONOGRAMA FÍSICO-FINANCEIRO"]
[]
[]
[null,null,null,"Mês 1","Mês 2","Mês 3","Mês 4","Mês 5","Mês 6","Mês 7","Mês 8","Mês 9","Mês 10","Mês 11","Mês 12","Mês 13","Mês 14","Mês 15","Mês 16","Mês 17","Mês 18","Mês 19","Mês 20","Mês 21","Mês 22","Mês 23","Mês 24","Mês 25","Mês 26","Mês 27","Mês 28","Mês 29","Mês 30","Mês 31","Mês 32","Mês 33","Mês 34","Mês 35","Mês 36","Mês 37","Mês 38","Mês 39","Mês 40"]
[null,"Administração de Obras",{"$f":"Resumo!G9","v":0},{"$f":"D6*$C$5","v":0},0,0,0,0,0,0,0,0,0,0,0,0,0,0,0,0,0,0,0,0,0,0,0,0,0,0,0,0,0,0,0,0,0,0,0,0,0,0,0,{"$f":"SUM(D5:AQ5)","v":0}]
[null,null,null,2.3213446101517763E-3,5.3819709432818257E-3,4.8623646131286374E-3,6.3248166250422146E-3,1.3670568217118801E-2,1.5413627916933582E-2,1.7156687616748368E-2,2.4029323004589518E-2,3.1325272890957108E-2,2.6195697202930749E-2,5.1046748351718666E-3,4.208244132409977E-3,1.7359343365497017E-2,2.6352247055939599E-2,2.4044105106330697E-2,1.4253239602514987E-2,1.2421145617365509E-2,4.7088245063946189E-2,6.194234676379852E-2,6.5795736464034874E-2,7.2567383747556627E-2,6.6825938849672098E-2,4.3629133553710342E-2,2.5935151962061833E-2,1.071742700890102E-2,1.1483190472900836E-2,1.0707501978777314E-2,2.1905687779541855E-2,2.2599486383211506E-2,2.8135734233087142E-2,2.9416853617682211E-2,4.896271287439824E-2,4.0708760668539103E-2,2.6295182743272843E-2,2.150207485962384E-2,2.7867444113177174E-2,3.4208874750760745E-2,2.1324787253115294E-2,8.3257834337433778E-3,1.6298220367555955E-3,0.99999993396838072]
[null,"Projeto Urbanístico",{"$f":"Resumo!G10","v":0},{"$f":"D8*$C$7","v":0},0,0,0,0,0,0,0,0,0,0,0,0,0,0,0,0,0,0,0,0,0,0,0,0,0,0,0,0,0,0,0,0,0,0,0,0,0,0,0,0]
[null,null,null,0,0,1.6879999999999999E-2,0,0,0,0,0,0,0,0,0,3.85E-2,0.15890000000000001,0.1258,3.8899999999999997E-2,{"$f":"0.38-SUM(P8:S8)","v":1.7899999999999971E-2},0,0,0,0,0,0,0,0,0,0,0,0,0,0,0,0,0,3.5999999999999999E-3,0.1489,0.22140000000000001,0.14580000000000001,6.9800000000000001E-2,{"$f":"1-SUM(D8:AP8)","v":1.3619999999999965E-2},1]
[null,"Edificações Novas",{"$f":"Resumo!G11","v":0},{"$f":"D10*$C$9","v":0},0,0,0,0,0,0,0,0,0,0,0,0,0,0,0,0,0,0,0,0,0,0,0,0,0,0,0,0,0,0,0,0,0,0,0,0,0,0,0,0]
[null,null,null,0,0,0,2.5399999999999999E-2,5.4899999999999997E-2,6.1899999999999997E-2,6.8900000000000003E-2,9.6500000000000002E-2,0.1258,0.1052,2.0500000000000001E-2,1.6899999999999998E-2,4.0599999999999997E-2,1.23E-2,1.2500000000000001E-2,1.15E-2,1.89E-2,1.95E-2,1.23E-2,1.11E-2,1.2699999999999999E-2,1.11E-2,1.23E-2,1.18E-2,1.1900000000000001E-2,1.11E-2,3.5400000000000001E-2,2.69E-2,2.5499999999999998E-2,1.18E-2,1.11E-2,1.2699999999999999E-2,1.11E-2,1.23E-2,1.18E-2,2.1100000000000001E-2,1.89E-2,{"$f":"1-SUM(C10:AN10)","v":1.5800000000000036E-2},0,0,1]
[null,"Edificações a serem Reformadas",{"$f":"Resumo!G12","v":0},{"$f":"D12*$C$11","v":0},0,0,0,0,0,0,0,0,0,0,0,0,0,0,0,0,0,0,0,0,0,0,0,0,0,0,0,0,0,0,0,0,0,0,0,0,0,0,0,0]
[null,null,null,0.2198,0.50960000000000005,{"$f":"1-E12-D12","v":0.27059999999999995},0,0,0,0,0,0,0,0,0,0,0,0,0,0,0,0,0,0,0,0,0,0,0,0,0,0,0,0,0,0,0,0,0,0,0,0,0,1]
[null,"Projeto Viário",{"$f":"Resumo!G13","v":{"$error":"#REF!"}},{"$f":"D14*$C$13","v":{"$error":"#REF!"}},{"$error":"#REF!"},{"$error":"#REF!"},{"$error":"#REF!"},{"$error":"#REF!"},{"$error":"#REF!"},{"$error":"#REF!"},{"$error":"#REF!"},{"$error":"#REF!"},{"$error":"#REF!"},{"$error":"#REF!"},{"$error":"#REF!"},{"$error":"#REF!"},{"$error":"#REF!"},{"$error":"#REF!"},{"$error":"#REF!"},{"$error":"#REF!"},{"$error":"#REF!"},{"$error":"#REF!"},{"$error":"#REF!"},{"$error":"#REF!"},{"$error":"#REF!"},{"$error":"#REF!"},{"$error":"#REF!"},{"$error":"#REF!"},{"$error":"#REF!"},{"$error":"#REF!"},{"$error":"#REF!"},{"$error":"#REF!"},{"$error":"#REF!"},{"$error":"#REF!"},{"$error":"#REF!"},{"$error":"#REF!"},{"$error":"#REF!"},{"$error":"#REF!"},{"$error":"#REF!"},{"$error":"#REF!"},{"$error":"#REF!"},{"$error":"#REF!"},{"$error":"#REF!"},{"$error":"#REF!"}]
[null,null,null,0,0,0,0,0,0,0,0,0,0,0,0,0,0,0,0,0,0,0,0,0,0,0,0,0,0,0,0,0,5.6500000000000002E-2,0.10249999999999999,0.26889999999999997,0.28449999999999998,0.1658,0.10249999999999999,{"$f":"1-SUM(AG14:AL14)","v":1.9300000000000095E-2},0,0,0,0,1]
[null,"Projeto de Drenagem",{"$f":"Resumo!G14","v":0},{"$f":"D16*$C$15","v":0},0,0,0,0,0,0,0,0,0,0,0,0,0,0,0,0,0,0,0,0,0,0,0,0,0,0,0,0,0,0,0,0,0,0,0,0,0,0,0,0]
[null,null,null,0,0,0,0,0,0,0,0,0,0,0,0,4.58E-2,7.5600000000000001E-2,0.10249999999999999,0.1158,9.5600000000000004E-2,9.8699999999999996E-2,8.8700000000000001E-2,8.2500000000000004E-2,8.0100000000000005E-2,7.8899999999999998E-2,7.0199999999999999E-2,{"$f":"1-SUM(P16:Z16)","v":6.5599999999999881E-2},0,0,0,0,0,0,0,0,0,0,0,0,0,0,0,0,1]
[null,"Projeto de Iluminação e Eletrificação Pública",{"$f":"Resumo!G15","v":0},{"$f":"D18*$C$17","v":0},0,0,0,0,0,0,0,0,0,0,0,0,0,0,0,0,0,0,0,0,0,0,0,0,0,0,0,0,0,0,0,0,0,0,0,0,0,0,0,0]
[null,null,null,0,0,0,0,0,0,0,0,0,0,0,0,0,0,0,0,0,0,0,0,0,0,0,0,0,0,0,0,0,0,0,0,0,0.10249999999999999,0.40889999999999999,0.2089,{"$f":"1-AM18-AL18-AK18","v":0.27970000000000006},0,0,0,1]
[null,"Projeto de Abastecimento de Água e Rede de Esgoto",{"$f":"Resumo!G16","v":0},{"$f":"D20*$C$19","v":0},0,0,0,0,0,0,0,0,0,0,0,0,0,0,0,0,0,0,0,0,0,0,0,0,0,0,0,0,0,0,0,0,0,0,0,0,0,0,0,0]
[null,null,null,0,0,0,0,0,0,0,0,0,0,0,0,4.58E-2,7.5600000000000001E-2,0.10249999999999999,0.1158,9.5600000000000004E-2,9.8699999999999996E-2,8.8700000000000001E-2,8.2500000000000004E-2,8.0100000000000005E-2,7.8899999999999998E-2,7.0199999999999999E-2,{"$f":"1-SUM(P20:Z20)","v":6.5599999999999881E-2},0,0,0,0,0,0,0,0,0,0,0,0,0,0,0,0,1]
{"$rows_left_out":10}
{"sheet":"Curva ABC","index":3,"n_rows":0,"n_cols":0,"rows_kept":0,"cut":false,"hidden":false,"merged":[]}

{"sheet":"Adm Local","index":4,"n_rows":17,"n_cols":10,"rows_kept":17,"cut":false,"hidden":false,"merged":[[24,4,24,7],[3,8,4,8],[3,9,4,9],[3,1,4,2],[3,3,4,3],[3,4,4,4],[3,5,4,5]]}
[]
[]
[]
[null,"Código",null,"DESCRIÇÃO","UND","QUANT","PREÇO  SEM DESONERAÇÃO           ","PREÇO  COM DESONERAÇÃO           ","TOTAL SEM DESONERAÇÃO    ","TOTAL COM DESONERAÇÃO    "]
[{"$nulls":6},"Custo Direto","Custo Direto"]
[null,"Composição Sinapi",93567,"ENGENHEIRO CIVIL DE OBRA PLENO COM ENCARGOS COMPLEMENTARES","MES",8,{"$f":"VLOOKUP(C6,'CPU (sem des)'!#REF!,8,FALSE)","v":{"$error":"#REF!"}},{"$f":"VLOOKUP(C6,'CPU (des)'!#REF!,8,FALSE)","v":{"$error":"#REF!"}},{"$f":"G6*F6","v":{"$error":"#REF!"}},{"$f":"H6*F6","v":{"$error":"#REF!"}}]
[null,"Composição Sinapi",93565,"ENGENHEIRO CIVIL DE OBRA JUNIOR COM ENCARGOS COMPLEMENTARES","MES",36,{"$f":"VLOOKUP(C7,'CPU (sem des)'!#REF!,8,FALSE)","v":{"$error":"#REF!"}},{"$f":"VLOOKUP(C7,'CPU (des)'!#REF!,8,FALSE)","v":{"$error":"#REF!"}},{"$f":"G7*F7","v":{"$error":"#REF!"}},{"$f":"H7*F7","v":{"$error":"#REF!"}}]
[null,"Composição Sinapi",93569,"ARQUITETO JUNIOR COM ENCARGOS COMPLEMENTARES","MES",10,{"$f":"VLOOKUP(C8,'CPU (sem des)'!#REF!,8,FALSE)","v":{"$error":"#REF!"}},{"$f":"VLOOKUP(C8,'CPU (des)'!#REF!,8,FALSE)","v":{"$error":"#REF!"}},{"$error":"#REF!"},{"$error":"#REF!"}]
[null,"Composição Sinapi",88326,"VIGIA NOTURNO COM ENCARGOS COMPLEMENTARES","H",17520,{"$f":"VLOOKUP(C9,'CPU (sem des)'!#REF!,8,FALSE)","v":{"$error":"#REF!"}},{"$f":"VLOOKUP(C9,'CPU (des)'!#REF!,8,FALSE)","v":{"$error":"#REF!"}},{"$error":"#REF!"},{"$error":"#REF!"}]
[null,"Composição Sinapi",93572,"ENCARREGADO GERAL DE OBRAS COM ENCARGOS COMPLEMENTARES","MES",48,{"$f":"VLOOKUP(C10,'CPU (sem des)'!#REF!,8,FALSE)","v":{"$error":"#REF!"}},{"$f":"VLOOKUP(C10,'CPU (des)'!#REF!,8,FALSE)","v":{"$error":"#REF!"}},{"$error":"#REF!"},{"$error":"#REF!"}]
[null,"Composição Sinapi",93563,"TÉCNICO DE SEGURANÇA DO TRABALHO","MES",24,{"$f":"VLOOKUP(C11,'CPU (sem des)'!#REF!,8,FALSE)","v":{"$error":"#REF!"}},{"$f":"VLOOKUP(C11,'CPU (des)'!#REF!,8,FALSE)","v":{"$error":"#REF!"}},{"$error":"#REF!"},{"$error":"#REF!"}]
[null,"Composição Sinapi",93566,"AUXILIAR DE ESCRITORIO COM ENCARGOS COMPLEMENTARES","MES",40,{"$f":"VLOOKUP(C12,'CPU (sem des)'!#REF!,8,FALSE)","v":{"$error":"#REF!"}},{"$f":"VLOOKUP(C12,'CPU (des)'!#REF!,8,FALSE)","v":{"$error":"#REF!"}},{"$error":"#REF!"},{"$error":"#REF!"}]
[null,"Composição Sinapi",94296,"TOPOGRAFO COM ENCARGOS COMPLEMENTARES","MES",20,{"$f":"VLOOKUP(C13,'CPU (sem des)'!#REF!,8,FALSE)","v":{"$error":"#REF!"}},{"$f":"VLOOKUP(C13,'CPU (des)'!#REF!,8,FALSE)","v":{"$error":"#REF!"}},{"$error":"#REF!"},{"$error":"#REF!"}]
[null,"Composição Sinapi",93564,"APONTADOR OU APROPRIADOR COM ENCARGOS COMPLEMENTARES","MES",24,{"$f":"VLOOKUP(C14,'CPU (sem des)'!#REF!,8,FALSE)","v":{"$error":"#REF!"}},{"$f":"VLOOKUP(C14,'CPU (des)'!#REF!,8,FALSE)","v":{"$error":"#REF!"}},{"$error":"#REF!"},{"$error":"#REF!"}]
[null,"Composição Própria","1.3","VEÍCULO LEVE ","MES",12,{"$f":"'CPU Própria (sem des)'!#REF!","v":{"$error":"#REF!"}},{"$f":"'CPU Própria (des)'!#REF!","v":{"$error":"#REF!"}},{"$error":"#REF!"},{"$error":"#REF!"}]
[]
[{"$nulls":8},{"$f":"SUM(I6:I15)","v":{"$error":"#REF!"}},{"$f":"SUM(J6:J15)","v":{"$error":"#REF!"}}]

{"sheet":"BDI","index":5,"n_rows":103,"n_cols":3,"rows_kept":103,"cut":false,"hidden":false,"merged":[[93,1,93,2],[98,0,98,1],[99,0,99,2],[100,0,101,2],[102,0,102,1],[83,0,83,2],[84,1,84,2],[89,0,89,1],[90,1,90,2],[92,0,92,1],[81,0,82,0],[81,1,82,1],[81,2,82,2],[79,0,80,2],[72,0,72,1],[73,0,73,2],[74,0,75,2],[76,0,77,1],[76,2,77,2],[58,1,58,2],[63,0,63,1],[64,1,64,2],[66,0,66,1],[67,1,67,2],[56,0,57,0],[56,1,57,1],[56,2,57,2],[54,0,55,2],[11,0,11,1],[12,1,12,2],[14,0,14,1],[15,1,15,2],[52,0,53,2],[20,0,20,2],[21,0,22,2],[23,0,24,1],[23,2,24,2],[37,0,37,1],[38,1,38,2],[40,0,40,1],[0,0,1,2],[4,0,5,0],[4,1,5,1],[4,2,5,2],[6,1,6,2],[2,0,3,2],[46,0,46,2],[47,0,48,2],[49,0,49,1],[41,1,41,2],[19,0,19,1],[29,2,30,2],[31,0,31,2],[32,1,32,2],[45,0,45,1],[26,0,26,16383],[27,0,28,2],[29,0,30,0],[29,1,30,1]]}
["SEM DESONERAÇÃO"]
[]
["MEMÓRIA DE CALCULO DO BDI DE SERVIÇOS"]
[]
["ITEM","DISCRIMINAÇÃO","PERC.    (%)"]
[]
["1.00","Despesas Indiretas"]
["A1","Seguro e Garantia"]
["A2","Riscos e Imprevistos"]
["A3","Despesas Financeiras"]
["A4","Administração Central"]
["Total do Grupo A =",null,{"$f":"SUM(C8:C11)","v":0}]
["2.00","Benefício"]
["B-1","LUCRO"]
["Total do Grupo B =",null,{"$f":"C14","v":0}]
["3.00","Impostos"]
["C-1","PIS / PASEP"]
["C-2","COFINS"]
["C-3","ISS"]
["Total do Grupo C =",null,{"$f":"SUM(C17:C19)","v":0}]
{"$rows_left_out":84}
{"sheet":"Encargos Sociais","index":6,"n_rows":81,"n_cols":6,"rows_kept":81,"cut":false,"hidden":false,"merged":[[80,1,80,3],[0,0,1,5],[41,0,42,5],[75,1,75,3],[76,1,76,3],[77,1,77,3],[78,1,78,3],[79,1,79,3],[70,1,70,3],[71,1,71,3],[72,1,72,3],[73,1,73,3],[74,1,74,3],[65,1,65,3],[66,1,66,3],[67,1,67,3],[68,1,68,3],[69,1,69,3],[60,1,60,3],[61,1,61,3],[62,1,62,3],[63,1,63,3],[64,1,64,3],[55,1,55,3],[56,1,56,3],[57,1,57,3],[58,1,58,3],[59,1,59,3],[50,1,50,3],[51,1,51,3],[52,1,52,3],[53,1,53,3],[54,1,54,3],[43,0,44,5],[45,0,45,3],[45,4,45,5],[47,0,47,5],[48,0,49,3],[48,4,48,5],[14,1,14,3],[2,0,3,5],[4,0,4,3],[4,4,4,5],[6,0,6,5],[7,0,8,3],[7,4,7,5],[9,1,9,3],[10,1,10,3],[11,1,11,3],[12,1,12,3],[13,1,13,3],[29,1,29,3],[15,1,15,3],[16,1,16,3],[17,1,17,3],[18,1,18,3],[19,1,19,3],[20,1,20,3],[21,1,21,3],[23,1,23,3],[24,1,24,3],[25,1,25,3],[26,1,26,3],[22,1,22,3],[27,1,27,3],[28,1,28,3],[36,1,36,3],[37,1,37,3],[38,1,38,3],[39,1,39,3],[30,1,30,3],[31,1,31,3],[32,1,32,3],[33,1,33,3],[34,1,34,3],[35,1,35,3]]}
["SEM DESONERAÇÃO"]
[]
["DETALHAMENTO DOS ENCARGOS SOCIAIS"]
[]
["Encargos Sociais - Amapá ",null,null,null,"Vigência a partir de 12/2022 - SINAPI "]
["ENCARGOS SOCIAIS SOBRE MÃO DE OBRA "]
[]
["DISCRIMINAÇÃO",null,null,null,"SEM DESONERAÇÃO "]
[{"$nulls":4},"HORISTA %","MENSALISTA %"]
["A","ENCARGOS SOCIAIS BÁSICOS",null,null,{"$f":"SUM(E11:E19)","v":0},{"$f":"SUM(F11:F19)","v":0}]
["A1","INSS "]
["A2","SESI"]
["A3","SENAI "]
["A4","INCRA"]
["A5","SEBRAE"]
["A6","Saário Educação "]
["A7","Seguro Contra Acidentes de Trabalho "]
["A8","FGTS"]
["A9","SECONCI"]
["B"," ENCARGOS SOCIAIS QUE RECEBEM INCIDÊNCIA DE \"A\"",null,null,{"$f":"SUM(E21:E30)","v":0},{"$f":"SUM(F21:F30)","v":0}]
{"$rows_left_out":62}
{"sheet":"Insumos SINAPI (des)","index":7,"n_rows":0,"n_cols":0,"rows_kept":0,"cut":false,"hidden":false,"merged":[]}

{"sheet":"CPU (des)","index":8,"n_rows":0,"n_cols":0,"rows_kept":0,"cut":false,"hidden":false,"merged":[]}

{"sheet":"CPU Própria (des)","index":9,"n_rows":0,"n_cols":0,"rows_kept":0,"cut":false,"hidden":false,"merged":[]}

{"sheet":"Insumos ORSE (des)","index":10,"n_rows":37,"n_cols":9,"rows_kept":37,"cut":false,"hidden":false,"merged":[[2,0,2,9],[0,4,0,5],[0,6,0,7],[0,8,0,9],[1,4,1,5],[1,6,1,7],[1,8,1,9]]}
[1,null,null,"Obra","Bancos",null,"B.D.I.",null,"Encargos Sociais"]
[null,null,null,"Orla Santana (2)","ORSE - 06/2023 - Sergipe\n",null,"0,0%",null,"Desonerado: \nHorista: 83,16%\nMensalista: 45,11%"]
["Orçamento Sintético"]
["Item","Código","Banco","Descrição","Und","Quant.","Valor Unit"]
[" 1 ",13008,"ORSE","Guarda-corpo tubo ferro galvanizado, alt=0,70m, com barras verticais  de 1.1/2\" a cada 2,0m e barras horizontais inferior, intermediária e superior de 1.1/2\" m","m",1,171.94]
[" 2 ",3705,"ORSE","Disjuntor tripolar 175 A, padrão DIN (  linha branca ), corrente de interrupção 22KA, ref.: Siemens QLH3 ou similar. un","un",1,380]
[" 3 ",4105,"ORSE","Flange 100 x 100mm para eletrocalha metálica (ref. Mopa ou similar) un","un",1,12.5]
[" 4 ",4419,"ORSE","Arruela lisa de 5/16\" un","un",1,0.1]
[" 4 ",8347,"ORSE","Arruela lisa zincada ø 1/4\" un","un",1,0.05]
[" 5 ",11348,"ORSE","Abraçadeira tipo U, d=1\",  p/ eletrodutos un","un",1,0.7]
[" 5 ",295,"ORSE","Abraçadeira tipo U, d=26mm (3/4\") c/ fixações,  p/ tubo galvanizado un","un",1,0.55000000000000004]
[" 6 ",857,"ORSE","Eletrocalha metálica perfurada  50 x 50 x 3000 mm (ref. valemam ou similar) Eletrocalha metálica perfurada  50 x 50 x 300 mm (ref. valemam ou similar) un","un",1,48]
[" 7 ",12668,"ORSE","Cruzeta 100 x 100 mm para eletrocalha perfurada metálica (ref.: mopa ou similar) un","un",1,82.17]
[" 8 ",3633,"ORSE","Eletrocalha metálica perfurada 100 x 100 x 3000mm, peso, 2,20Kg/m,  (ref.: mopa ou similar) un","un",1,89.9]
[" 9 ",4105,"ORSE","Flange 100 x 100mm para eletrocalha metálica (ref. Mopa ou similar) un","un",1,12.5]
[" 10 ",462,"ORSE","Caixa d'agua fibra vidro  3.000 litros - Fortlev-Torres (ou similar) un","un",1,1175.9000000000001]
[" 11 ",13369,"ORSE","Caixa metálica com tomada 10A 250V para perfilado e fixação un","un",1,5.9]
[" 12 ",13318,"ORSE","Suporte vertical 150 x 150 mm para fixação de eletrocalha metálica (ref.: mopa ou similar) un","un",1,16.13]
[" 13 ",13318,"ORSE","Suporte vertical 150 x 150 mm para fixação de eletrocalha metálica (ref.: mopa ou similar) un","un",1,16.13]
[" 14 ",13389,"ORSE","Tampa de encaixe 75mm para Tê de descida lateral, zincada, para eletrocalha metálica (ref.: mopa ou similar) un","un",1,11.27]
{"$rows_left_out":18}
{"sheet":"Insumo SINAPI (sem des.)","index":11,"n_rows":0,"n_cols":0,"rows_kept":0,"cut":false,"hidden":false,"merged":[]}

{"sheet":"CPU (sem des)","index":12,"n_rows":0,"n_cols":0,"rows_kept":0,"cut":false,"hidden":false,"merged":[]}

{"sheet":"CPU Própria (sem des)","index":13,"n_rows":0,"n_cols":0,"rows_kept":0,"cut":false,"hidden":false,"merged":[]}

{"sheet":"Insumos ORSE (sem des)","index":14,"n_rows":0,"n_cols":0,"rows_kept":0,"cut":false,"hidden":false,"merged":[]}

{"sheet":"Cotação Playground","index":15,"n_rows":0,"n_cols":0,"rows_kept":0,"cut":false,"hidden":false,"merged":[]}

{"sheet":"Cotação Estaca","index":16,"n_rows":0,"n_cols":0,"rows_kept":0,"cut":false,"hidden":false,"merged":[]}