{"text_format":"2","workbook":"xlsx","n_sheets":3,"sheets":["ADVERTÊNCIA","preços","Classes e CVs de referência"],"not_rendered":{"charts":0,"images":1,"macros":0,"external_links":0,"defined_names":315,"comments":1,"pivot_tables":0},"unopened":[],"bounds":{"document_bytes":16777216,"sheet_cells":100000,"run_cost":"one","rows_first":2000,"rows_last":500,"rows_between":2000,"halvings":0,"cell_chars":16384,"cell_head_chars":4096},"cells_cut":0,"cells_raw":0,"read":"whole","date_system":"1900"}

{"sheet":"ADVERTÊNCIA","index":0,"n_rows":3,"n_cols":1,"rows_kept":3,"cut":false,"hidden":false,"merged":[]}
["Esta planilha foi elaborada visando melhorar a transparência dos processos da Codevasf. Ela possui caráter unicamente sugestivo."]
[]
["O uso desta planilha é responsabilidade do analista que estiver pesquisando preços."]

{"sheet":"preços","index":1,"n_rows":50,"n_cols":20,"rows_kept":50,"cut":false,"hidden":false,"merged":[[0,2,0,4],[1,2,1,4],[2,2,2,4],[3,2,3,4],[27,2,27,15],[26,1,26,9],[26,11,26,14],[5,2,5,15],[6,1,6,10],[6,11,6,15],[23,1,23,9],[23,11,23,14],[23,16,23,18],[26,16,26,18],[24,1,24,9],[24,11,24,14],[24,16,24,18],[25,1,25,9],[25,11,25,14],[25,16,25,18],[6,16,6,19],[30,15,30,19],[27,16,27,18],[21,16,21,18],[22,16,22,18]]}
[null,"Processo","59500.000895/2023-99"]
[null,"Responsável","AA/GSA/USA"]
[null,"Órgão","Codevasf"]
[null,"Data","2023-04-19"]
[]
[null,"ITEM:","Seguro Veicular - ",{"$nulls":13},"UNIDADE DE MEDIDA:",null,"CLASSE:"]
[null,"LICITAÇÕES ANTERIORES",{"$nulls":9},"SISTEMAS DE REFERÊNCIA",{"$nulls":4},"COTAÇÕES DE MERCADO"]
[null,"Órgão","Edital/Ano - Nº do Lote / Item","Data","Valor Unitário","índice de atualização (nome)","I0 ","I1 - JUNHO 2022","Variação acumulada do índice (%)","Valor unitário aualizado","Utilizar?  (Sim/Não)","Base","Código","Data","Valor Unitário","Utilizar? (Sim/Não)","Empresa","Data","Valor Unitário","Utilizar? (Sim/Não)"]
[null,"Tribunal Regional do Trabalho da 7ª Região","04/2023","2023-02-27",55867.39,null,1,1,{"$f":"(H9-G9)/G9","v":0},{"$f":"(1+(H9-G9)/G9)*E9","v":55867.39},{"$f":"IF(ISNUMBER(J9),\"Sim\",\"\")","v":"Sim"},{"$nulls":4},{"$f":"IF(ISNUMBER(O9),\"Sim\",\"\")","v":""},"Porto Seguro",null,42653.42,{"$f":"IF(ISBLANK(S9),\"\",IFERROR(INDEX($P33:$T33,1,MATCH(MIN($P$50:$T$50),$P$50:$T$50,0)),\"Sim\"))","v":"Sim"}]
[null,"Tribunal Regional Eleitoral de Mato Grosso do Sul","10/2023","2023-03-10",80588.179999999993,null,1,1,{"$f":"(H10-G10)/G10","v":0},{"$f":"(1+(H10-G10)/G10)*E10","v":80588.179999999993},{"$f":"IF(ISNUMBER(J10),\"Sim\",\"\")","v":"Sim"},{"$nulls":4},{"$f":"IF(ISNUMBER(O10),\"Sim\",\"\")","v":""},"Gente Seguradora",null,65087.12,{"$f":"IF(ISBLANK(S10),\"\",IFERROR(INDEX($P34:$T34,1,MATCH(MIN($P$50:$T$50),$P$50:$T$50,0)),\"Sim\"))","v":"Sim"}]
[null,"Universidade Federal de Alfenas/MG","10/2023","2023-03-02",62160,null,1,1,0,62160,"Sim",{"$nulls":4},{"$f":"IF(ISNUMBER(O11),\"Sim\",\"\")","v":""},"Mapfre Seguradora",null,42821.27,{"$f":"IF(ISBLANK(S11),\"\",IFERROR(INDEX($P35:$T35,1,MATCH(MIN($P$50:$T$50),$P$50:$T$50,0)),\"Sim\"))","v":"Sim"}]
[{"$nulls":15},{"$f":"IF(ISNUMBER(O12),\"Sim\",\"\")","v":""}]
{"$rows_empty":8}
[{"$nulls":10},{"$f":"IF(ISNUMBER(J21),\"Sim\",\"\")","v":""},{"$nulls":4},{"$f":"IF(ISNUMBER(O21),\"Sim\",\"\")","v":""},null,null,null,{"$f":"IF(ISBLANK(S21),\"\",IFERROR(INDEX($P45:$T45,1,MATCH(MIN($P50:$T50),$P50:$T50,0)),\"Sim\"))","v":""}]
[{"$nulls":10},"",{"$nulls":4},{"$f":"IF(ISNUMBER(O22),\"Sim\",\"\")","v":""},"Grupo",null,null,{"$f":"IF(COUNTIF(T9:T21,\"Sim\")<3,\"N/D (são necessários pelo menos 3 preços)\",IFERROR(INDEX(P32:T32,1,MATCH(T26,P50:T50,0)),\"Seleção específica de preços\"))","v":"Todos"}]
[{"$nulls":10},"",{"$nulls":4},{"$f":"IF(ISNUMBER(O23),\"Sim\",\"\")","v":""},"Média:",null,null,{"$f":"IF(COUNTIF(T9:T21,\"Sim\")<3,\"N/D (são necessários pelo menos 3 preços)\",AVERAGE(IF(T9:T21=\"Sim\",S9:S21)))","v":50187.27}]
[null,"Média:",{"$nulls":8},{"$f":"IFERROR(AVERAGE(IF(K9:K23=\"Sim\",J9:J23)),\"\")","v":66205.19},"Média:",null,null,null,{"$f":"IFERROR(AVERAGE(IF(P9:P23=\"Sim\",O9:O23)),\"\")","v":""},"Mediana:",null,null,{"$f":"IF(COUNTIF(T9:T21,\"Sim\")<3,\"N/D (são necessários pelo menos 3 preços)\",MEDIAN(IF(T9:T21=\"Sim\",S9:S21)))","v":42821.27}]
[null,"Mediana:",{"$nulls":8},{"$f":"IFERROR(MEDIAN(IF(K9:K23=\"Sim\",J9:J23)),\"\")","v":62160},"Mediana:",null,null,null,{"$f":"IFERROR(MEDIAN(IF(P9:P23=\"Sim\",O9:O23)),\"\")","v":""},"Menor valor:",null,null,{"$f":"MIN(S9:S21)","v":42653.42}]
[null,"Menor valor:",{"$nulls":8},{"$f":"MIN(J9:J23)","v":55867.39},"Menor valor:",null,null,null,{"$f":"MIN(O9:O23)","v":0},"CV:",{"$f":"IFERROR(DSTDEVP(Q8:T20,3,P32:T33),\"\")","v":""},null,{"$f":"IF(COUNTIF(T9:T21,\"Sim\")<3,\"N/D (são necessários pelo menos 3 preços)\",_xlfn.STDEV.S(IF(T9:T21=\"Sim\",S9:S21))/AVERAGE(IF(T9:T21=\"Sim\",S9:S21)))","v":0.25711543052085378}]
[null,"VALOR REFERENCIAL DE LICITAÇÕES:",{"$nulls":8},{"$f":"MIN(K24:K25)","v":62160},"VALOR REFERENCIAL DE SISTEMAS OFICIAIS:",null,null,null,{"$f":"MIN(P24:P25)","v":0},"VALOR REFERENCIAL DE COTAÇÕES:",null,null,{"$f":"MIN(T23:T24)","v":42821.27}]
[null,"OBSERVAÇÕES:",{"$nulls":14},"VALOR UNITÁRIO ESTIMADO DO ITEM:",null,null,{"$f":"IFERROR(AVERAGEIF(K27:T27,\"<>0\"),\"\")","v":52490.634999999995}]
[]
[]
[{"$nulls":15},"Grupos de referência"]
[{"$nulls":15},"Todos","Sem o maior","Sem o menor","Sem o maior e sem o menor","Sem os dois maiores"]
[{"$nulls":15},{"$f":"IF(ISNUMBER(S9),\"Sim\",\"\")","v":"Sim"},{"$f":"IF(ISNUMBER(S9),IF(_xlfn.RANK.EQ(S9,$S9:$S22)=1,\"Não\",\"Sim\"),\"\")","v":"Sim"},{"$f":"IF(ISNUMBER(S9),IF(_xlfn.RANK.EQ(S9,$S9:$S22)=COUNT($S9:$S22),\"Não\",\"Sim\"),\"\")","v":"Não"},{"$f":"IF(Q33=\"\",\"\",IF(AND(Q33=\"Sim\",R33=\"Sim\"),\"Sim\",\"Não\"))","v":"Não"},{"$f":"IF(ISNUMBER(S9),IF(_xlfn.RANK.EQ(S9,$S9:$S22)<=2,\"Não\",\"Sim\"),\"\")","v":"Sim"}]
[{"$nulls":15},"Sim",{"$f":"IF(ISNUMBER(S10),IF(_xlfn.RANK.EQ(S10,$S10:$S23)=1,\"Não\",\"Sim\"),\"\")","v":"Não"},{"$f":"IF(ISNUMBER(S10),IF(_xlfn.RANK.EQ(S10,$S9:$S23)=COUNT($S9:$S23),\"Não\",\"Sim\"),\"\")","v":"Sim"},{"$f":"IF(Q34=\"\",\"\",IF(AND(Q34=\"Sim\",R34=\"Sim\"),\"Sim\",\"Não\"))","v":"Não"},{"$f":"IF(ISNUMBER(S10),IF(_xlfn.RANK.EQ(S10,$S10:$S23)<=2,\"Não\",\"Sim\"),\"\")","v":"Não"}]
[{"$nulls":15},"Sim",{"$f":"IF(ISNUMBER(S11),IF(_xlfn.RANK.EQ(S11,$S9:$S24)=1,\"Não\",\"Sim\"),\"\")","v":"Sim"},{"$f":"IF(ISNUMBER(S11),IF(_xlfn.RANK.EQ(S11,$S9:$S24)=COUNT($S9:$S24),\"Não\",\"Sim\"),\"\")","v":"Sim"},{"$f":"IF(Q35=\"\",\"\",IF(AND(Q35=\"Sim\",R35=\"Sim\"),\"Sim\",\"Não\"))","v":"Sim"},{"$f":"IF(ISNUMBER(S11),IF(_xlfn.RANK.EQ(S11,$S9:$S22)<=2,\"Não\",\"Sim\"),\"\")","v":"Não"}]
[{"$nulls":15},"",{"$f":"IF(ISNUMBER(S12),IF(_xlfn.RANK.EQ(S12,$S9:$S25)=1,\"Não\",\"Sim\"),\"\")","v":""},{"$f":"IF(ISNUMBER(S12),IF(_xlfn.RANK.EQ(S12,$S12:$S25)=COUNT($S9:$S25),\"Não\",\"Sim\"),\"\")","v":""},{"$f":"IF(Q36=\"\",\"\",IF(AND(Q36=\"Sim\",R36=\"Sim\"),\"Sim\",\"Não\"))","v":""},{"$f":"IF(ISNUMBER(S12),IF(_xlfn.RANK.EQ(S12,$S8:$S25)<=2,\"Não\",\"Sim\"),\"\")","v":""}]
[{"$nulls":15},"",{"$f":"IF(ISNUMBER(S13),IF(_xlfn.RANK.EQ(S13,$S10:$S26)=1,\"Não\",\"Sim\"),\"\")","v":""},{"$f":"IF(ISNUMBER(S13),IF(_xlfn.RANK.EQ(S13,$S13:$S26)=COUNT($S9:$S26),\"Não\",\"Sim\"),\"\")","v":""},{"$f":"IF(Q37=\"\",\"\",IF(AND(Q37=\"Sim\",R37=\"Sim\"),\"Sim\",\"Não\"))","v":""},{"$f":"IF(ISNUMBER(S13),IF(_xlfn.RANK.EQ(S13,$S9:$S26)<=2,\"Não\",\"Sim\"),\"\")","v":""}]
[{"$nulls":15},"",{"$f":"IF(ISNUMBER(S14),IF(_xlfn.RANK.EQ(S14,$S11:$S27)=1,\"Não\",\"Sim\"),\"\")","v":""},{"$f":"IF(ISNUMBER(S14),IF(_xlfn.RANK.EQ(S14,$S14:$S27)=COUNT($S10:$S27),\"Não\",\"Sim\"),\"\")","v":""},{"$f":"IF(Q38=\"\",\"\",IF(AND(Q38=\"Sim\",R38=\"Sim\"),\"Sim\",\"Não\"))","v":""},{"$f":"IF(ISNUMBER(S14),IF(_xlfn.RANK.EQ(S14,$S10:$S27)<=2,\"Não\",\"Sim\"),\"\")","v":""}]
[{"$nulls":15},"",{"$f":"IF(ISNUMBER(S15),IF(_xlfn.RANK.EQ(S15,$S12:$S28)=1,\"Não\",\"Sim\"),\"\")","v":""},{"$f":"IF(ISNUMBER(S15),IF(_xlfn.RANK.EQ(S15,$S15:$S28)=COUNT($S11:$S28),\"Não\",\"Sim\"),\"\")","v":""},"",{"$f":"IF(ISNUMBER(S15),IF(_xlfn.RANK.EQ(S15,$S11:$S28)<=2,\"Não\",\"Sim\"),\"\")","v":""}]
[{"$nulls":15},"",{"$f":"IF(ISNUMBER(S16),IF(_xlfn.RANK.EQ(S16,$S9:$S29)=1,\"Não\",\"Sim\"),\"\")","v":""},{"$f":"IF(ISNUMBER(S16),IF(_xlfn.RANK.EQ(S16,$S16:$S29)=COUNT($S9:$S29),\"Não\",\"Sim\"),\"\")","v":""},"",{"$f":"IF(ISNUMBER(S16),IF(_xlfn.RANK.EQ(S16,$S12:$S29)<=2,\"Não\",\"Sim\"),\"\")","v":""}]
[{"$nulls":15},"",{"$f":"IF(ISNUMBER(S17),IF(_xlfn.RANK.EQ(S17,$S9:$S29)=1,\"Não\",\"Sim\"),\"\")","v":""},{"$f":"IF(ISNUMBER(S17),IF(_xlfn.RANK.EQ(S17,$S17:$S29)=COUNT($S13:$S29),\"Não\",\"Sim\"),\"\")","v":""},"",{"$f":"IF(ISNUMBER(S17),IF(_xlfn.RANK.EQ(S17,$S13:$S29)<=2,\"Não\",\"Sim\"),\"\")","v":""}]
[{"$nulls":15},"",{"$f":"IF(ISNUMBER(S18),IF(_xlfn.RANK.EQ(S18,$S9:$S29)=1,\"Não\",\"Sim\"),\"\")","v":""},{"$f":"IF(ISNUMBER(S18),IF(_xlfn.RANK.EQ(S18,$S18:$S29)=COUNT($S9:$S29),\"Não\",\"Sim\"),\"\")","v":""},"",{"$f":"IF(ISNUMBER(S18),IF(_xlfn.RANK.EQ(S18,$S14:$S29)<=2,\"Não\",\"Sim\"),\"\")","v":""}]
[{"$nulls":15},"",{"$f":"IF(ISNUMBER(S19),IF(_xlfn.RANK.EQ(S19,$S9:$S30)=1,\"Não\",\"Sim\"),\"\")","v":""},{"$f":"IF(ISNUMBER(S19),IF(_xlfn.RANK.EQ(S19,$S19:$S30)=COUNT($S9:$S30),\"Não\",\"Sim\"),\"\")","v":""},"",{"$f":"IF(ISNUMBER(S19),IF(_xlfn.RANK.EQ(S19,$S15:$S30)<=2,\"Não\",\"Sim\"),\"\")","v":""}]
[]
[{"$nulls":15},{"$f":"IF(ISNUMBER(S21),\"Sim\",\"\")","v":""},{"$f":"IF(ISNUMBER(S21),IF(_xlfn.RANK.EQ(S21,$S9:$S22)=1,\"Não\",\"Sim\"),\"\")","v":""},{"$f":"IF(ISNUMBER(S21),IF(_xlfn.RANK.EQ(S21,$S9:$S22)=COUNT($S9:$S22),\"Não\",\"Sim\"),\"\")","v":""},{"$f":"IF(Q45=\"\",\"\",IF(AND(Q45=\"Sim\",R45=\"Sim\"),\"Sim\",\"Não\"))","v":""},{"$f":"IF(ISNUMBER(S21),IF(_xlfn.RANK.EQ(S21,$S9:$S22)<=2,\"Não\",\"Sim\"),\"\")","v":""}]
[]
[{"$nulls":14},"Média",{"$f":"IF(COUNTIF(P33:P46,\"Sim\")<3,\"N/D (são necessários pelo menos 3 preços)\",AVERAGE(IF(P33:P46=\"Sim\",$S9:$S22)))","v":50187.27},{"$f":"IF(COUNTIF(Q33:Q46,\"Sim\")<3,\"N/D (são necessários pelo menos 3 preços)\",AVERAGE(IF(Q33:Q46=\"Sim\",$S9:$S22)))","v":"N/D (são necessários pelo menos 3 preços)"},{"$f":"IF(COUNTIF(R33:R46,\"Sim\")<3,\"N/D (são necessários pelo menos 3 preços)\",AVERAGE(IF(R33:R46=\"Sim\",$S9:$S22)))","v":"N/D (são necessários pelo menos 3 preços)"},{"$f":"IF(COUNTIF(S33:S46,\"Sim\")<3,\"N/D (são necessários pelo menos 3 preços)\",AVERAGE(IF(S33:S46=\"Sim\",$S9:$S22)))","v":"N/D (são necessários pelo menos 3 preços)"},{"$f":"IF(COUNTIF(T33:T46,\"Sim\")<3,\"N/D (são necessários pelo menos 3 preços)\",AVERAGE(IF(T33:T46=\"Sim\",$S9:$S22)))","v":"N/D (são necessários pelo menos 3 preços)"}]
[{"$nulls":14},"Mediana",{"$f":"IF(COUNTIF(P33:P46,\"Sim\")<3,\"N/D (são necessários pelo menos 3 preços)\",MEDIAN(IF(P33:P46=\"Sim\",$S9:$S22)))","v":42821.27},{"$f":"IF(COUNTIF(Q33:Q46,\"Sim\")<3,\"N/D (são necessários pelo menos 3 preços)\",MEDIAN(IF(Q33:Q46=\"Sim\",$S9:$S22)))","v":"N/D (são necessários pelo menos 3 preços)"},{"$f":"IF(COUNTIF(R33:R46,\"Sim\")<3,\"N/D (são necessários pelo menos 3 preços)\",MEDIAN(IF(R33:R46=\"Sim\",$S9:$S22)))","v":"N/D (são necessários pelo menos 3 preços)"},{"$f":"IF(COUNTIF(S33:S46,\"Sim\")<3,\"N/D (são necessários pelo menos 3 preços)\",MEDIAN(IF(S33:S46=\"Sim\",$S9:$S22)))","v":"N/D (são necessários pelo menos 3 preços)"},{"$f":"IF(COUNTIF(T33:T46,\"Sim\")<3,\"N/D (são necessários pelo menos 3 preços)\",MEDIAN(IF(T33:T46=\"Sim\",$S9:$S22)))","v":"N/D (são necessários pelo menos 3 preços)"}]
[]
[{"$nulls":14},"CV",{"$f":"IF(COUNTIF(P33:P46,\"Sim\")<3,\"N/D (são necessários pelo menos 3 preços)\",_xlfn.STDEV.S(IF(P33:P46=\"Sim\",$S9:$S22))/AVERAGE(IF(P33:P46=\"Sim\",$S9:$S22)))","v":0.25711543052085378},{"$f":"IF(COUNTIF(Q33:Q46,\"Sim\")<3,\"N/D (são necessários pelo menos 3 preços)\",_xlfn.STDEV.S(IF(Q33:Q46=\"Sim\",$S9:$S22))/AVERAGE(IF(Q33:Q46=\"Sim\",$S9:$S22)))","v":"N/D (são necessários pelo menos 3 preços)"},{"$f":"IF(COUNTIF(R33:R46,\"Sim\")<3,\"N/D (são necessários pelo menos 3 preços)\",_xlfn.STDEV.S(IF(R33:R46=\"Sim\",$S9:$S22))/AVERAGE(IF(R33:R46=\"Sim\",$S9:$S22)))","v":"N/D (são necessários pelo menos 3 preços)"},{"$f":"IF(COUNTIF(S33:S46,\"Sim\")<3,\"N/D (são necessários pelo menos 3 preços)\",_xlfn.STDEV.S(IF(S33:S46=\"Sim\",$S9:$S22))/AVERAGE(IF(S33:S46=\"Sim\",$S9:$S22)))","v":"N/D (são necessários pelo menos 3 preços)"},{"$f":"IF(COUNTIF(T33:T46,\"Sim\")<3,\"N/D (são necessários pelo menos 3 preços)\",_xlfn.STDEV.S(IF(T33:T46=\"Sim\",$S9:$S22))/AVERAGE(IF(T33:T46=\"Sim\",$S9:$S22)))","v":"N/D (são necessários pelo menos 3 preços)"}]

{"sheet":"Classes e CVs de referência","index":2,"n_rows":0,"n_cols":0,"rows_kept":0,"cut":false,"hidden":false,"merged":[]}